{"text_format":"1","workbook":"xlsx","n_sheets":51,"sheets":["Start","Vorlage","Vorlage_","Motivation","Zufallszahlen","Zufallszahlen_","01 SVERWEIS (1, A)","01 SVERWEIS (1, A)_","02 WVERWEIS (1, A)","02 WVERWEIS (1, A)_","03 Bild","03 Bild_","04 SVERWEIS (2, A)","04 SVERWEIS (2, A)_","05 Funktionsassistent (1)","05 Funktionsassistent (1)_","06 WVERWEIS (2, A)","06 WVERWEIS (2, A)_","061 VERWEIS","062 XVERWEIS (A)","063 SKVERWEIS","07 Tariftabelle (1)","08 S-W-VERWEIS (A)","08 S-W-VERWEIS (A)_","08 Tariftabelle (2)","09 Funktionsassistent (2)","09 Funktionsassistent (2)_","10 Lohnberechnung (A)","10 Lohnberechnung (A)_","10 Lohntabelle (A)","11 Umschlag (A)","11 Umschlag (A)_","11 Umschlag (L1)_","12 Tarifanalyse (A1)","12 Tarifanalyse (A1)_","13 Bevor Sie weitermachen … (1)","14 Tarifanalyse (A2)","14 Tarifanalyse (A2)_","14 Tarifanalyse (L2)_","15 Bevor Sie weitermachen … (2)","16 Rechnung (A)","16 Rechnung (A)_","16 Firmen","16 Waren","17 Wert in Liste","17 Wert in Liste_","18 Wert nicht in Liste","18 Wert nicht in Liste_","19 Containerlisten (A)","19 Containerlisten (A)_","20 Intervallsuche"],"not_rendered":{"charts":0,"images":26,"macros":1,"external_links":0,"defined_names":6,"comments":0,"pivot_tables":0},"unopened":[],"bounds":{"document_bytes":16777216,"sheet_cells":100000,"rows_first":2000,"rows_last":500,"rows_between":2000,"halvings":0,"cell_chars":16384,"cell_head_chars":4096},"cells_cut":0,"cells_raw":0,"read":"whole","date_system":"1900"}

{"sheet":"Start","index":0,"n_rows":36,"n_cols":9,"rows_kept":36,"cut":false,"hidden":false,"merged":[[1,1,1,4],[2,1,2,4],[5,5,33,5],[5,6,33,6]]}
[null,null,null,null,null,1,2,null,0]
[1,"Start"]
[2,"Start"]
[]
[0,null,null,2,0]
[null,null,"Start",null,null,"For many basic Excel techniques, which are used here in this file, there are detailed explanations in the file \"Excel-Basics\".\n\nTherefore - if here in this file it is said \"Do this … and that …\" and you don't know how to do it - please have a look into the file \"Excel-Basics\". Hopefully you will find the needed explanations there. \n\nIf not - send me a short notice to stern@jade-hs.de!\n\nBefore you start working with this file you should definitely work through the two sheets \"How to make notes\" and \"Help ...\" in the file \"Excel-Basics\"!\n\nIf the buttons for language switching don't work, please click the following:\n\nFile / Options / Trust Center / Trust Center Settings / Macro Settings / Enable All Macros \n\nThen close and re-open this file again.","Zu vielen grundlegenen Excel-Techniken, die hier in dieser Datei benutzt werden, gibt es detaillierte Erläuterungen in der Datei \"Excel-Basics\".\n\nWenn es daher in dieser Datei heißt \"Machen Sie dieses … und jenes …\" und Sie wissen nicht wie - sehen Sie bitte in der Datei \"Excel-Basics\" nach. Hoffentlich finden Sie dort die benötigten Erklärungen.\n\nWenn nicht - schicken Sie mir bitte einen Hinweis an stern@jade-hs.de!\n\nBevor Sie beginnen, mit dieser Datei zu arbeiten, sollten Sie aber auf jeden Fall zuerst die beiden Blätter \"Notizen machen\" und \"Hilfe ...\" in der Datei \"Excel-Basics\" durchgearbeitet haben!\n\nWenn die Buttons zur Sprachumschaltung nicht funktionieren, klicken Sie bitte folgendes an:\n\nDatei / Optionen / Trust-Center / Einstellungen für das Trust-Center / Makroeinstellungen / Alle Makros aktivieren\n\nDann diese Datei schließen und erneut öffnen."]
[null,null,"Vorlage"]
[null,null,"Motivation"]
[null,null,"Zufallszahlen",null,1525.5]
[null,null,"01 SVERWEIS (1, A)",null,57]
[null,null,"02 WVERWEIS (1, A)",null,0]
[null,null,"03 Bild"]
[null,null,"04 SVERWEIS (2, A)"]
[null,null,"05 Funktionsassistent (1)"]
[null,null,"06 WVERWEIS (2, A)"]
[null,null,"061 VERWEIS"]
[null,null,"062 XVERWEIS (A)"]
[null,null,"063 SKVERWEIS"]
[null,null,"07 Tariftabelle (1)"]
[null,null,"08 S-W-VERWEIS (A)"]
[null,null,"08 Tariftabelle (2)"]
[null,null,"09 Funktionsassistent (2)"]
[null,null,"10 Lohnberechnung (A)"]
[null,null,"10 Lohntabelle (A)"]
[null,null,"11 Umschlag (A)"]
[null,null,"12 Tarifanalyse (A1)"]
[null,null,"13 Bevor Sie weitermachen … (1)"]
[null,null,"14 Tarifanalyse (A2)"]
[null,null,"15 Bevor Sie weitermachen … (2)"]
[null,null,"16 Rechnung (A)"]
[null,null,"16 Firmen"]
[null,null,"16 Waren"]
[null,null,"17 Wert in Liste"]
[null,null,"18 Wert nicht in Liste"]
[null,null,"19 Containerlisten (A)"]
[null,null,"20 Intervallsuche"]

{"sheet":"Vorlage","index":1,"n_rows":10,"n_cols":6,"rows_kept":10,"cut":false,"hidden":false,"merged":[[1,1,1,4],[2,1,2,4]]}
[null,null,null,null,null,0]
[1,"Template",null,null,null,"Back to Start"]
[2,"Vorlage",null,null,null,"Startseite"]
[]
[]
[]
[]
[]
[]
[0]

{"sheet":"Vorlage_","index":2,"n_rows":7,"n_cols":8,"rows_kept":7,"cut":false,"hidden":true,"merged":[]}
[null,2,2,2,1,1,1,0]
[1,"Template_",null,null,null,{"$f":"B2","v":"Template_"}]
[2,"Vorlage_"]
[0]
[null,1,"In meinen Übungsdateien können Sie nicht wie üblich durch Klick auf das Pluszeichen ein neues Arbeitsblatt anlegen. \n\nWenn Sie ein neues Blatt brauchen, müssen Sie eine Kopie des Blattes \"Vorlage\" anlegen.\n\nACHTUNG: Denken Sie daran, die Option \"Kopie erstellen\" zu aktivieren!\n\n\n\n",null,1,"In my exercise files you cannot create a new worksheet by clicking on the plus sign as usual. \n\nIf you need a new sheet, you have to create a copy of the sheet \"Template\".\n\nATTENTION: Please remember to activate the option \"Create copy\"!\n\n\n"]
[null,{"$f":"IF(C6<>\"\",B5+1,\"\")","v":2},"Nachdem Sie eine Kopie dieses Blattes angelegt haben, ändern Sie dessen Namen NICHT wie üblich unten auf dem Register.\n\nStattdessen schreiben Sie den Blattnamen in die Zelle B3 des kopierten Blattes.\n\nAnschließend wechseln Sie auf das \"Start\"-Blatt und klicken dort erneut auf den Sprachbutton. \n\nDann müssen Sie evtl. etwas Geduld haben, weil Excel alle Blätter - auch die ausgeblendeten mit den Videotexten - durchgeht, um sie in's Inhaltsverzeichnis aufzunehmen.\n\nDer neue Name erscheint dann in der Liste der Blätter auf dem \"Start\"-Blatt und auf dem Register des kopierten Blattes.",null,{"$f":"IF(F6<>\"\",E5+1,\"\")","v":2},"After you have created a copy of this sheet, DO NOT change its name as usual at the bottom of the tab.\n\nInstead, write the sheet name in cell B2 of the copied sheet.\n\nThen switch to the \"Start\" page and click on the language button again. \n\nThen you may have to have some patience, because Excel goes through all sheets - even the hidden ones with the video texts - to include them into the table of contents.\n\nThe new name then appears in the list of sheets on the \"Start\" sheet and on the tab of the copied sheet."]
[null,{"$f":"IF(C7<>\"\",B6+1,\"\")","v":""},null,null,{"$f":"IF(F7<>\"\",E6+1,\"\")","v":""}]

{"sheet":"Motivation","index":3,"n_rows":20,"n_cols":14,"rows_kept":20,"cut":false,"hidden":false,"merged":[[1,1,1,4],[2,1,2,4],[15,13,15,16],[16,13,16,16],[19,13,19,16],[5,2,5,7],[6,2,6,7]]}
[null,null,null,null,null,null,null,null,null,null,null,0]
[1,"Motivation",null,null,null,"Back to Start"]
[2,"Motivation",null,null,null,"Startseite"]
[]
[]
[1,null,"Employment notice in a German newspaper:"]
[2,null,"Stellenanzeige in einer Tageszeitung:"]
[]
[]
[0]
[]
[]
[]
[]
[]
[null,null,null,null,null,null,null,null,null,null,null,null,null,"\"Good Excel skills (preferably skills"]
[null,null,null,null,null,null,null,null,null,null,null,null,null,"in the application of VLOOKUP)\""]
[]
[]
[null,null,null,null,null,null,null,null,null,null,null,null,null,"S-Verweis = SVERWEIS() = VLOOKUP()"]

{"sheet":"Zufallszahlen","index":4,"n_rows":42,"n_cols":10,"rows_kept":42,"cut":false,"hidden":false,"merged":[[40,2,40,8],[1,1,1,4],[2,1,2,4],[39,2,39,8],[4,2,8,9],[9,2,12,9]]}
[null,null,null,null,null,null,null,null,null,0]
[1,"Random numbers",null,null,null,"Back to Start"]
[2,"Zufallszahlen",null,null,null,"Startseite"]
[]
[2,"Achtung","Wenn Sie nach dem Drücken von Strg-Umschalt-N eine Fehlermeldung bekommen, müssen Sie zunächst die Makros aktivieren:\n\n\"Datei / Optionen / Trust Center / Einstellungen für das Trust Center / Makroeinstellungen / Alle Makros aktivieren / OK / OK\""]
[2]
[2]
[2]
[2]
[1,"Attention","If you see an error message after pressing Ctrl-Shift-N you have to activate the macros first:\n\n\"File / Options / Trust Center / Trust Center Settings / Macro Settings / Enable all macros / OK / OK\""]
[1]
[1]
[1]
[]
[]
[]
[]
[]
[]
[]
[]
[]
[]
[]
[]
[]
[]
[]
[]
[]
[]
[]
[]
[]
[]
[]
[]
[]
[]
[1,"Exercise","Try it!"]
[2,"Übung","Probieren Sie es aus!"]
[0]

{"sheet":"Zufallszahlen_","index":5,"n_rows":7,"n_cols":8,"rows_kept":7,"cut":false,"hidden":true,"merged":[]}
[null,2,2,2,1,1,1,0]
[1,"Random numbers_",null,null,null,{"$f":"B2","v":"Random numbers_"}]
[2,"Zufallszahlen_"]
[0]
[null,1,"Diese Excel-Datei enthält ein Formular zur Generierung von Zufallszahlen.\n\nSie können es mit der Tastenkombination Strg-Umschalt-N öffnen.\n\nDann können Sie es benutzen, um sich schnell beliebige Mengen von Übungsdaten zu generieren!",null,1,"This Excel file contains a form for the generation of random numbers.\n\nYou can open it with the shortcut Ctrl-Shift-N.\n\nThen you can use it to generate very quickly any number of trial data!"]
[null,{"$f":"IF(C6<>\"\",B5+1,\"\")","v":2},"Dazu müssen Sie zuerst einen Bereich markieren, der mit Zufallszahlen gefüllt werden soll. Dieser Bereich kann auch aus mehreren nicht zusammenhängenden Teilbereichen bestehen! (markieren mit gedrückter Strg-Taste)\n\nDann geben Sie die Parameter für die Generierung der Zufallszahlen ein und drücken \"Bereich(e) füllen\".\n\nSie können auswählen, ob\n- ein Teil der Zellen leer bleiben soll,\n- ein Teil der Zahlen negativ sein soll,\n- nur ganze Zahlen generiert werden sollen.\n\nMit dem Button \"Bereich(e) leeren\" können Sie … ok … das muss ich wohl nicht beschreiben.",null,{"$f":"IF(F6<>\"\",E5+1,\"\")","v":2},"To do this, you must first select a range to be filled with random numbers. This range can also consist of several non-contiguous sub ranges! (selected with pressed Ctrl key)\n\nThen enter the parameters for the generation of the random numbers and press \"Fill range(s)\".\n\nYou can choose whether\n- some of the cells should remain empty,\n- some of the numbers should be negative,\n- only integer numbers should be generated.\n\nWith the button \"Clear range(s)\" you can ... ok ... I don't have to describe that.\n\n"]
[null,{"$f":"IF(C7<>\"\",B6+1,\"\")","v":""},null,null,{"$f":"IF(F7<>\"\",E6+1,\"\")","v":""}]

{"sheet":"01 SVERWEIS (1, A)","index":6,"n_rows":60,"n_cols":15,"rows_kept":60,"cut":false,"hidden":false,"merged":[[1,1,1,4],[2,1,2,4],[22,2,22,4],[20,2,20,4],[26,2,26,4],[24,2,24,4],[24,10,24,12],[41,2,41,4],[41,10,41,12],[25,2,25,4],[32,2,38,8],[30,2,30,7],[27,2,27,4],[28,2,28,4],[25,9,25,12],[26,9,26,12],[27,9,27,12],[28,9,28,12],[39,2,39,8],[56,2,56,8],[45,2,45,4],[45,9,45,12],[47,2,47,7],[49,2,55,8],[42,2,42,4],[42,9,42,12],[43,2,43,4],[43,9,43,12],[44,2,44,4],[44,9,44,12]]}
[null,null,null,null,null,null,null,0]
[1,"01 VLOOKUP (1, E)",null,null,null,"Back to Start"]
[2,"01 SVERWEIS (1, A)",null,null,null,"Startseite"]
[]
[1,null,"sorted:",null,null,null,null,null,null,null,"unsorted:"]
[2,null,"sortiert:",null,null,null,null,null,null,null,"unsortiert:"]
[1,null,"ZIP code range","price/kg",null,null,null,null,null,null,"ZIP code range","price/kg"]
[2,null,"PLZ-Bereich","Preis/Kg",null,null,null,null,null,null,"PLZ-Bereich","Preis/Kg"]
[null,null,0,0.3,"\"is smaller than 37175\"",null,null,null,null,null,0,0.3]
[null,null,10000,0.2,"\"is smaller than 37175\"",null,null,null,null,null,10000,0.2]
[null,null,20000,0.1,"\"is smaller than 37175\"",null,null,null,null,null,20000,0.1]
[null,null,30000,0.2,"\"is smaller than 37175\"",null,null,null,null,null,30000,0.2]
[null,null,40000,0.3,"\"is larger than 37175\" -> one row above!",null,null,null,null,null,70000,0.6]
[null,null,50000,0.4,null,null,null,null,null,null,50000,0.4]
[null,null,60000,0.5,null,null,null,null,null,null,60000,0.5]
[null,null,70000,0.6,null,null,null,null,null,null,40000,0.3]
[null,null,80000,0.7,null,null,null,null,null,null,80000,0.7]
[null,null,90000,0.8,null,null,null,null,null,null,90000,0.8]
[]
[2,null,"Beispiel:"]
[2,null,"SVERWEIS(37175;C9:D18;2;WAHR) =",null,null,{"$f":"VLOOKUP(37175,C7:D16,2,TRUE)","v":0.2}]
[1,null,"Example:"]
[1,null,"VLOOKUP(37175;C9:D18;2;TRUE) =",null,null,{"$f":"VLOOKUP(37175,C9:D18,2,TRUE)","v":0.2}]
[]
[2,"Übung …","... mit sortierter Liste:",null,null,"erst:\nEingabe von Hand ","dann:\nFormel eingeben",null,null,null,"... mit unsortierter Liste:",null,null,"erst:\nEingabe von Hand ","dann:\nFormel eingeben"]
[2,null,"SVERWEIS(50000;C9:D18;2;FALSCH) =",null,null,"?","?",null,null,"SVERWEIS(50000;K9:L18;2;FALSCH) =",null,null,null,"?","?"]
[2,null,"SVERWEIS(50000;C9:D18;2;WAHR) =",null,null,"?","?",null,null,"SVERWEIS(50000;K9:L18;2;WAHR) =",null,null,null,"?","?"]
[2,null,"SVERWEIS(76543;C9:D18;2;WAHR) =",null,null,"?","?",null,null,"SVERWEIS(76543;K9:L18;2;WAHR) =",null,null,null,"?","?"]
[2,null,"SVERWEIS(76543;C9:D18;2;FALSCH) =",null,null,"?","?",null,null,"SVERWEIS(76543;K9:L18;2;FALSCH) =",null,null,null,"?","?"]
[2]
[2,null,"Mit dem SVERWEIS(a;B:C;d;WAHR/FALSCH) fordern Sie Excel auf:"]
[2]
[2,null,"Suche den Wert a in der ersten Spalte des Bereiches B:C.\nWenn Du den Wert gefunden hast, gehe nach rechts in die d-te Spalte des Bereiches B:C und liefere den Wert zurück, der dort steht.\nDas vierte Funktionsargument kann die Werte WAHR oder FALSCH annehmen. Das bedeutet:\n„FALSCH“: Suche genau nach dem Suchkriterium a!\n„WAHR“: Suche nach dem größten Wert, der kleiner oder gleich dem Suchkriterium a ist."]
[2]
[2]
[2]
[2]
[2]
[2]
[2,"Achtung","Der Bereich B:C muss aufsteigend sortiert sein nach der ersten Spalte!!"]
[]
[1,"Exercise …","... with the sorted list:",null,null,"first:\nenter result  manually ","then:\nenter formula",null,null,null,"... with the unsorted list:",null,null,"first:\nenter result manually ","then:\nenter formula"]
[1,null,"VLOOKUP(50000;C9:D18;2;FALSE) =",null,null,"?","?",null,null,"VLOOKUP(50000;K9:L18;2;FALSE) =",null,null,null,"?","?"]
[1,null,"VLOOKUP(50000;C9:D18;2;TRUE) =",null,null,"?","?",null,null,"VLOOKUP(50000;K9:L18;2;TRUE) =",null,null,null,"?","?"]
[1,null,"VLOOKUP(76543;C9:D18;2;TRUE) =",null,null,"?","?",null,null,"VLOOKUP(76543;K9:L18;2;TRUE) =",null,null,null,"?","?"]
[1,null,"VLOOKUP(76543;C9:D18;2;FALSE) =",null,null,"?","?",null,null,"VLOOKUP(76543;K9:L18;2;FALSE) =",null,null,null,"?","?"]
[1]
[1,null,"With the VLOOKUP(a;B:C;d;TRUE/FALSE) you request Excel:"]
[1]
[1,null,"Look for the value a in the first column of the range B:C.\nIf you have found the value, move to the right into the d'th column of the range B:C and give the value from there as a result.\nThe fourth argument can have the values TRUE or FALSE. That means:\n„FALSE“: Look exactly for the value a!\n„TRUE“: Look for the largest value, which is smaller or equal to a."]
[1]
[1]
[1]
[1]
[1]
[1]
[1,"Attention","The range B:C must be sorted ascendingly according to its first column!!"]
[]
[]
[0]

{"sheet":"01 SVERWEIS (1, A)_","index":7,"n_rows":13,"n_cols":8,"rows_kept":13,"cut":false,"hidden":true,"merged":[]}
[null,2,2,2,1,1,1,0]
[1,"01 VLOOKUP (1, E)_",null,null,null,{"$f":"B2","v":"01 VLOOKUP (1, E)_"}]
[2,"01 SVERWEIS (1, A)_"]
[0]
[null,1,"Der SVERWEIS ist eine komplexe Excel-Formel mit vier Argumenten. Am besten lässt sich an einem Beispiel demonstrieren, was der SVERWEIS macht. \n\nSie sehen hier eine typische Tariftabelle - Transporte in einen bestimmten PLZ-Breich sind unterschiedlich teuer. \n\nMit Hilfe des SVERWEISes kann man nun z.B. herausfinden, was ein Transport in einen Ort mit der PLZ 37175 kostet: 20 Cent pro kg.",null,1,"The VLOOKUP is a complex Excel formula with four arguments. An example is the best way to demonstrate what the SVERWEIS does. \n\nHere you can see a typical charge table - transports to a certain zip code area are differently expensive. \n\nWith the help of the VLOOKUP you can now find out, for example, what a transport to a place with the  zip code 37175 costs: 20 cents per kg."]
[null,{"$f":"IF(C6<>\"\",B5+1,\"\")","v":2},"Die dazugehörige Formel sehen Sie hier. Sie besagt:\n\n\"Suche den Wert 37175 in der ersten Spalte des Bereichs C9:D18. \nWenn er gefunden wurde, gehe nach rechts in die zweite Spalte und \nliefere den Wert zurück, der dort steht.\"",null,{"$f":"IF(F6<>\"\",E5+1,\"\")","v":2},"You can see the corresponding formula here. It says:\n\n\"Find the value 37175 in the first column of the range C9:D18. \nWhen it is found, go right to the second column and \nreturn the value that's there.\""]
[null,{"$f":"IF(C7<>\"\",B6+1,\"\")","v":3},"Die Erklärung des vierten Arguments ist etwas aufwändiger:\n\nDort steht entweder FALSCH oder WAHR. Es ist aber nichts falsch und auch nichts wahr. Es geht hier nur darum, dass für das vierte Argument nur zwei unterschiedliche Werte erlaubt sind. \n\nDafür nimmt man in der Informatik üblicherweise \"0\" und \"1\" oder \"ja\" und \"nein\" oder \"wahr\" und \"falsch\".",null,{"$f":"IF(F7<>\"\",E6+1,\"\")","v":3},"The explanation of the fourth argument is somewhat more elaborate:\n\nIt says either FALSE or TRUE. But there is nothing wrong and nothing true. The only thing that matters here is that only two different values are allowed for the fourth argument. \n\nIn computer science, one usually takes \"0\" and \"1\" or \"yes\" and \"no\" or \"true\" and \"false\" for this."]
[null,4,"FALSCH bedeutet, dass der SVERWEIS genau nach dem ersten Argument (z.B. 37175) suchen soll.\n\nWAHR bedeutet, dass der SVERWEIS nach dem größten Wert suchen soll, der kleiner oder gleich dem ersten Argument ist.",null,4,"FALSE means that the VLOOKUP should search for exactly the first argument (e.g. 37175).\n\nTRUE means that the VLOOKUP should search for the largest value that is less than or equal to the first argument."]
[null,5,"Letzteres ist auf Anhieb vielleicht etwas unverständlich. Sehen Sie sich dazu die Erklärung rechts neben der Tariftabelle an:\n\nExcel vergleicht 37175 mit dem ersten Wert in der ersten Spalte und stellt fest, dass dieser kleiner ist; dasselbe beim zweiten, dritten und vierten Wert. \n\nErst der fünfte Wert ist größer als das Suchkriterium 37175. Also ist der Wert davor der größte der kleiner als 37175 ist. Das ist 30000.",null,5,"The latter is perhaps a little incomprehensible at first sight. Take a look at the explanation to the right of the charge table:\n\nExcel compares 37175 with the first value in the first column and finds that it is smaller; the same with the second, third and fourth value. \n\nOnly the fifth value is larger than the search criterion 37175, so the value before that is the largest one that is smaller than 37175. That is 30,000.\n\n"]
[null,6,"Daher geht Excel in dieser Zeile nach rechts in die zweite Spalte (= drittes Argument des SVERWEISes!) und liefert den Wert 0,20 € als Ergebnis. Voila!",null,6,"Therefore Excel goes right in this row to the second column (= third argument of the VLOOKUP!) and returns the value 0.20 € as result. Voila!"]
[null,7,"Zur Übung machen Sie mal folgendes:\n\nVersuchen Sie, wie Excel zu \"denken\" und schreiben Sie in Spalte F, welches Ergebnis der links daneben stehende SVERWEIS liefern müsste. \n\nDann geben Sie in Spalte G die Formel ein und überprüfen, ob Sie richtig gedacht haben.\nWenn ja, haben Sie verstanden, wie der SVERWEIS arbeitet.",null,7,"For practicing, do the following:\n\nTry to \"think\" like Excel and write in column F what the result of the VLOOKUP to the left should be. \n\nThen enter the formula in column G and check whether you have thought correctly.\nIf you have, you have understood how the VLOOKUP works."]
[null,8,"Eine wichtige Voraussetzung für das korrekte Funktionieren des SVERWEISes habe ich noch nicht erwähnt: \n\nDer Suchbereich (=das zweite Argument) muss nach der ersten Spalte aufsteigend sortiert sein! \n\nZum Beweis dessen sehen Sie sich bitte die Tariftabelle in den Spalten K und L an. Diese ist nicht nach der ersten Spalte sortiert.",null,8,"I have not yet mentioned an important requirement for the correct functioning of the VLOOKUP: \n\nThe search range (=the second argument) must be sorted by the first column in ascending order! \n\nTo prove this, please have a look at the charge table in columns K and L. It is not sorted by the first column."]
[null,9,"Machen Sie jetzt nochmal die gleiche Übung wie mit der sortierten Tabelle:\n\nVersuchen Sie, wie Excel zu \"denken\" und schreiben Sie in Spalte N, welches Ergebnis der links daneben stehende SVERWEIS liefern müsste. \n\nDann geben Sie in Spalte O die Formel ein und überprüfen, ob Sie richtig gedacht haben.\n\nWenn ja, haben Sie wirklich verstanden, wie der SVERWEIS arbeitet.",null,9,"Now do the same exercise again as with the sorted table:\n\nTry to \"think\" like Excel and write in column N what the result of the VLOOKUP to the left should be. \n\nThen enter the formula in column O and check whether you have thought correctly.\n\nIf so, you have really understood how the VLOOKUP works."]

{"sheet":"02 WVERWEIS (1, A)","index":8,"n_rows":55,"n_cols":16,"rows_kept":55,"cut":false,"hidden":false,"merged":[[21,2,21,7],[23,2,30,8],[33,2,33,4],[1,1,1,4],[2,1,2,4],[12,2,12,4],[10,2,10,4],[16,2,16,4],[31,2,31,8],[16,9,16,12],[17,9,17,12],[18,9,18,12],[19,9,19,12],[15,2,15,4],[15,10,15,12],[17,2,17,4],[18,2,18,4],[19,2,19,4],[33,10,33,12],[34,2,34,4],[34,9,34,12],[35,2,35,4],[35,9,35,12],[48,2,48,8],[41,2,47,8],[36,2,36,4],[36,9,36,12],[37,2,37,4],[37,9,37,12],[39,2,39,7]]}
[null,null,null,null,null,null,null,null,0]
[1,"02 HLOOKUP (1, E)",null,null,null,"Back to Start"]
[2,"02 WVERWEIS (1, A)",null,null,null,"Startseite"]
[]
[1,null,"sorted:",null,null,null,null,null,null,null,"unsorted:"]
[2,null,"sortiert:",null,null,null,null,null,null,null,"unsortiert:"]
[null,null,"weight",10,20,30,40,50,null,null,"weight",10,40,30,20,50]
[null,null,"price",0.3,0.4,0.7,1,1.3,null,null,"price",0.3,1,0.7,0.4,1.3]
[]
[1,null,"Example:"]
[1,null,"HLOOKUP(32,5;B2:F3;2;TRUE) =",null,null,{"$f":"HLOOKUP(32.5,D7:H8,2,TRUE)","v":0.7}]
[2,null,"Beispiel:"]
[2,null,"WVERWEIS(32,5;B2:F3;2;WAHR) =",null,null,{"$f":"HLOOKUP(32.5,D7:H8,2,TRUE)","v":0.7}]
[]
[]
[2,"Übung …","... mit sortierter Liste:",null,null,"erst:\nEingabe von Hand ","dann:\nFormel eingeben",null,null,null,"... mit unsortierter Liste:",null,null,"erst:\nEingabe von Hand ","dann:\nFormel eingeben"]
[2,null,"WVERWEIS(30;D7:H8;2;WAHR) =",null,null,"?","?",null,null,"WVERWEIS(30;L7:P8;2;WAHR) =",null,null,null,"?","?"]
[2,null,"WVERWEIS(30;D7:H8;2;FALSCH) =",null,null,"?","?",null,null,"WVERWEIS(30;L7:P8;2;FALSCH) =",null,null,null,"?","?"]
[2,null,"WVERWEIS(21,35;D7:H8;2;WAHR) =",null,null,"?","?",null,null,"WVERWEIS(21,35;L7:P8;2;WAHR) =",null,null,null,"?","?"]
[2,null,"WVERWEIS(21,35;D7:H8;2;FALSCH) =",null,null,"?","?",null,null,"WVERWEIS(21,35;L7:P8;2;FALSCH) =",null,null,null,"?","?"]
[2]
[2,null,"Mit dem WVERWEIS(a;B:C;d;WAHR/FALSCH) fordern Sie Excel auf:"]
[2]
[2,null,"Suche den Wert a in der ersten Zeile des Bereiches B:C.\nWenn Du den Wert gefunden hast, gehe nach unten in die d-te Zeile des Bereiches B:C und liefere den Wert zurück, der dort steht.\nDas vierte Funktionsargument kann die Werte WAHR oder FALSCH annehmen. Das bedeutet:\n„FALSCH“: Suche genau nach dem Suchkriterium a!\n„WAHR“: Suche nach dem größten Wert, der kleiner oder gleich dem Suchkriterium a ist."]
[2]
[2]
[2]
[2]
[2]
[2]
[2]
[2,"Achtung","Der Bereich B:C muss aufsteigend sortiert sein nach der ersten Zeile!!"]
[]
[1,"Exercise …","... with the sorted list:",null,null,"first:\nenter result  manually ","then:\nenter formula",null,null,null,"... with the unsorted list:",null,null,"first:\nenter result  manually ","then:\nenter formula"]
[1,null,"HLOOKUP(30;D7:H8;2;TRUE) =",null,null,"?","?",null,null,"HLOOKUP(30;L7:P8;2;TRUE) =",null,null,null,"?","?"]
[1,null,"HLOOKUP(30;D7:H8;2;FALSE) =",null,null,"?","?",null,null,"HLOOKUP(30;L7:P8;2;FALSE) =",null,null,null,"?","?"]
[1,null,"HLOOKUP(21,35;D7:H8;2;TRUE) =",null,null,"?","?",null,null,"HLOOKUP(21,35;L7:P8;2;TRUE) =",null,null,null,"?","?"]
[1,null,"HLOOKUP(21,35;D7:H8;2;FALSE) =",null,null,"?","?",null,null,"HLOOKUP(21,35;L7:P8;2;FALSE) =",null,null,null,"?","?"]
[1]
[1,null,"With the HLOOKUP(a;B:C;d;TRUE/FALSE) you request Excel:"]
[1]
[1,null,"Look for the value a in the first row of the range B:C.\nIf you have found the value, move down to the d'th row of the range B:C and give the value from there as a result.\nThe fourth argument can have the values TRUE or FALSE. That means:\n„FALSE“: Look exactly for the value a!\n„TRUE“: Look for the largest value, which is smaller or equal to a."]
[1]
[1]
[1]
[1]
[1]
[1]
[1,"Attention","The range B:C must be sorted ascendingly according to its first row!!"]
[]
[]
[]
[]
[]
[0]

{"sheet":"02 WVERWEIS (1, A)_","index":9,"n_rows":14,"n_cols":8,"rows_kept":14,"cut":false,"hidden":true,"merged":[]}
[null,2,2,2,1,1,1,0]
[1,"02 HLOOKUP (1, E)_",null,null,null,{"$f":"B2","v":"02 HLOOKUP (1, E)_"}]
[2,"02 WVERWEIS (1, A)_"]
[0]
[null,1,"Der WVERWEIS funktioniert ganz analog zum SVERWEIS - nur dass hier nicht senkrecht in der ersten Spalte des Suchbereichs, sondern waagerecht in der ersten Zeile gesucht wird. Wurde der Wert gefunden, so wird der Wert in der darunter liegenden Zeile zurückgeliefert. \n\nIn dem Beispiel wird waagerecht nach dem Wert 32,5 gesucht - und zwar mit dem vierten Argument \"WAHR\"; also nach dem größten Wert, der kleiner oder gleich 32,5 ist. Das ist 30. Also liefert der WVERWEIS 0,70€ als Ergebnis.\n\nWährend es beim SVERWEIS also heißt \"runter - rüber\", heißt es beim WVERWEIS \"rüber - runter\".",null,1,"The HLOOKUP works in the same way as the VLOOKUP - except that the search is not performed vertically in the first column of the search range, but horizontally in its first row. If the value was found, the value in the row below is returned. \n\nIn the example, the value 32.5 is searched for horizontally - with the fourth argument \"TRUE\"; that is, the largest value that is less than or equal to 32.5. This is 30. So the HLOOKUP returns 0.70€ as the result. \n\nSo while the VLOOKUP means \"down - over\", the HLOOKUP means \"over - down\"."]
[null,{"$f":"IF(C6<>\"\",B5+1,\"\")","v":2},"Machen Sie jetzt die gleichen beiden Übungen wie beim SVERWEIS - also erst von Hand eingeben, welches Ergebnis Sie vom WVERWEIS erwarten, dann daneben die Formel eingeben und überprüfen, ob Sie richtig lagen.\n\nMachen Sie die Übung sowohl für die sortierte als auch für die unsortierte Tabelle. ",null,{"$f":"IF(F6<>\"\",E5+1,\"\")","v":2},"Now do the same two exercises as for the VLOOKUP - first enter manually what result you expect from the HLOOKUP, then enter the formula next to it and check if you were right.\n\nDo the exercise for both sorted and unsorted tables. "]
[null,{"$f":"IF(C7<>\"\",B6+1,\"\")","v":""},null,null,{"$f":"IF(F7<>\"\",E6+1,\"\")","v":""}]
[null,"",null,null,""]
[null,"",null,null,""]
[null,"",null,null,""]
[null,"",null,null,""]
[null,"",null,null,""]
[null,"",null,null,""]
[null,""]

{"sheet":"03 Bild","index":10,"n_rows":34,"n_cols":11,"rows_kept":34,"cut":false,"hidden":false,"merged":[[1,1,1,4],[2,1,2,4]]}
[null,null,null,null,null,null,null,null,null,null,0]
[1,"03 Picture",null,null,null,"Back to Start"]
[2,"03 Bild",null,null,null,"Startseite"]
[]
[2,"WVERWEIS","\"rüber - runter\""]
[1,"HLOOKUP","\"across - down\""]
[]
[]
[]
[]
[]
[]
[]
[]
[]
[]
[]
[]
[]
[2,"SVERWEIS","\"runter - rüber\""]
[1,"VLOOKUP","\"down - across\""]
[]
[]
[]
[]
[]
[]
[]
[]
[]
[]
[]
[]
[0]

{"sheet":"03 Bild_","index":11,"n_rows":16,"n_cols":8,"rows_kept":16,"cut":false,"hidden":true,"merged":[]}
[null,2,2,2,1,1,1,0]
[1,"03 Picture_",null,null,null,{"$f":"B2","v":"03 Picture_"}]
[2,"03 Bild_"]
[0]
[null,1,"Dieses Bild zeigt noch einmal das Grundprinzip von SVERWEIS und WVERWEIS:\n\nBeim WVERWEIS heißt es \"rüber - runter\" …\n… nicht \"drüber und drunter\" ;-)\n\n… während es beim SVERWEIS \"runter - rüber\" heißt!\n\nBisher hatten wir das Ergebnis immer in der zweiten Zeile bzw. Spalte gefunden. Es kann aber natürlich auch die 3., 4., 5., … Zeile oder Spalte sein.",null,1,"This picture shows again the basic principle of VLOOKUP and HLOOKUP:\n\nThe HLOOKUP is \"over - down\"...\n... not \"higgledy-piggledy\" ;-)\n\n... while the VLOOKUP is \"down - over\"!\n\nUntil now, we had always found the result in the second row or column. But of course it can also be the 3rd, 4th, 5th, ... row or column."]
[null,{"$f":"IF(C6<>\"\",B5+1,\"\")","v":""},null,null,{"$f":"IF(F6<>\"\",E5+1,\"\")","v":""}]
[null,{"$f":"IF(C7<>\"\",B6+1,\"\")","v":""},null,null,{"$f":"IF(F7<>\"\",E6+1,\"\")","v":""}]
[null,"",null,null,""]
[null,"",null,null,""]
[null,"",null,null,""]
[null,"",null,null,""]
[null,"",null,null,""]
[null,"",null,null,""]
[null,"",null,null,""]
[null,"",null,null,""]
[null,"",null,null,""]

{"sheet":"04 SVERWEIS (2, A)","index":12,"n_rows":60,"n_cols":13,"rows_kept":60,"cut":false,"hidden":false,"merged":[[28,2,29,4],[1,1,1,4],[2,1,2,4],[4,2,7,8],[8,2,11,8],[26,2,27,4]]}
[null,null,null,null,null,null,null,null,0]
[1,"04 VLOOKUP (2, E)",null,null,null,"Back to Start"]
[2,"04 SVERWEIS (2, A)",null,null,null,"Startseite"]
[]
[2,"Übung","Berechnung des Preises in Abhängigkeit von der Postleitzahl (SVERWEIS): \n(mit der Tariftabelle vom Blatt \"SVERWEIS (1, A)\"!)\n\nFrage: \"Was muss ich wo suchen?\""]
[2]
[2]
[2]
[1,"Exercise","Calculation of the price depending on the ZIP code (VLOOKUP):\n(using the charge table from the worksheet \"VLOOKUP (1, E)\"!)\n\nQuestion: \"What must I search where?\""]
[1]
[1]
[1]
[]
[null,null,"ZIP code","customer","weight","price"]
[null,null,11364,"Meier",12.35,"?"]
[null,null,12475,"Schulz",27.55,"?"]
[null,null,25125,"Schmidt",36.22,"?"]
[null,null,29177,"Lehmann",34.22,"?"]
[null,null,23777,"Krause",18.8,"?"]
[null,null,45298,"Müller",26.6,"?"]
[null,null,57800,"Baumann",42.21,"?"]
[null,null,58999,"Holzmann",43.38,"?"]
[]
[]
[]
[]
[2,"Übung","Finden Sie heraus, warum die SVERWEISe nicht funktionieren!\nACHTUNG: DAS SIND PROBLEME LIVE AUS DER PRAXIS!!"]
[2]
[1,"Exercise","Find out, why the VLOOKUPs don't work!\nATTENTION: THESE ARE PROBLEMS LIVE FROM REALITY!!"]
[1]
[]
[]
[]
[null,null,"order nr.","customer","article","price","amount","total price",null,null,null,null,"Summe"]
[null,null,10254,"Chop-suey Chinese","Guaraná Fantástica",3.6,15,45.9,null,null,null,"Chop-suey Chinese",{"$f":"VLOOKUP(\"Total\" & L35,$C$34:$H$59,5,TRUE)","v":"amount"}]
[null,null,10254,"Chop-suey Chinese","Pâté chinois",19.2,21,342.72,null,null,null,"Hanari Carnes",{"$f":"VLOOKUP(\"Total\" & L36,$C$34:$H$59,5,TRUE)","v":"amount"}]
[null,null,10254,"Chop-suey Chinese","Longlife Tofu",8,21,168,null,null,null,"Supremes delices","amount"]
[null,null,null,"Total Chop-suey Chinese",null,null,null,556.62,null,null,null,"Toms Spezialitäten","amount"]
[null,null,10250,"Hanari Carnes","Manjimup Dried Apples",42.4,35,1261.4000000000001,null,null,null,"Victuailles en stock","amount"]
[null,null,10250,"Hanari Carnes","Jack's New England Clam Chowder",7.7,10,77,null,null,null,"Vins et alcools Chevalier","amount"]
[null,null,10250,"Hanari Carnes","Louisiana Fiery Hot Pepper Sauce",16.8,15,214.2]
[null,null,10253,"Hanari Carnes","Chartreuse verte",14.4,42,604.79999999999995]
[null,null,10253,"Hanari Carnes","Gorgonzola Telino",10,20,200]
[null,null,10253,"Hanari Carnes","Maxilaku",16,40,640]
[null,null,null,"Total Hanari Carnes ",null,null,null,2997.4]
[null,null,10252,"Supremes delices","Geitost",2,25,47.5]
[null,null,10252,"Supremes delices","Camembert Pierrot",27.2,40,1088]
[null,null,10252,"Supremes delices","Sir Rodney's Marmalade",64.8,40,2462.4]
[null,null,null,"Total Supremes delices",null,null,null,3597.9]
[null,null,10249,"Toms Spezialitäten","Manjimup Dried Apples",42.4,40,1696]
[null,null,10249,"Toms Spezialitäten","Tofu",18.600000000000001,9,167.4]
[0,null,null,"Total Toms Spezialitäten\n",null,null,null,1863.4]
[null,null,10251,"Victuailles en stock","Gustaf's Knäckebröd",16.8,6,95.76]
[null,null,10251,"Victuailles en stock","Ravioli Angelo",15.6,15,222.3]
[null,null,10251,"Victuailles en stock","Louisiana Fiery Hot Pepper Sauce",16.8,20,336]
[null,null,null,"Total Victuailles en stock",null,null,null,654.05999999999995]
[null,null,10248,"Vins et alcools Chevalier","Singaporean Hokkien Fried Mee",9.8000000000000007,10,98]
[null,null,10248,"Vins et alcools Chevalier","Mozzarella di Giovanni",24.3,5,121.5]
[null,null,10248,"Vins et alcools Chevalier","Queso Cabrales",14,12,168]
[null,null,null,"Total Vins et alcools Chevalier",null,null,null,387.5]

{"sheet":"04 SVERWEIS (2, A)_","index":13,"n_rows":8,"n_cols":8,"rows_kept":8,"cut":false,"hidden":true,"merged":[]}
[null,2,2,2,1,1,1,0]
[1,"04 VLOOKUP (2, E)_",null,null,null,{"$f":"B2","v":"04 VLOOKUP (2, E)_"}]
[2,"04 SVERWEIS (2, A)_"]
[0]
[null,1,"Nachdem Sie wissen, wie ein SVERWEIS funktioniert, sollen Sie ihn praktisch anwenden. Dafür sehen Sie hier eine kleine Auftragstabelle. \n\nSie sollen nun die Tariftabelle vom Blatt \"SVERWEIS (1, A)\" benutzen, um mittels SVERWEIS auszurechnen, was die einzelnen Transporte kosten.\n\nEntsprechend den ersten beiden Argumenten des SVERWEISes müssen Sie als erstes überlegen, WAS Sie WO suchen müssen - nämlich die Postleitzahl aus Spalte C in der ersten Spalte der Tariftabelle auf dem Blatt \"SVERWEIS (1, A)\"! ",null,1,"After you know how a VLOOKUP works, you should use it practically. For this purpose you can see a small order table here. \n\nYou should now use the charge table from the sheet \"VLOOKUP (1, A)\" to calculate the costs of the individual transports.\n\nAccording to the first two arguments of the VLOOKUP, the first thing to consider is WHAT to look for WHERE - namely the zip code from column C in the first column of the charge table on the sheet \"VLOOKUP (1, A)\"! "]
[null,{"$f":"IF(C6<>\"\",B5+1,\"\")","v":2},"ACHTUNG - FALLE: \n\nZur Eingabe der Formel müssen Sie ja auf das Blatt \"SVERWEIS (1, A)\" wechseln, um dort den Suchbereich zu markieren. Dann dürfen Sie aber nicht sofort zurück auf dieses Blatt wechseln, weil Excel dann in der Formel den Namen dieses Blattes einträgt. \n\nProbieren Sie das ruhig einmal aus, um zu erkennen, worin die Falle besteht!",null,{"$f":"IF(F6<>\"\",E5+1,\"\")","v":2},"ATTENTION - TRAP: \n\nTo enter the formula you have to switch to the sheet \"VLOOKUP (1, A)\" to mark the search range there. But then you must not switch back to this sheet immediately, because Excel then enters the name of this sheet in the formula. \n\nTry it out to see what the trap is!"]
[null,{"$f":"IF(C7<>\"\",B6+1,\"\")","v":3},"Um der Falle zu entgehen, müssen Sie oben in der Formel-Eingabezeile hinter den Suchbereich ein Semikolon setzen. Dann \"weiß\" Excel, dass der Suchbereich fertig eingegeben wurde und dass das nächste Argument kommt.",null,{"$f":"IF(F7<>\"\",E6+1,\"\")","v":3},"To avoid the trap, you must place a semicolon behind the search range at the top of the formula input line. Then Excel \"knows\" that the search range has been entered and that the next argument is coming up."]
[null,4,"Zur Kontrolle Ihrer Ergebnisse sehen Sie hier auf diesem Blatt einen Screenshot der richtigen Lösung. \n\nVielleicht wundern Sie sich, dass Sie etwas anderes heraus bekommen haben? \n\nDann sehen Sie sich bitte die Überschrift der Tariftabelle auf dem Blatt \"SVERWEIS (1, A)\" nochmal genau an!",null,{"$f":"IF(F8<>\"\",E7+1,\"\")","v":4},"To check your results, you can see a screenshot of the correct solution here on this sheet. \n\nMaybe you are wondering why you got something different? \n\nIf so, please take a close look at the heading of the charge table on the sheet \"VLOOKUP (1, A)\" again!"]

{"sheet":"05 Funktionsassistent (1)","index":14,"n_rows":35,"n_cols":17,"rows_kept":35,"cut":false,"hidden":false,"merged":[[1,1,1,4],[2,1,2,4],[6,2,7,8],[4,2,5,8]]}
[null,null,null,null,null,null,null,null,null,null,0]
[1,"05 Function wizard (1)",null,null,null,"Back to Start"]
[2,"05 Funktionsassistent (1)",null,null,null,"Startseite"]
[]
[2,null,"Benutzen Sie zur Eingabe komplexer Funktionen den Funktionsassistenten!"]
[2]
[1,null,"To enter complex functions use the function wizard!"]
[1]
[]
[null,null,null,null,null,null,null,null,null,null,null,null,null,"ZIP code","customer","weight","price"]
[null,null,null,null,null,null,null,null,null,null,null,null,null,11364,"Meier",12.35,{"$f":"VLOOKUP(N11,'01 SVERWEIS (1, A)'!C9:D18,2,TRUE)","v":0.2}]
[null,null,null,null,null,null,null,null,null,null,null,null,null,12475,"Schulz",27.55,"?"]
[null,null,null,null,null,null,null,null,null,null,null,null,null,25125,"Schmidt",36.22,"?"]
[null,null,null,null,null,null,null,null,null,null,null,null,null,29177,"Lehmann",34.22,"?"]
[null,null,null,null,null,null,null,null,null,null,null,null,null,23777,"Krause",18.8,"?"]
[null,null,null,null,null,null,null,null,null,null,null,null,null,45298,"Müller",26.6,"?"]
[null,null,null,null,null,null,null,null,null,null,null,null,null,57800,"Baumann",42.21,"?"]
[null,null,null,null,null,null,null,null,null,null,null,null,null,58999,"Holzmann",43.38,"?"]
[]
[]
[]
[]
[]
[]
[]
[]
[]
[]
[]
[]
[]
[]
[]
[]
[0]

{"sheet":"05 Funktionsassistent (1)_","index":15,"n_rows":9,"n_cols":8,"rows_kept":9,"cut":false,"hidden":true,"merged":[]}
[null,2,2,2,1,1,1,0]
[1,"05 Function wizard (1)_",null,null,null,{"$f":"B2","v":"05 Function wizard (1)_"}]
[2,"05 Funktionsassistent (1)_"]
[0]
[null,1,"Bisher haben wir die Formel in der entsprechenden Zelle einfach eingetippt. Bei einer komplexen Formel wie dem SVERWEIS (bzw. WVERWEIS) mit vier Argumenten kann man dabei schon mal etwas falsch machen. Daher gibt es den Funktionsassistenten.\n\nDazu müssen Sie oben links neben der Eingabezeile auf das \"fx\" klicken. Es öffnet sich ein Fenster, in dem Sie die einzugebende Formel auswählen müssen.\n\nFalls Sie den SVERWEIS in der Liste \"Funktion auswählen\" nicht finden, müssen Sie in der Kombobox \"Kategorie auswählen\" von \"Zuletzt verwendet\" auf \"Alle\" wechseln.\n\nNach dem Klick auf \"OK\" öffnet sich der Funktionsassistent.",null,1,"Until now, we have simply typed the formula in the corresponding cell. With a complex formula such as the VLOOKUP (or HLOOKUP) with four arguments, it is possible to make a mistake. That is why we have the function wizard.\n\nTo do this, you must click on the \"fx\" left to the formula bar. A window opens in which you have to select the formula to be entered.\n\nIf you cannot find the VLOOKUP in the \"Select a function\" list, you have to switch within the combo box from \"Most recently used\" to \"All\" in the \"Or select a category\".\n\nAfter clicking \"OK\" the function wizard opens.\n\n"]
[null,{"$f":"IF(C6<>\"\",B5+1,\"\")","v":2},"Er gibt Ihnen die Möglichkeit, die Argumente der Formel in einzelnen Eingabefeldern einzugeben. Dadurch können grobe Eingabefehler vermieden werden.\n\nAuch hier gilt wieder - ACHTUNG FALLE: \n\nZur Eingabe des Suchbereichs müssen Sie wieder auf das Blatt \"SVERWEIS (1, A)\" wechseln. Wenn die Einfügemarke dann noch im Feld \"Matrix\" steht, dürfen Sie nicht zurück auf dieses Blatt wechseln. \n\nKlicken Sie deshalb erst in das Eingabefeld \"Spaltenindex\", bevor Sie zurück auf dieses Blatt wechseln.",null,{"$f":"IF(F6<>\"\",E5+1,\"\")","v":2},"It allows you to enter the arguments of the formula in individual input fields. This helps to avoid gross input errors.\n\nHere again, the following applies - ATTENTION TRAP: \n\nTo enter the search range you have to switch back to the sheet \"VLOOKUP (1, A)\". If the cursor is still in the \"Table_array\" field, you must not switch back to this sheet. \n\nTherefore click in the \"Col_index_num\" input field first before you switch back to this sheet.\n\n"]
[null,{"$f":"IF(C7<>\"\",B6+1,\"\")","v":3},"Bitte üben Sie die Benutzung des Funktionsassistenten, indem Sie die Aufgabe auf dem Blatt \"SVERWEIS (2, A)\" noch einmal mit Funktionsassistent lösen!\n\nIn Zukunft könnnen Sie dann selber entscheiden, ob sie ihn benutzen wollen oder die Formel lieber von Hand eintippen.",null,{"$f":"IF(F7<>\"\",E6+1,\"\")","v":3},"Please practice the use of the function wizard by solving the task on the sheet \"VLOOKUP (2, A)\" once again with function wizard!\n\nIn the future you can then decide for yourself if you want to use it or if you prefer to type in the formula manually."]
[null,{"$f":"IF(C8<>\"\",B7+1,\"\")","v":""},null,null,{"$f":"IF(F8<>\"\",E7+1,\"\")","v":""}]
[null,null,null,null,""]

{"sheet":"06 WVERWEIS (2, A)","index":16,"n_rows":29,"n_cols":10,"rows_kept":29,"cut":false,"hidden":false,"merged":[[1,1,1,4],[2,1,2,4],[4,2,7,8],[8,2,11,8]]}
[null,null,null,null,null,null,null,null,null,0]
[1,"06 HLOOKUP (2, E)",null,null,null,"Back to Start"]
[2,"06 WVERWEIS (2, A)",null,null,null,"Startseite"]
[]
[2,"Übung","Berechnung des Preises in Abhängigkeit vom Gewicht (WVERWEIS): \n(mit der Tariftabelle vom Blatt \"WVERWEIS (1, A)\"!) \n\nFrage: \"Was muss ich wo suchen?\""]
[2]
[2]
[2]
[1,"Exercise","Calculation of the price depending on the weight (HLOOKUP):\n(using the charge table from the worksheet \"HLOOKUP (1, E)\"!)\n\nQuestion: \"What must I search where?\""]
[1]
[1]
[1]
[]
[null,null,"ZIP code","customer","weight","price"]
[null,null,11364,"Meier",12.35,"?"]
[null,null,12475,"Schulz",27.55,"?"]
[null,null,25125,"Schmidt",36.22,"?"]
[null,null,29177,"Lehmann",34.22,"?"]
[null,null,23777,"Krause",18.8,"?"]
[null,null,45298,"Müller",26.6,"?"]
[null,null,57800,"Baumann",42.21,"?"]
[null,null,58999,"Holzmann",43.38,"?"]
[]
[]
[]
[]
[]
[]
[0]

{"sheet":"06 WVERWEIS (2, A)_","index":17,"n_rows":14,"n_cols":8,"rows_kept":14,"cut":false,"hidden":true,"merged":[]}
[null,2,2,2,1,1,1,0]
[1,"06 HLOOKUP (2, E)_",null,null,null,{"$f":"B2","v":"06 HLOOKUP (2, E)_"}]
[2,"06 WVERWEIS (2, A)_"]
[0]
[null,1,"Hier kommt wieder die gleiche Übung wie beim SVERWEIS für den WVERWEIS: Sie sollen ausrechnen, was die einzelnen Transporte der Auftragstabelle kosten.\n\nDafür sollen Sie jetzt aber die Tariftabelle vom Blatt \"WVERWEIS (1, A)\" benutzen. WAS muss der WVERWEIS jetzt WO suchen?",null,1,"Here comes again the same exercise as with the VLOOKUP for the HLOOKUP: You should calculate what the individual shipments of the order table costs.\n\nBut now you should use the charge table from the sheet \"HLOOKUP (1, A)\". WHAT should the HLOOKUP now look for WHERE?"]
[null,{"$f":"IF(C6<>\"\",B5+1,\"\")","v":2},"Richtig! Das Gewicht aus Spalte E in der ersten Zeile der Tariftabelle auf dem Blatt \"WVERWEIS (1, A)\"!\n\nBeachten Sie auch hier wieder die Falle beim Zurück-Klicken auf dieses Blatt!\n\nUm den Funktionsassistenten nochmal zu üben, sollten Sie ihn für diese Aufgabe benutzen!",null,{"$f":"IF(F6<>\"\",E5+1,\"\")","v":2},"Right! The weight from column E in the first row of the charge table on the sheet \"HLOOKUP (1, A)\"!\n\nAgain, note the trap when clicking back to this sheet!\n\nTo practice the function wizard again, you should use it for this task!"]
[null,{"$f":"IF(C7<>\"\",B6+1,\"\")","v":""},null,null,{"$f":"IF(F7<>\"\",E6+1,\"\")","v":""}]
[null,"",null,null,""]
[null,"",null,null,{"$f":"IF(F9<>\"\",E8+1,\"\")","v":""}]
[null,"",null,null,""]
[null,"",null,null,""]
[null,{"$f":"IF(C12<>\"\",B11+1,\"\")","v":""}]
[null,""]
[null,""]

{"sheet":"061 VERWEIS","index":18,"n_rows":57,"n_cols":10,"rows_kept":57,"cut":false,"hidden":false,"merged":[[35,2,38,7],[39,2,41,7],[1,1,1,4],[2,1,2,4],[4,2,5,7],[6,2,7,7],[10,3,15,7],[17,3,20,7]]}
[null,null,null,null,null,0]
[1,"061 LOOKUP",null,null,null,"Back to Start"]
[2,"061 VERWEIS",null,null,null,"Startseite"]
[]
[2,null,"Der Vollständigkeit halber wird hier kurz die Funktion VERWEIS erwähnt - im Grunde genommen braucht man sie aber nicht."]
[2]
[1,null,"For the sake of completeness, the LOOKUP function is briefly mentioned here - but basically you don't need it."]
[1]
[]
[2,null,"Die MS-Excel-Hilfe sagt:"]
[2,null,null,"Es wird dringend empfohlen, anstelle der Matrixversion von VERWEIS die Funktion SVERWEIS oder die Funktion WVERWEIS zu verwenden.\nDie Matrixversion wird aus Gründen der Kompatibilität mit anderen Tabellenkalkulationsprogrammen bereitgestellt, ihre Funktionalität ist jedoch eingeschränkt."]
[2]
[2]
[2]
[2]
[2]
[1,null,"The MS-Excel-Help says:"]
[1,null,null,"It is strongly recommended to use the VLOOKUP function or the HLOOKUP function instead of the matrix version of LOOKUP.\nThe matrix version is provided for compatibility with other spreadsheet software, but its functionality is limited."]
[1]
[1]
[1]
[]
[null,null,null,"weight"]
[null,null,"ZIP code",10,20,30,40,50]
[null,null,0,0.3,0.4,0.7,1,1.3]
[null,null,10000,0.2,0.3,0.6,0.8,1.1000000000000001]
[null,null,20000,0.1,0.2,0.5,0.7,0.9]
[null,null,30000,0.2,0.3,0.6,0.9,1.2]
[null,null,40000,0.3,0.5,0.8,1.1000000000000001,1.4]
[null,null,50000,0.4,0.7,1,1.4,1.7]
[null,null,60000,0.5,1,1.3,1.6,2]
[null,null,70000,0.6,1.2,1.5,1.9,2.2999999999999998]
[null,null,80000,0.7,1.4,1.8,2.2000000000000002,2.5]
[null,null,90000,0.8,1.6,2,2.5,2.8]
[]
[2,null,"Von der Funktion VERWEIS gibt es zwei Versionen: Die Vektorversion und die Matrixversion. Sie unterscheiden sich durch die Anzahl und Art der Funktionsargumente. Bitte sehen Sie sich dazu einfach die folgenden Beispiele an:"]
[2]
[2]
[2]
[1,null,"There are two versions of the function LOOKUP: The vector version and the matrix version. They differ in the number and type of function arguments. Please just have a look at the following examples:"]
[1]
[1]
[]
[2,null,"vertikal:"]
[1,null,"vertical:"]
[null,null,null,50000,"Vector:",{"$f":"LOOKUP(D46,C25:C34,F25:F34)","v":1},{"$f":"_xlfn.FORMULATEXT(F46)","v":"=VERWEIS(D46;C25:C34;F25:F34)"}]
[null,null,null,null,"Matrix:",{"$f":"LOOKUP(D46,C25:F34)","v":1},{"$f":"_xlfn.FORMULATEXT(F47)","v":"=VERWEIS(D46;C25:F34)"}]
[null,null,null,66666,"Vector:",{"$f":"LOOKUP(D48,C25:C34,F25:F34)","v":1.3},{"$f":"_xlfn.FORMULATEXT(F48)","v":"=VERWEIS(D48;C25:C34;F25:F34)"}]
[null,null,null,null,"Matrix:",{"$f":"LOOKUP(D48,C25:F34)","v":1.3},{"$f":"_xlfn.FORMULATEXT(F49)","v":"=VERWEIS(D48;C25:F34)"}]
[null,null,"horizontal:"]
[null,null,null,20,"Vector:",{"$f":"LOOKUP(D51,D24:H24,D28:H28)","v":0.3},{"$f":"_xlfn.FORMULATEXT(F51)","v":"=VERWEIS(D51;D24:H24;D28:H28)"}]
[null,null,null,null,"Matrix:",{"$f":"LOOKUP(D51,D24:H28)","v":1.2},"=VERWEIS(D51;D24:H28)",null,null,"??"]
[null,null,null,33,"Vector:",{"$f":"LOOKUP(D53,D24:H24,D28:H28)","v":0.6},"=VERWEIS(D53;D24:H24;D28:H28)"]
[null,null,null,null,"Matrix:",{"$f":"LOOKUP(D53,D24:H30)","v":1.7},"=VERWEIS(D53;D24:H30)",null,null,"??"]
[]
[]
[0]

{"sheet":"062 XVERWEIS (A)","index":19,"n_rows":111,"n_cols":8,"rows_kept":111,"cut":false,"hidden":false,"merged":[[105,2,106,7],[1,1,1,4],[2,1,2,4],[4,2,6,7],[7,2,9,7],[28,2,29,7],[30,2,31,7],[37,2,58,7],[60,2,81,7],[83,2,83,7],[84,2,84,7],[103,2,104,7]]}
[null,null,null,null,null,0]
[1,"062 XLOOKUP (E)",null,null,null,"Back to Start"]
[2,"062 XVERWEIS (A)",null,null,null,"Startseite"]
[]
[2,null,"Mit dem SVERWEIS und dem WVERWEIS können Sie aus einer Liste einen einzelnen Wert heraussuchen. Vielleicht brauchen Sie aber mehrere Werte - z.B. Anrede und Name oder Straße, Postleitzahl und Stadt. Dann können Sie den XVERWEIS benutzen. Sehen Sie sich dazu bitte das folgende Beispiel an:"]
[2]
[2]
[1,null,"With the VLOOKUP and the HLOOKUP function you can pick out one single value from a list. However, you may need several values - e.g. salutation and name or street, postcode and city. Then you can use the XLOOKUP. Please take a look at the following example:"]
[1]
[1]
[]
[null,null,"Company","Salutation","Contact person","Address","ZIP code","City"]
[null,null,"Babin Machine Inc.","Mr","Oliver Young","East Street 111","EC2 5NT","London"]
[null,null,"Ready Tool Co.","Ms","Olivia Brewster","West Av. 222","T2F 8M4","Tsawassen"]
[null,null,"McCrosky Tool Corp.","Ms","Jessica Miller","Middle Boulevard 333",87110,"Albuquerque"]
[null,null,"Turner Ace Hardware","Mr","Charlie Nolan","South Place 444",97201,"Portland"]
[null,null,"Tool House Inc.","Mr","Thomas Sawyer","North Way 555","H1J 1C3","Montréal"]
[null,null,"GlobalAxxs","Ms","Isabella Hanson","East Av. 666","LA9 PX8","Hedge End"]
[null,null,"Pelham Tool Company Inc.","Mr","Jack Rodriguez","West Str. 777",83720,"Boise"]
[null,null,"Gasser True Value & Farm Sup","Mr","Jacob Wayne","South Place 888",98128,"Seattle"]
[null,null,"Hardware Bath & More","Mr","William West","South Avenue 123",97403,"Eugene"]
[null,null,"Mountaineer Precision Tools","Ms","Sophie Ward","North Street 456",94117,"San Francisco"]
[null,null,"Mayer Paint & Hardware","Mr","James Brown","East Av. 789",5022,"San Cristóbal"]
[]
[2,null,"Bitte wählen Sie eine Firma aus:"]
[1,null,"Please select a company:"]
[null,null,"Tool House Inc.",null,{"$f":"_xlfn.XLOOKUP(C27,C13:C23,D13:E23,\"not found\",0,1)","v":"Mr"},"Thomas Sawyer",{"$f":"_xlfn.FORMULATEXT(E27)","v":"=XVERWEIS(C27;C13:C23;D13:E23;\"not found\";0;1)"}]
[]
[2,"Übung","Schreiben Sie eine XVERWEIS-Formel, die nach der Kontaktperson sucht und damit die Adresse, die PLZ und die Stadt aus der obigen Tabelle holt!"]
[2]
[1,"Exercise","Write an XLOOKUP formula that searches for the contact person and thus takes the address, the ZIP code and the city from the table above!"]
[1]
[]
[2,null,"Bitte wählen Sie eine Kontaktperson aus:"]
[1,null,"Please select a contact person:"]
[]
[]
[2,null,"Die ersten beiden Funktionsargumente sind dieselben wie beim SVERWEIS und WVERWEIS: Der zu suchende Wert und der Bereich, in dem der Wert gesucht werden soll. \n\nDas dritte Argument ist dann aber nicht die Spalten- bzw. Zeilennummer, sondern der Bereich, der als Ergebnis angezeigt werden soll. ACHTUNG: Die Formel kommt in eine Zelle - wenn das dritte Argument aber mehrere Spalten umfasst, so kommt das Ergebnis des XVERWEISes auch in mehrere Spalten! (siehe obiges Beispiel!)\n\nDann gibt es aber noch drei weitere Funktionsargumente:\n\nDas vierte Argument enthält den Text, der angezeigt werden soll, wenn der XVERWEIS kein Ergebnis gefunden hat. Wird das Argument nicht angegeben, so lautet das Suchergebnis #NV.\n\nDas fünfte Argument entspricht dem WAHR und FALSCH bei SVERWEIS und WVERWEIS. Hier kann es die Werte 0, -1 oder 1 annnehmen - je nachdem, ob nach einer genauen Übereinstimmung gesucht werden soll (=FALSCH beim SVERWEIS und WVERWEIS), ob der nächstkleinere Wert angezeigt werden soll (=WAHR beim SVERWEIS und WVERWEIS) oder der nächstgrößere (das gibt es beim SVERWEIS und WVERWEIS nicht!). Wird das Argument nicht angegeben, so ist der Standardwert 0.\n\nFür das sechste Argument gibt es ebenfalls keine Entsprechung beim SVERWEIS und beim WVERWEIS. Ist es 1, so beginnt die Suche beim ersten Element der Liste; ist es -1, so beginnt die Suche beim letzten Element der Liste. Wird das Argument nicht angegeben, so ist der Standardwert 1."]
[2]
[2]
[2]
[2]
[2]
[2]
[2]
[2]
[2]
[2]
[2]
[2]
[2]
[2]
[2]
[2]
[2]
[2]
[2]
[2]
[2]
[]
[1,null,"The first two function arguments are the same as for VLOOKUP and HLOOKUP: The value to be searched for and the range in which the value is to be searched. \n\nHowever, the third argument is not the column or row number, but the range that is to be displayed as the result. ATTENTION: The formula goes into one cell - but if the third argument covers several columns, the result of the XLOOKUP also goes into several columns! (see example above!)\n\nBut then there are three more function arguments:\n\nThe fourth argument contains the text that is to be displayed if the XLOOKUP did not find a result. If the argument is not specified, the search result is #NV.\n\nThe fifth argument corresponds to the TRUE and FALSE for VLOOKUP and HLOOKUP. Here it can take the values 0, -1 or 1 - depending on whether an exact match is to be searched for (=FALSE in the case of VLOOKUP and HLOOKUP), whether the next smaller value is to be displayed (= TRUE in the case of VLOOKUP and HLOOKUP) or the next larger (this does not exist in the case of VLOOKUP and HLOOKUP!). If the argument is not specified, the default value is 0.\n\nThere is also no equivalent for the sixth argument in the VLOOKUP and HLOOKUP functions. If it is 1, the search starts at the first element of the list; if it is -1, the search starts at the last element of the list. If the argument is not specified, the default value is 1."]
[1]
[1]
[1]
[1]
[1]
[1]
[1]
[1]
[1]
[1]
[1]
[1]
[1]
[1]
[1]
[1]
[1]
[1]
[1]
[1]
[1]
[]
[2,"Achtung","Im Unterschied zum SVERWEIS und WVERWEIS kann der XVERWEIS auch nach links suchen:"]
[1,"Attention","In contrast to the VLOOKUP and HLOOKUP, the XLOOKUP can also search to the left:"]
[]
[null,null,"Company","Salutation","Contact person","Address","ZIP code","City"]
[null,null,"Babin Machine Inc.","Mr","Oliver Young","East Street 111","EC2 5NT","London"]
[null,null,"Ready Tool Co.","Ms","Olivia Brewster","West Av. 222","T2F 8M4","Tsawassen"]
[null,null,"McCrosky Tool Corp.","Ms","Jessica Miller","Middle Boulevard 333",87110,"Albuquerque"]
[null,null,"Turner Ace Hardware","Mr","Charlie Nolan","South Place 444",97201,"Portland"]
[null,null,"Tool House Inc.","Mr","Thomas Sawyer","North Way 555","H1J 1C3","Montréal"]
[null,null,"GlobalAxxs","Ms","Isabella Hanson","East Av. 666","LA9 PX8","Hedge End"]
[null,null,"Pelham Tool Company Inc.","Mr","Jack Rodriguez","West Str. 777",83720,"Boise"]
[null,null,"Gasser True Value & Farm Sup","Mr","Jacob Wayne","South Place 888",98128,"Seattle"]
[null,null,"Hardware Bath & More","Mr","William West","South Avenue 123",97403,"Eugene"]
[null,null,"Mountaineer Precision Tools","Ms","Sophie Ward","North Street 456",94117,"San Francisco"]
[null,null,"Mayer Paint & Hardware","Mr","James Brown","East Av. 789",5022,"San Cristóbal"]
[]
[null,null,"Bitte wählen Sie eine PLZ:"]
[null,null,"Please select a ZIP code:"]
[null,null,"T2F 8M4",null,{"$f":"_xlfn.XLOOKUP(C102,G88:G98,E88:E98,\"not found\",0,1)","v":"Olivia Brewster"},{"$f":"_xlfn.FORMULATEXT(E102)","v":"=XVERWEIS(C102;G88:G98;E88:E98;\"not found\";0;1)"}]
[]
[2,"Übung","Schreiben Sie eine XVERWEIS-Formel, die nach der Kontaktperson sucht und damit die Firma aus der obigen Tabelle holt!"]
[2]
[1,"Exercise","Write an XLOOKUP formula that searches for the contact person and thus takes the the company from the table above!"]
[1]
[]
[2,null,"Bitte wählen Sie eine Kontaktperson:"]
[1,null,"Please select a contact person:"]
[0]

{"sheet":"063 SKVERWEIS","index":20,"n_rows":63,"n_cols":6,"rows_kept":63,"cut":false,"hidden":false,"merged":[[1,1,1,4],[2,1,2,4],[4,2,13,9],[14,2,21,9]]}
[null,null,null,null,null,0]
[1,"063 VCLOOKUP",null,null,null,"Back to Start"]
[2,"063 SKVERWEIS",null,null,null,"Startseite"]
[]
[2,null,"Der \"normale\" SVERWEIS bzw. WVERWEIS liefet als Ergebnis nur den Inhalt der gesuchten Zelle. Es könnte aber auch gewünscht sein, dass im Ergebnis zusätzlich auch ein evtl. vorhandener Kommentar erscheint.\nBeispiel: In der Zelle C8 stehen der Wert \"0,10 €\" und der Kommentar \"may be too low\". Im Ergebnis des normalen SVERWEISes erscheint in F8 nur \"0,10 €\". In F14 erscheint zusätzlich auch der Kommentar \"may be too low\".\nDie dafür benutzte Funktion SKVERWEIS stellt Excel nicht zur Verfügung. Sie wurde mit Hilfe von VBA programmiert und findet sich in der Übungsdatei \"VBAwithExcel\". Hier sehen Sie nur ein Bildschirmfoto, das die Problemlösung illustrieren soll."]
[2]
[2]
[2]
[2]
[2]
[2]
[2]
[2]
[2]
[1,null,"The \"normal\" VLOOKUP or HLOOKUP only returns the content of the cell searched for. However, it may also be desired that a possible comment also appears in the result.\n\nExample: Cell C8 contains the value \"0.10 €\" and the comment \"may be too low\". In the result of the normal VLOOKUP, only \"0.10 €\" appears in F8. In F14, the comment \"may be too low\" also appears.\nThe function VCLOOKUP used for this is not provided by Excel. It was programmed with the help of VBA and can be found in the exercise file \"VBAwithExcel\". Here you can only see a screenshot to illustrate the solution to the problem."]
[1]
[1]
[1]
[1]
[1]
[1]
[1]
[]
[]
[2,null,"Achtung: Das ist nur ein Bildschirmfoto!"]
[1,null,"Attention: This is only a screenshot!"]
[]
[]
[]
[]
[]
[]
[]
[]
[]
[]
[]
[]
[]
[]
[]
[]
[]
[]
[]
[]
[]
[]
[]
[]
[]
[]
[]
[]
[]
[]
[]
[]
[]
[]
[]
[]
[0]

{"sheet":"07 Tariftabelle (1)","index":21,"n_rows":27,"n_cols":11,"rows_kept":27,"cut":false,"hidden":false,"merged":[[1,1,1,4],[2,1,2,4]]}
[null,null,null,null,null,null,null,null,null,null,0]
[1,"07 Charge table (1)",null,null,null,"Back to Start"]
[2,"07 Tariftabelle (1)",null,null,null,"Startseite"]
[]
[null,null,null,"weight"]
[null,null,"ZIP code",10,20,30,40,50]
[null,null,0,0.3,0.4,0.7,1,1.3]
[null,null,10000,0.2,0.3,0.6,0.8,1.1000000000000001]
[null,null,20000,0.1,0.2,0.5,0.7,0.9]
[null,null,30000,0.2,0.3,0.6,0.9,1.2]
[null,null,40000,0.3,0.5,0.8,1.1000000000000001,1.4]
[null,null,50000,0.4,0.7,1,1.4,1.7]
[null,null,60000,0.5,1,1.3,1.6,2]
[null,null,70000,0.6,1.2,1.5,1.9,2.2999999999999998]
[null,null,80000,0.7,1.4,1.8,2.2000000000000002,2.5]
[null,null,90000,0.8,1.6,2,2.5,2.8]
[]
[]
[]
[]
[]
[]
[]
[]
[]
[]
[0]

{"sheet":"08 S-W-VERWEIS (A)","index":22,"n_rows":110,"n_cols":13,"rows_kept":110,"cut":false,"hidden":false,"merged":[[103,9,107,16],[4,2,7,7],[8,2,11,7],[42,2,46,6],[53,2,57,6],[53,9,53,15],[44,9,51,16],[55,9,62,16],[101,9,101,15],[95,9,99,16],[1,1,1,4],[2,1,2,4],[42,9,42,15],[93,9,93,15],[13,9,40,16],[64,9,90,16]]}
[null,null,null,null,null,null,null,null,null,null,null,null,0]
[1,"08 V-H-LOOKUP (E)",null,null,null,"Back to Start"]
[2,"08 S-W-VERWEIS (A)",null,null,null,"Startseite"]
[]
[2,"Übung","Berechnung des Preises in Abhängigkeit von der PLZ und dem Gewicht (SVERWEIS und WVERWEIS): \nmit der Tariftabelle vom Blatt \"Tariftabelle (2)\"! "]
[2]
[2]
[2]
[1,"Exercise","Calculation of the price depending on the ZIP code and the weight (VLOOKUP and HLOOKUP):\nusing the charge table from the worksheet \"Charge table (2)\"!"]
[1]
[1]
[1]
[]
[]
[null,null,"ZIP code","customer","weight","price"]
[null,null,11364,"Meier",12.35,"?"]
[null,null,12475,"Schulz",27.55,"?"]
[null,null,25125,"Schmidt",36.22,"?"]
[null,null,29177,"Lehmann",34.22,"?"]
[null,null,23777,"Krause",18.8,"?"]
[null,null,45298,"Müller",26.6,"?"]
[null,null,57800,"Baumann",42.21,"?"]
[null,null,58999,"Holzmann",43.38,"?"]
[]
[]
[]
[]
[]
[]
[]
[]
[]
[]
[]
[]
[]
[]
[]
[]
[]
[]
[]
[2,"Tipps","(1) Entwicklung der Formel von außen nach innen.\n(2) Zunächst 2 als drittes Argument des SVERWEISes.\n(3) ggf. Formel ohne Gleichheitszeichen schreiben.\n(4) ggf. Funktionsassistenten verwenden.",null,null,null,null,null,null,"=SVERWEIS(C16;'Tariftabelle (1)'!$C$7:$H$16;???;WAHR)"]
[2]
[2,null,null,null,null,null,null,null,null,"d.h. Sie sagen zu Excel:\n„Hole den Preis aus der Tarif-Tabelle, indem du zunächst aus der PLZ-Spalte die richtige Zeile heraussuchst (SVERWEIS). Gehe dann nach rechts bis in die richtige Gewichts-Spalte.“\n\nAber wie findet man die richtige Gewichts-Spalte??\n\nDafür brauchen wir eine Hilfszeile mit den Spaltennummern!"]
[2]
[2]
[2]
[2]
[2]
[2]
[2]
[]
[1,"Tips","(1) Develop the formula from the outside to the inside!\n(2) Start with 2 as the third argument of the VLOOKUP!\n(3) Possibly write the formula without the equal sign!\n(4) Possibly use the function wizard!",null,null,null,null,null,null,"=VLOOKUP(C16;'Charge table (1)'!$C$7:$H$16;???;TRUE)"]
[1]
[1,null,null,null,null,null,null,null,null,"i.e. you request Excel to the following:\n\"Look for the right row according to the given ZIP code (VLOOKUP). Then move to the right to find the right column according to the weight.\"\n\nBut how can you find the right column??\n\nTherefore we need an auxiliary row with the column numbers!"]
[1]
[1]
[1]
[1]
[1]
[1]
[1]
[]
[]
[]
[]
[]
[]
[]
[]
[]
[]
[]
[]
[]
[]
[]
[]
[]
[]
[]
[]
[]
[]
[]
[]
[]
[]
[]
[]
[]
[]
[2,null,null,null,null,null,null,null,null,"=SVERWEIS(C16;'Tariftabelle (2)'!$C$10:$H$19;WVERWEIS(???);WAHR)"]
[2]
[2,null,null,null,null,null,null,null,null,"d.h. Sie sagen jetzt zu Excel:\n„Hole den Preis aus der Tarif-Tabelle, indem du zunächst aus der PLZ-Spalte die richtige Zeile heraussuchst (SVERWEIS). Gehe dann nach rechts bis in die richtige Gewichts-Spalte. Die Nummer der Spalte findest du über die Funktion WVERWEIS unter Benutzung der Hilfszeile mit den Spaltennummern.“"]
[2]
[2]
[2]
[2]
[]
[1,null,null,null,null,null,null,null,null,"=VLOOKUP(C16;'Charge table (2)'!$C$10:$H$19;HLOOKUP(???);TRUE)"]
[1]
[1,null,null,null,null,null,null,null,null,"i.e. now you request Excel to the following:\n\"Look for the right row according to the given ZIP code (VLOOKUP). Then move to the right to find the right column according to the weight. You will find the number of the right column with an HLOOKUP using the column numbers from the auxiliary row.\""]
[1]
[1]
[1]
[1]
[]
[0]

{"sheet":"08 S-W-VERWEIS (A)_","index":23,"n_rows":14,"n_cols":8,"rows_kept":14,"cut":false,"hidden":true,"merged":[]}
[null,2,2,2,1,1,1,0]
[1,"08 V-H-LOOKUP (E)_",null,null,null,{"$f":"B2","v":"08 V-H-LOOKUP (E)_"}]
[2,"08 S-W-VERWEIS (A)_"]
[0]
[null,1,"Jetzt wird's richtig kompliziert! \n\nWir wollen jetzt beide Formeln miteinander kombinieren. Eine Tariftabelle sieht nämlich in den seltensten Fällen aus wie in den beiden bisherigen Aufgaben zum SVERWEIS und zum WVERWEIS.\n\nStattdessen sieht sie eher so aus, wie auf dem Blatt \"Tariftabelle (1)\". Der Preis des Transports hängt nämlich nicht ENTWEDER von der Entfernung ODER vom Gewicht ab, sondern von BEIDEM!\n\nVielleicht erkennen Sie schon, dass wir jetzt ein Problem mit dem dritten Argument des SVERWEISes haben. Bisher hatten wir dort immer eine \"2\" eingetragen, weil unsere Tariftabellen nur zwei Spalten bzw. Zeilen hatten.",null,1,"This is where it gets really complicated! \n\nWe now want to combine both formulas. A charge table rarely looks like the two previous tasks for the VLOOKUP and the HLOOKUP.\n\nInstead of, it looks more like the one on the sheet \"Charge table (1)\". The price of the transport does not depend EITHER on the distance OR the weight, but on BOTH!\n\nPerhaps you can already see that we now have a problem with the third argument of the VLOOKUP. Up to now, we had always entered a \"2\" there, because our charge tables only had two columns or rows."]
[null,{"$f":"IF(C6<>\"\",B5+1,\"\")","v":2},"Jetzt hängt aber die Nummer der Spalte, in die der SVERWEIS nach rechts \"rüber\" gehen muss, vom Gewicht ab. \n\nSind es z.B. 15 kg, muss in der zweiten Spalte gesucht werden, sind es 26,6 kg, in der dritten Spalte, … usw. Wie können wir die richtige Spalte per Formel finden?\n\nDazu legen wir uns in der Tariftabelle eine zusätzliche Hilfszeile an, die die Spaltennummern enthält! \n\nDiese Nummer finden wir mit Hilfe eines WVERWEISes, den wir anstelle der \"2\", die wir bisher immer benutzt haben, als drittes Argument im SVERWEIS benutzen.",null,{"$f":"IF(F6<>\"\",E5+1,\"\")","v":2},"Now, however, the number of the column into which the VLOOKUP must go \"over\" to the right depends on the weight. \n\nFor example, if it is 15 kg, the second column must be used, if it is 26.6 kg, the third column must be used, ... etc. How can we find the right column by formula?\n\nFor this purpose, we create an additional auxiliary row in the charge table which contains the column numbers! \n\nWe find this number with the help of a HLOOKUP, which we use as the third argument in the VLOOKUP instead of the \"2\", which we have always used so far.\n"]
[null,{"$f":"IF(C7<>\"\",B6+1,\"\")","v":3},"Klingt kompliziert? Kann ich nachvollziehen! Sehen Sie sich daher bitte das Blatt \"Tariftabelle (2)\" an. Dort sind die Suchbereiche des SVERWEISes und des WVERWEISes farblich markiert.\n\nDer SVERWEIS verwendet also das Ergebis des WVERWEISes (=die Spaltennummer!) als drittes Argument.\n\nVersuchen Sie jetzt bitte in der Auftragstabelle die Transportpreise unter Benutzung der \"Tariftabelle (2)\" mit einem kombinierten SVERWEIS-WVERWEIS zu berechnen! Die Lösung sehen Sie wieder als Screenshot rechts neben der Auftragstabelle.",null,{"$f":"IF(F7<>\"\",E6+1,\"\")","v":3},"Sounds complicated? I can understand that. So please take a look at the sheet \"Charge table (2)\". There the search ranges of the VLOOKUP and the HLOOKUP are marked in colour.\n\nSo the VLOOKUP uses the result of the HLOOKUP (=the column number!) as third argument.\n\nNow please try to calculate the transport prices in the order table using the \"Charge table (2)\" with a combined VLOOKUP-HLOOKUP! You will see the solution again as a screenshot to the right of the order table."]
[null,"",null,null,{"$f":"IF(F8<>\"\",E7+1,\"\")","v":""}]
[null,"",null,null,""]
[null,"",null,null,""]
[null,"",null,null,""]
[null,"",null,null,""]
[null,"",null,null,""]
[null,""]

{"sheet":"08 Tariftabelle (2)","index":24,"n_rows":28,"n_cols":17,"rows_kept":28,"cut":false,"hidden":false,"merged":[[7,12,8,14],[9,12,18,14],[1,1,1,4],[2,1,2,4],[20,2,22,7],[23,2,25,7],[7,9,8,11],[9,9,18,11]]}
[null,null,null,null,null,null,null,null,null,2,2,2,1,1,1,null,0]
[1,"08 Charge table (2)",null,null,null,"Back to Start"]
[2,"08 Tariftabelle (2)",null,null,null,"Startseite"]
[]
[2,"mit Hilfszeile:"]
[1,"with auxiliary row:"]
[null,null,null,"weight:"]
[null,null,"ZIP code",10,20,30,40,50,null,"Suchbereich des WVERWEISes",null,null,"Search range of the HLOOKUP"]
[null,null,null,2,3,4,5,6]
[null,null,0,0.3,0.4,0.7,1,1.3,null,"Suchbereich des SVERWEISes",null,null,"Search range of the VLOOKUP"]
[null,null,10000,0.2,0.3,0.6,0.8,1.1000000000000001]
[null,null,20000,0.1,0.2,0.5,0.7,0.9]
[null,null,30000,0.2,0.3,0.6,0.9,1.2]
[null,null,40000,0.3,0.5,0.8,1.1000000000000001,1.4]
[null,null,50000,0.4,0.7,1,1.4,1.7]
[null,null,60000,0.5,1,1.3,1.6,2]
[null,null,70000,0.6,1.2,1.5,1.9,2.2999999999999998]
[null,null,80000,0.7,1.4,1.8,2.2000000000000002,2.5]
[null,null,90000,0.8,1.6,2,2.5,2.8]
[]
[2,"Achtung","Die erste Datenspalte ist die zweite Spalte des Suchbereiches des SVERWEISes (orange). Die erste Spalte ist diejenige, in der gesucht wird!"]
[2]
[2]
[1,"Attention","The first column with data is the second column of the search range of the VLOOKUP (orange). The first one is the column, where the search is executed!"]
[1]
[1]
[]
[0]

{"sheet":"09 Funktionsassistent (2)","index":25,"n_rows":29,"n_cols":20,"rows_kept":29,"cut":false,"hidden":false,"merged":[[1,1,1,4],[2,1,2,4]]}
[null,null,null,null,null,null,null,null,null,null,null,null,null,null,null,null,null,null,null,0]
[1,"09 Function wizard (2)",null,null,null,"Back to Start"]
[2,"09 Funktionsassistent (2)",null,null,null,"Startseite"]
[]
[]
[null,null,null,null,null,null,null,null,null,null,null,null,"ZIP code","customer","weight","price"]
[null,null,null,null,null,null,null,null,null,null,null,null,11364,"Meier",12.35,{"$f":"VLOOKUP(M7,M20:R29,HLOOKUP(O7,N18:S19,2,TRUE),TRUE)","v":0.2}]
[null,null,null,null,null,null,null,null,null,null,null,null,12475,"Schulz",27.55,"?"]
[null,null,null,null,null,null,null,null,null,null,null,null,25125,"Schmidt",36.22,"?"]
[null,null,null,null,null,null,null,null,null,null,null,null,29177,"Lehmann",34.22,"?"]
[null,null,null,null,null,null,null,null,null,null,null,null,23777,"Krause",18.8,"?"]
[null,null,null,null,null,null,null,null,null,null,null,null,45298,"Müller",26.6,"?"]
[null,null,null,null,null,null,null,null,null,null,null,null,57800,"Baumann",42.21,"?"]
[null,null,null,null,null,null,null,null,null,null,null,null,58999,"Holzmann",43.38,"?"]
[]
[]
[null,null,null,null,null,null,null,null,null,null,null,null,null,"weight:"]
[null,null,null,null,null,null,null,null,null,null,null,null,"ZIP code",10,20,30,40,50]
[null,null,null,null,null,null,null,null,null,null,null,null,null,2,3,4,5,6]
[null,null,null,null,null,null,null,null,null,null,null,null,0,0.3,0.4,0.7,1,1.3]
[0,null,null,null,null,null,null,null,null,null,null,null,10000,0.2,0.3,0.6,0.8,1.1000000000000001]
[null,null,null,null,null,null,null,null,null,null,null,null,20000,0.1,0.2,0.5,0.7,0.9]
[null,null,null,null,null,null,null,null,null,null,null,null,30000,0.2,0.3,0.6,0.9,1.2]
[null,null,null,null,null,null,null,null,null,null,null,null,40000,0.3,0.5,0.8,1.1000000000000001,1.4]
[null,null,null,null,null,null,null,null,null,null,null,null,50000,0.4,0.7,1,1.4,1.7]
[null,null,null,null,null,null,null,null,null,null,null,null,60000,0.5,1,1.3,1.6,2]
[null,null,null,null,null,null,null,null,null,null,null,null,70000,0.6,1.2,1.5,1.9,2.2999999999999998]
[null,null,null,null,null,null,null,null,null,null,null,null,80000,0.7,1.4,1.8,2.2000000000000002,2.5]
[null,null,null,null,null,null,null,null,null,null,null,null,90000,0.8,1.6,2,2.5,2.8]

{"sheet":"09 Funktionsassistent (2)_","index":26,"n_rows":10,"n_cols":8,"rows_kept":10,"cut":false,"hidden":true,"merged":[]}
[null,2,2,2,1,1,1,0]
[1,"09 Function wizard (2)_",null,null,null,{"$f":"B2","v":"09 Function wizard (2)_"}]
[2,"09 Funktionsassistent (2)_"]
[0]
[null,1,"Sie können die kombinierte SVERWEIS-WVERWEIS-Formel auch mit dem Funktionsassistenten eingeben. Dabei müssten Sie allerdings im Funktionsassistenten den Funktionsassistenten aufrufen, denn Sie müssen ja als drittes Argument des SVERWEISes einen WVERWEIS eingeben.\n\nUnd das geht tatsächlich!",null,1,"You can enter the combined VLOOKUP-HLOOKUP formula with the function wizard. But that means, that you have to call the function wizard from the function wizard, because you have to enter a HLOOKUP as the third argument of the VLOOKUP.\n\nAnd that's really possible!"]
[null,{"$f":"IF(C6<>\"\",B5+1,\"\")","v":2},"Dazu starten Sie in gewohnter Weise den Funktionsassistenten zur Eingabe des SVERWEISes und geben das erste, zweite und vierte Argument (WAHR/FALSCH) ein.\n\nDann klicken Sie in das Eingabefeld für das dritte Argument (\"Spaltenindex\") und öffnen dann das Kombinationsfeld links neben der Eingabezeile (\"Namensfeld\"). Hier können Sie eine Funktion aus einer Liste auswählen. Um den WVERWEIS zu finden, müssen Sie evtl. auf \"Weitere Funktionen ...\" klicken. \n\nJetzt passiert etwas Verwirrendes: \nEin weiterer Funktionsassistent zur Eingabe der Argumente des WVERWEISes öffnet sich.\n\nSie benutzen jetzt also diesen Funktionsassistenten, um das dritte Argument im Funktionsassistenten des SVERWEISes einzugeben. \n\nDer Funktionsassistent für die Eingabe des SVERWEISes ist verschwunden und taucht auch nach dem Schließen des jetzt geöffneten Funktionsassistenten für den WVERWEIS NICHT wieder auf!",null,{"$f":"IF(F6<>\"\",E5+1,\"\")","v":2},"To do that, please start the function wizard for the input of the VLOOKUP and enter the first, second and fourth argument (TRUE/FALSE). \n\nThen click into the input box for the third argument (\"Col_index_num\") and then open the combo box left to the formula bar (\"Name box\"). Here you can select a function from a list. Possibly, to find the HLOOKUP, you may have to click on \"More Functions ...\".\n\nNow something confusing happens:\nAnother function wizard for the input of the arguments of the HLOOKUP opens.\n\nNow you use this function wizard to enter the third argument in the function wizard of the VLOOKUP. \n\nThe function wizard for the input of the VLOOKUP has disappeared and will NOT appear again, if you close the HLOOKUP wizard!"]
[null,{"$f":"IF(C7<>\"\",B6+1,\"\")","v":""},null,null,{"$f":"IF(F7<>\"\",E6+1,\"\")","v":""}]
[null,"",null,null,""]
[null,"",null,null,""]
[null,""]

{"sheet":"10 Lohnberechnung (A)","index":27,"n_rows":26,"n_cols":14,"rows_kept":26,"cut":false,"hidden":false,"merged":[[1,1,1,4],[2,1,2,4],[8,2,9,2],[10,2,11,2],[4,2,5,11],[6,2,7,11],[10,6,10,7],[10,8,10,9],[10,10,10,11],[8,3,9,3],[8,4,9,4],[8,5,9,5],[10,3,11,3],[10,4,11,4],[10,5,11,5],[8,6,8,7],[8,8,8,9],[8,10,8,11]]}
[null,null,null,null,null,null,null,null,null,null,null,null,null,0]
[1,"10 Payments (E)",null,null,null,"Back to Start"]
[2,"10 Lohnberechnung (A)",null,null,null,"Startseite"]
[]
[2,"Übung","Berechnen Sie den Stundenlohn (orange) mittels S-W-VERWEIS aus der Lohntabelle auf dem Blatt \"Lohntabelle (A)\" und daraus den Monatslohn (gelb)!",null,null,null,null,null,null,null,null,null,null,"Lösung für 2020:"]
[2]
[1,"Exercise","Calculate the hourly pay (orange) using the H-V-LOOKUP with the pay scale from the worksheet \"Pay scale (E)\" and then calculate the monthly pay (yellow)!",null,null,null,null,null,null,null,null,null,null,"Solution for 2020:"]
[1]
[2,null,"Name","Mitarbeiter seit","Lohn-gruppe","Stunden-lohn","Januar",null,"Februar",null,"März"]
[2,null,null,null,null,null,"Stunden","Lohn","Stunden","Lohn","Stunden","Lohn"]
[1,null,"name","employee since","pay grade","hourly pay","January",null,"February",null,"March"]
[1,null,null,null,null,null,"hours","pay","hours","pay","hours","pay"]
[null,null,"Müller, Frank",2007,2,null,150,null,111,null,132]
[null,null,"Meier, Sabine",2012,1,null,132,null,98,null,123]
[null,null,"Schulz, Paul",2009,7,null,156,null,144,null,118]
[null,null,"Hübner, Klaus",2002,1,null,129,null,131,null,101]
[null,null,"Mayer, Klaus",2002,6,null,121,null,158,null,140]
[null,null,"Neumann, Meike",2004,4,null,107,null,102,null,99]
[null,null,"Schulze, Frieda",2014,2,null,144,null,130,null,105]
[null,null,"Schulze, Marianne",2013,4,null,98,null,157,null,107]
[null,null,"Krüger, Otto",2012,3,null,118,null,92,null,123]
[null,null,"Mayer, Hermann",2013,7,null,136,null,111,null,115]
[0,null,"Schulze, Anna",2008,1,null,101,null,122,null,103]
[null,null,"Neumann, Frieda",2008,2,null,152,null,125,null,157]
[null,null,"Scholz, Frieda",2005,6,null,91,null,104,null,126]
[null,null,"Scholz, Anna",2015,3,null,133,null,106,null,157]

{"sheet":"10 Lohnberechnung (A)_","index":28,"n_rows":12,"n_cols":8,"rows_kept":12,"cut":false,"hidden":true,"merged":[]}
[null,2,2,2,1,1,1,0]
[1,"10 Payments (E)_",null,null,null,{"$f":"B2","v":"10 Payments (E)_"}]
[2,"10 Lohnberechnung (A)_"]
[0]
[null,1,"Auf diesem Blatt können Sie die Kombination SVERWEIS-WVERWEIS nochmal üben.\n\nBerechnen Sie dazu den Stundenlohn (orange) mittels S-W-VERWEIS aus der Lohntabelle auf dem Blatt \"Lohntabelle (A)\" und daraus den Monatslohn (gelb)!\n\nACHTUNG:\nBedenken Sie, dass in der Lohntabelle die Jahre der Betriebszugehörigkeit aufgeführt sind. Sie müssen diese also aus der Information \"Mitarbeiter seit ...\" erst berechnen!",null,1,"On this sheet, you can practice the VLOOKUP-HLOOKUP combination again.\n\nCalculate the hourly pay (orange) using the V-H-LOOKUP from the pay scale table on the sheet \"Pay scale (A)\" and from this the monthly pay (yellow)!\n\nATTENTION:\nRemember that the pay scale table shows the years of service. You must therefore first calculate them from the information \"Employee since ...\"!"]
[null,{"$f":"IF(C6<>\"\",B5+1,\"\")","v":2},"NOCHMAL ACHTUNG: FALLE!",null,{"$f":"IF(F6<>\"\",E5+1,\"\")","v":2},"AGAIN ATTENTION: TRAP!"]
[null,{"$f":"IF(C7<>\"\",B6+1,\"\")","v":3},"Welche?",null,{"$f":"IF(F7<>\"\",E6+1,\"\")","v":3},"Which?"]
[null,4,"Sag' ich nicht …",null,4,"I won´t say…"]
[null,5,"Die Lösung finden Sie wieder als Screenshot rechts neben der Lohntabelle auf diesem Blatt.",null,5,"You will find the solution again as a screenshot to the right of the pay scale table on this sheet."]
[null,"",null,null,{"$f":"IF(F10<>\"\",E9+1,\"\")","v":""}]
[null,{"$f":"IF(C11<>\"\",B10+1,\"\")","v":""},null,null,""]
[null,"",null,null,""]

{"sheet":"10 Lohntabelle (A)","index":29,"n_rows":20,"n_cols":12,"rows_kept":20,"cut":false,"hidden":false,"merged":[[1,1,1,4],[2,1,2,4]]}
[null,null,null,null,null,null,null,null,null,null,null,0]
[1,"10 Pay scale (E)",null,null,null,"Back to Start"]
[2,"10 Lohntabelle (A)",null,null,null,"Startseite"]
[]
[null,null,null,"years"]
[null,null,"pay grade",0,2,4,6,8,10,15]
[null,null,1,30,31,32,33,35,37,40]
[null,null,2,{"$f":"D7-2","v":28},29,30,31,33,35,38]
[null,null,3,26,27,28,29,31,33,36]
[null,null,4,24,25,26,27,29,31,34]
[null,null,5,22,23,24,25,27,29,32]
[null,null,6,20,21,22,23,25,27,30]
[null,null,7,18,19,20,21,23,25,28]
[null,null,8,16,17,18,19,21,23,26]
[null,null,9,14,15,16,17,19,21,24]
[null,null,10,12,13,14,15,17,19,22]
[]
[]
[]
[0]

{"sheet":"11 Umschlag (A)","index":30,"n_rows":44,"n_cols":12,"rows_kept":44,"cut":false,"hidden":false,"merged":[[39,2,40,11],[17,2,18,2],[6,2,9,9],[12,2,15,9],[1,1,1,4],[2,1,2,4],[4,2,5,8],[10,2,11,8],[36,2,37,11]]}
[null,null,null,null,null,null,null,null,null,null,null,0]
[1,"11 Transshipment (E)",null,null,null,"Back to Start"]
[2,"11 Umschlag (A)",null,null,null,"Startseite"]
[]
[2,"Übung","Suchen Sie mit Hilfe des S-W-VERWEISes bestimmte Werte aus einer Tabelle heraus!"]
[2]
[2,"Achtung","Die Zeilen- und Spaltenüberschriften in der Ergebnistabelle (orange) werden so definiert:\n\n\"Daten\" / \"Datentools\" / \"Datenüberprüfung\" / \"Datenüberprüfung\" / \"Einstellungen\": \"Zulassen = Liste\""]
[2]
[2]
[2]
[1,"Exercise","Pick out certain values from a table using the H-V-LOOKUP!"]
[1]
[1,"Attention","The headers of the rows and columns are defined as follows:\n\n\"Data\" / \"Data Tools\" / \"Data Validation\" / \"Data Validation\" / \"Settings\" : \"Allow = List\""]
[1]
[1]
[1]
[]
[null,null,null,"coal","fertilizer","cereals","oil","steel","cement"]
[null,null,null,2,3,4,5,6,7]
[null,null,"Bremerhaven",5166,5832,7418,6527,6336,7626]
[null,null,"Hamburg",13791,19105,18578,17865,15450,17621]
[null,null,"Stralsund",5620,5197,6596,5925,7388,7911]
[null,null,"Kiel",7976,7250,6658,5417,7716,5045]
[null,null,"Bremen",13023,13905,11287,14550,12356,10823]
[null,null,"Lübeck",6119,5964,7647,7639,7875,7365]
[null,null,"Emden",7947,7813,6949,7858,7228,7315]
[null,null,"Wismar",5107,7228,5516,6376,6815,7406]
[null,null,"Brake",7857,7727,6059,5110,7016,6610]
[null,null,"Rostock",6935,6240,5934,5550,5968,5012]
[]
[]
[]
[null,null,null,"coal","cement"]
[null,null,"Bremen"]
[null,null,"Hamburg"]
[]
[2,"Achtung","Kopieren Sie die Formeln mit der rechten Maustaste - ansonsten zerstören Sie sich die Formatierung der Tabelle, weil beim \"normalen\" Kopieren nicht nur der Inhalt sondern auch das Format der Zelle kopiert werden!"]
[2]
[1]
[1,"Attention","Coyp the formulas with the right mouse key - otherwise you destroy the format of the table, because with \"normal\" copy not only the content but also the format of the cell is copied!"]
[1]
[]
[]
[0]

{"sheet":"11 Umschlag (A)_","index":31,"n_rows":11,"n_cols":8,"rows_kept":11,"cut":false,"hidden":true,"merged":[]}
[null,2,2,2,1,1,1,0]
[1,"11 Transshipment (E)_",null,null,null,{"$f":"B2","v":"11 Transshipment (E)_"}]
[2,"11 Umschlag (A)_"]
[0]
[null,1,"Auf diesem Blatt können Sie die Kombination SVERWEIS-WVERWEIS nocheinmal üben.\n\nSuchen Sie dazu mit Hilfe des S-W-VERWEISes bestimmte Werte aus einer Tabelle heraus!",null,1,"On this sheet, you can practice the VLOOKUP-HLOOKUP combination once again.\n\nTo do this, use the V-H-LOOKUP to find specific values from a table!"]
[null,{"$f":"IF(C6<>\"\",B5+1,\"\")","v":2},"ACHTUNG: \n\nDie Zeilen- und Spaltenüberschriften in der Ergebnistabelle (orange) werden so definiert: \n\n\"Daten / Datentools / Datenüberprüfung / Datenüberprüfung / Einstellungen\": \"Zulassen = Liste\"\n\nEine detaillierte Beschreibung des Funktion \"Datenüberprüfung\" finden Sie in der Übungsdatei \"Excel-Basics\"!",null,{"$f":"IF(F6<>\"\",E5+1,\"\")","v":2},"ATTENTION: \n\nThe row and column headers in the result table (orange) are defined as follows:\n\n\"Data / Data Tools / Data Validation / Data Validation / Settings: \n\"Allow = List\"\n\nYou will find a detailed description of the function \"Data validation\" in the exercise file \"Excel-Basics\"!"]
[null,{"$f":"IF(C7<>\"\",B6+1,\"\")","v":""},null,null,{"$f":"IF(F7<>\"\",E6+1,\"\")","v":""}]
[null,{"$f":"IF(C8<>\"\",B7+1,\"\")","v":""},null,null,""]
[null,"",null,null,""]
[null,"",null,null,""]
[null,"",null,null,""]

{"sheet":"11 Umschlag (L1)_","index":32,"n_rows":11,"n_cols":8,"rows_kept":11,"cut":false,"hidden":true,"merged":[]}
[null,2,2,2,1,1,1,0]
[1,"11 Transshipment (S1)_",null,null,null,{"$f":"B2","v":"11 Transshipment (S1)_"}]
[2,"11 Umschlag (L1)_"]
[0]
[null,1,"Das Video zeigt, wie das Ganze dann funktionieren soll.",null,1,"The video shows how the whole thing should work then."]
[null,{"$f":"IF(C6<>\"\",B5+1,\"\")","v":""},null,null,{"$f":"IF(F6<>\"\",E5+1,\"\")","v":""}]
[null,{"$f":"IF(C7<>\"\",B6+1,\"\")","v":""},null,null,{"$f":"IF(F7<>\"\",E6+1,\"\")","v":""}]
[null,{"$f":"IF(C8<>\"\",B7+1,\"\")","v":""},null,null,""]
[null,"",null,null,""]
[null,"",null,null,""]
[null,"",null,null,""]

{"sheet":"12 Tarifanalyse (A1)","index":33,"n_rows":1355,"n_cols":21,"rows_kept":1355,"cut":false,"hidden":false,"merged":[[11,2,16,8],[4,11,9,16],[11,11,16,16],[1,1,1,4],[2,1,2,4],[4,2,9,8]]}
[null,null,null,null,null,null,null,null,null,null,null,0]
[1,"12 Charge analysis (E1)",null,null,null,"Back to Start"]
[2,"12 Tarifanalyse (A1)",null,null,null,"Startseite"]
[]
[2,"Übung","Berechnen Sie Ihre Einnahmen mit der Standard-Tariftabelle A, mit zwei modifizierten Tariftabellen B und C und mit der Tariftabelle Ihres Wettbewerbers. In der Tabelle B sollen die Tarife für kurze Strecken und kleine Gewichte etwas erhöht werden. In der Tabelle C sollen die Tarife für lange Strecken und große Gewichte etwas erhöht werden. Die Bereiche sind jeweils gelb markiert. Der Erhöhungsbetrag soll in Zelle J20 eingegeben werden.\nBerechnen Sie die Summen Ihrer Einnahmen in Zeile 20 (orange) und vergleichen Sie diese!",null,null,null,null,null,null,null,"Tipps:","(1) Formel kopieren in formatierter Tabelle: mit der RECHTEN Maustaste!!     \n(2) Formel schnell herunter kopieren: Doppelklick auf den \"Kopierpunkt\" an der rechten unteren Zellenecke     \n(3) Bereich schnell markieren - z.B. für SUMME(...): erste Zelle anklicken + Strg+Umschalt+Pfeil_unten"]
[2]
[2]
[2]
[2]
[2]
[]
[1,"Exercise","Calculate your earnings using your standard charge table A, two slightly modified charge tables B and C and the charge table of your competitor. In table B the charges for short distances and small weights shall be increased slightly. In table C the charges for long distances and large weights shall be increased slightly. The corresponding ranges are marked in yellow. The increase value shall be entered in cell J20.\n\nCalculate the sum of your earnings in row 20 (orange) and compyre the with each other!",null,null,null,null,null,null,null,"Tips:","(1) Copy formulas in formatted tables with the RIGHT mouse button!!     \n(2) Quick formula copy: Double click on the \"copy point\" in the lower right corner of the cell     \n(3) Quick range marking - e.g. for SUM(...): click to the first row + Ctrl+Shift+Arrow_down"]
[1]
[1]
[1]
[1]
[1]
[]
[null,null,"date","ZIP code","weight","earnings A","earnings B","earnings C","competitor"]
[null,null,null,null,null,null,null,null,null,null,"A",null,null,null,null,null,"competitor"]
[null,null,"2014-04-29",9715,28,null,null,null,null,null,"ZIP / weight",0,50,100,300,null,"ZIP / weight",0,50,100,300]
[null,null,"2014-04-29",10960,28,null,null,null,null,null,null,2,3,4,5,null,null,2,3,4,5]
[null,null,"2014-04-29",13399,13,null,null,null,null,null,0,30,40,70,100,null,0,40,50,80,110]
[null,null,"2014-04-29",16393,10,null,null,null,null,null,10000,20,30,60,80,null,10000,30,40,70,100]
[null,null,"2014-04-29",21682,28,null,null,null,null,null,20000,10,20,50,70,null,20000,20,30,60,80]
[null,null,"2014-04-29",24116,41,null,null,null,null,null,30000,20,30,60,90,null,30000,10,20,50,70]
[null,null,"2014-04-29",24121,19,null,null,null,null,null,40000,30,50,80,110,null,40000,20,30,60,90]
[null,null,"2014-04-29",32412,9,null,null,null,null,null,50000,40,70,100,140,null,50000,30,50,80,110]
[null,null,"2014-04-29",32331,31,null,null,null,null,null,60000,50,100,130,160,null,60000,40,70,100,140]
[null,null,"2014-04-29",43959,40,null,null,null,null,null,70000,60,120,150,190,null,70000,50,100,130,160]
[null,null,"2014-04-29",58335,6,null,null,null,null,null,80000,70,140,180,220,null,80000,60,120,150,190]
[null,null,"2014-04-29",55568,3,null,null,null,null,null,90000,80,160,200,250,null,90000,70,140,180,220]
[null,null,"2014-04-29",74572,8]
[null,null,"2014-04-29",83703,29,null,null,null,null,null,"B (increase short distances and small weights))"]
[null,null,"2014-04-29",1068,56,null,null,null,null,null,"ZIP / weight",0,50,100,300,null,"Solution:"]
[null,null,"2014-04-29",11897,53,null,null,null,null,null,null,2,3,4,5]
[null,null,"2014-04-29",16739,63,null,null,null,null,null,0,30,40,70,100]
[null,null,"2014-04-29",20453,90,null,null,null,null,null,10000,20,30,60,80]
[null,null,"2014-04-29",38855,73,null,null,null,null,null,20000,10,20,50,70]
[null,null,"2014-04-29",47878,97,null,null,null,null,null,30000,20,30,60,90]
[null,null,"2014-04-29",56777,79,null,null,null,null,null,40000,30,50,80,110]
[null,null,"2014-04-29",87024,89,null,null,null,null,null,50000,40,70,100,140]
[null,null,"2014-04-29",5672,190,null,null,null,null,null,60000,50,100,130,160]
[null,null,"2014-04-29",1304,116,null,null,null,null,null,70000,60,120,150,190]
[null,null,"2014-04-29",4105,168,null,null,null,null,null,80000,70,140,180,220]
[null,null,"2014-04-29",1880,183,null,null,null,null,null,90000,80,160,200,250]
[null,null,"2014-04-29",4808,200]
[null,null,"2014-04-29",13411,142,null,null,null,null,null,"C (increase long distances and large weights)"]
[null,null,"2014-04-29",24542,147,null,null,null,null,null,"ZIP / weight",0,50,100,300]
[0,null,"2014-04-29",44698,105,null,null,null,null,null,null,2,3,4,5]
[null,null,"2014-04-29",54367,111,null,null,null,null,null,0,30,40,70,100]
[null,null,"2014-04-29",58891,111,null,null,null,null,null,10000,20,30,60,80]
[null,null,"2014-04-29",57890,133,null,null,null,null,null,20000,10,20,50,70]
[null,null,"2014-04-29",67734,159,null,null,null,null,null,30000,20,30,60,90]
[null,null,"2014-04-29",60752,118,null,null,null,null,null,40000,30,50,80,110]
[null,null,"2014-04-29",83742,157,null,null,null,null,null,50000,40,70,100,140]
[null,null,"2014-04-29",7413,211,null,null,null,null,null,60000,50,100,130,160]
[null,null,"2014-04-29",8713,421,null,null,null,null,null,70000,60,120,150,190]
[null,null,"2014-04-29",2114,482,null,null,null,null,null,80000,70,140,180,220]
[null,null,"2014-04-29",15821,419,null,null,null,null,null,90000,80,160,200,250]
[null,null,"2014-04-29",12611,259]
[null,null,"2014-04-29",22393,427]
[null,null,"2014-04-29",20834,290]
[null,null,"2014-04-29",40181,292]
[null,null,"2014-04-29",45541,478]
[null,null,"2014-04-29",61074,281]
[null,null,"2014-04-30",3372,26]
[null,null,"2014-04-30",15869,40]
[null,null,"2014-04-30",22587,42]
[null,null,"2014-04-30",34190,42]
[null,null,"2014-04-30",34374,31]
[null,null,"2014-04-30",48000,4]
[null,null,"2014-04-30",59531,7]
[null,null,"2014-04-30",54969,42]
[null,null,"2014-04-30",6102,92]
[null,null,"2014-04-30",2006,88]
[null,null,"2014-04-30",11215,85]
[null,null,"2014-04-30",14828,63]
[null,null,"2014-04-30",13306,52]
[null,null,"2014-04-30",11022,50]
[null,null,"2014-04-30",29565,55]
[null,null,"2014-04-30",23319,89]
[null,null,"2014-04-30",25474,66]
[null,null,"2014-04-30",22077,66]
[null,null,"2014-04-30",32793,67]
[null,null,"2014-04-30",58758,73]
[null,null,"2014-04-30",78133,67]
[null,null,"2014-04-30",82382,65]
[null,null,"2014-04-30",6273,151]
[null,null,"2014-04-30",806,106]
[null,null,"2014-04-30",7387,154]
[null,null,"2014-04-30",17894,179]
[null,null,"2014-04-30",10005,109]
[null,null,"2014-04-30",23535,171]
[null,null,"2014-04-30",23044,127]
[null,null,"2014-04-30",27025,131]
[null,null,"2014-04-30",38456,169]
[null,null,"2014-04-30",39953,155]
[null,null,"2014-04-30",51963,101]
[null,null,"2014-04-30",67329,126]
[null,null,"2014-04-30",3923,290]
[null,null,"2014-04-30",14355,437]
[null,null,"2014-04-30",14259,489]
[null,null,"2014-04-30",28906,421]
[null,null,"2014-04-30",53927,402]
[null,null,"2014-05-01",2353,26]
[null,null,"2014-05-01",48,20]
[null,null,"2014-05-01",3876,38]
[null,null,"2014-05-01",18149,5]
[null,null,"2014-05-01",21219,28]
[null,null,"2014-05-01",27620,49]
[null,null,"2014-05-01",49110,31]
[null,null,"2014-05-01",44525,34]
[null,null,"2014-05-01",42290,34]
[null,null,"2014-05-01",60064,19]
[null,null,"2014-05-01",68709,34]
[null,null,"2014-05-01",62253,20]
[null,null,"2014-05-01",73546,38]
[null,null,"2014-05-01",81119,41]
[null,null,"2014-05-01",862,52]
[null,null,"2014-05-01",7517,95]
[null,null,"2014-05-01",6176,100]
[null,null,"2014-05-01",8269,64]
[null,null,"2014-05-01",17747,74]
[null,null,"2014-05-01",12919,52]
[null,null,"2014-05-01",10582,80]
[null,null,"2014-05-01",14784,59]
[null,null,"2014-05-01",18528,98]
[null,null,"2014-05-01",26479,62]
[null,null,"2014-05-01",29176,65]
[null,null,"2014-05-01",38515,68]
[null,null,"2014-05-01",35423,85]
[null,null,"2014-05-01",43024,89]
[null,null,"2014-05-01",49904,66]
[null,null,"2014-05-01",62647,99]
[null,null,"2014-05-01",60749,93]
[null,null,"2014-05-01",79107,60]
[null,null,"2014-05-01",4663,121]
[null,null,"2014-05-01",2053,114]
[null,null,"2014-05-01",13965,103]
[null,null,"2014-05-01",15616,138]
[null,null,"2014-05-01",17341,120]
[null,null,"2014-05-01",11823,139]
[null,null,"2014-05-01",17612,160]
[null,null,"2014-05-01",21532,154]
[null,null,"2014-05-01",20059,192]
[null,null,"2014-05-01",38200,140]
[null,null,"2014-05-01",35997,107]
[null,null,"2014-05-01",42672,177]
[null,null,"2014-05-01",3042,202]
[null,null,"2014-05-01",5254,201]
[null,null,"2014-05-01",1115,204]
[null,null,"2014-05-01",16627,400]
[null,null,"2014-05-01",17772,383]
[null,null,"2014-05-01",15195,488]
[null,null,"2014-05-01",40079,428]
[null,null,"2014-05-01",44875,477]
[null,null,"2014-05-02",1281,41]
[null,null,"2014-05-02",12060,43]
[null,null,"2014-05-02",12685,6]
[null,null,"2014-05-02",12164,49]
[null,null,"2014-05-02",25964,43]
[null,null,"2014-05-02",21925,24]
[null,null,"2014-05-02",25046,16]
[null,null,"2014-05-02",49041,45]
[null,null,"2014-05-02",62277,27]
[null,null,"2014-05-02",83356,42]
[null,null,"2014-05-02",96325,36]
[null,null,"2014-05-02",3711,60]
[null,null,"2014-05-02",526,58]
[null,null,"2014-05-02",9993,71]
[null,null,"2014-05-02",9729,85]
[null,null,"2014-05-02",6171,86]
[null,null,"2014-05-02",18658,90]
[null,null,"2014-05-02",24413,93]
[null,null,"2014-05-02",39583,79]
[null,null,"2014-05-02",32728,64]
[null,null,"2014-05-02",39771,57]
[null,null,"2014-05-02",35593,53]
[null,null,"2014-05-02",69830,69]
[null,null,"2014-05-02",65106,60]
[null,null,"2014-05-02",62244,63]
[null,null,"2014-05-02",69965,88]
[null,null,"2014-05-02",8590,127]
[null,null,"2014-05-02",10440,155]
[null,null,"2014-05-02",14661,183]
[null,null,"2014-05-02",16859,131]
[null,null,"2014-05-02",19475,133]
[null,null,"2014-05-02",22580,106]
[null,null,"2014-05-02",29118,174]
[null,null,"2014-05-02",22910,181]
[null,null,"2014-05-02",27816,147]
[null,null,"2014-05-02",30737,185]
[null,null,"2014-05-02",39398,106]
[null,null,"2014-05-02",31722,100]
[null,null,"2014-05-02",40886,104]
[null,null,"2014-05-02",45873,193]
[null,null,"2014-05-02",51749,140]
[null,null,"2014-05-02",67195,172]
[null,null,"2014-05-02",66540,184]
[null,null,"2014-05-02",80131,190]
[null,null,"2014-05-02",84616,192]
[null,null,"2014-05-02",5541,488]
[null,null,"2014-05-02",9834,473]
[null,null,"2014-05-02",17974,428]
[null,null,"2014-05-02",14602,315]
[null,null,"2014-05-02",13667,441]
[null,null,"2014-05-02",29499,398]
[null,null,"2014-05-02",26651,408]
[null,null,"2014-05-02",21176,497]
[null,null,"2014-05-02",38365,258]
[null,null,"2014-05-02",48340,216]
[null,null,"2014-05-03",7657,42]
[null,null,"2014-05-03",18841,48]
[null,null,"2014-05-03",14110,12]
[null,null,"2014-05-03",21057,43]
[null,null,"2014-05-03",26926,17]
[null,null,"2014-05-03",24935,3]
[null,null,"2014-05-03",36848,3]
[null,null,"2014-05-03",34232,47]
[null,null,"2014-05-03",46537,19]
[null,null,"2014-05-03",72647,1]
[null,null,"2014-05-03",1336,80]
[null,null,"2014-05-03",32,57]
[null,null,"2014-05-03",10027,54]
[null,null,"2014-05-03",19728,87]
[null,null,"2014-05-03",28235,56]
[null,null,"2014-05-03",29644,78]
[null,null,"2014-05-03",42517,58]
[null,null,"2014-05-03",43620,58]
[null,null,"2014-05-03",52962,67]
[null,null,"2014-05-03",4427,141]
[null,null,"2014-05-03",25273,162]
[null,null,"2014-05-03",28362,117]
[null,null,"2014-05-03",22091,131]
[null,null,"2014-05-03",57733,198]
[null,null,"2014-05-03",4502,256]
[null,null,"2014-05-03",13178,208]
[null,null,"2014-05-03",18418,495]
[null,null,"2014-05-03",45437,331]
[null,null,"2014-05-04",6294,29]
[null,null,"2014-05-04",4937,9]
[null,null,"2014-05-04",12227,23]
[null,null,"2014-05-04",16986,2]
[null,null,"2014-05-04",15947,27]
[null,null,"2014-05-04",19245,35]
[null,null,"2014-05-04",22187,1]
[null,null,"2014-05-04",26240,38]
[null,null,"2014-05-04",28619,10]
[null,null,"2014-05-04",22714,23]
[null,null,"2014-05-04",39353,1]
[null,null,"2014-05-04",50283,25]
[null,null,"2014-05-04",93057,35]
[null,null,"2014-05-04",7886,72]
[null,null,"2014-05-04",18856,74]
[null,null,"2014-05-04",10213,61]
[null,null,"2014-05-04",13896,82]
[null,null,"2014-05-04",26910,70]
[null,null,"2014-05-04",27725,61]
[null,null,"2014-05-04",20071,80]
[null,null,"2014-05-04",23522,64]
[null,null,"2014-05-04",28509,55]
[null,null,"2014-05-04",26532,97]
[null,null,"2014-05-04",36842,86]
[null,null,"2014-05-04",47079,100]
[null,null,"2014-05-04",54538,80]
[null,null,"2014-05-04",74767,50]
[null,null,"2014-05-04",78701,83]
[null,null,"2014-05-04",1122,182]
[null,null,"2014-05-04",11256,175]
[null,null,"2014-05-04",17731,169]
[null,null,"2014-05-04",12750,184]
[null,null,"2014-05-04",13622,140]
[null,null,"2014-05-04",14263,167]
[null,null,"2014-05-04",13799,186]
[null,null,"2014-05-04",20672,161]
[null,null,"2014-05-04",31445,106]
[null,null,"2014-05-04",48157,159]
[null,null,"2014-05-04",68891,106]
[null,null,"2014-05-04",6063,420]
[null,null,"2014-05-04",12672,376]
[null,null,"2014-05-04",14378,494]
[null,null,"2014-05-04",19454,309]
[null,null,"2014-05-04",24452,287]
[null,null,"2014-05-04",26195,295]
[null,null,"2014-05-04",60607,231]
[null,null,"2014-05-05",7771,40]
[null,null,"2014-05-05",1394,36]
[null,null,"2014-05-05",352,6]
[null,null,"2014-05-05",19466,3]
[null,null,"2014-05-05",26607,49]
[null,null,"2014-05-05",23374,45]
[null,null,"2014-05-05",22902,14]
[null,null,"2014-05-05",26674,49]
[null,null,"2014-05-05",45586,33]
[null,null,"2014-05-05",60908,26]
[null,null,"2014-05-05",433,57]
[null,null,"2014-05-05",19559,90]
[null,null,"2014-05-05",10637,80]
[null,null,"2014-05-05",14125,91]
[null,null,"2014-05-05",13368,92]
[null,null,"2014-05-05",10443,65]
[null,null,"2014-05-05",27481,75]
[null,null,"2014-05-05",25838,51]
[null,null,"2014-05-05",20179,75]
[null,null,"2014-05-05",26303,66]
[null,null,"2014-05-05",34203,80]
[null,null,"2014-05-05",46274,52]
[null,null,"2014-05-05",6726,163]
[null,null,"2014-05-05",9863,136]
[null,null,"2014-05-05",1125,152]
[null,null,"2014-05-05",13731,129]
[null,null,"2014-05-05",14395,188]
[null,null,"2014-05-05",19450,175]
[null,null,"2014-05-05",29952,152]
[null,null,"2014-05-05",41882,190]
[null,null,"2014-05-05",67579,105]
[null,null,"2014-05-05",97488,120]
[null,null,"2014-05-05",8389,333]
[null,null,"2014-05-05",7619,259]
[null,null,"2014-05-05",22763,236]
[null,null,"2014-05-05",30802,319]
[null,null,"2014-05-05",33703,377]
[null,null,"2014-05-05",41783,334]
[null,null,"2014-05-05",58905,295]
[null,null,"2014-05-06",5275,23]
[null,null,"2014-05-06",3643,22]
[null,null,"2014-05-06",6729,3]
[null,null,"2014-05-06",19595,26]
[null,null,"2014-05-06",13324,43]
[null,null,"2014-05-06",41364,2]
[null,null,"2014-05-06",43974,42]
[null,null,"2014-05-06",63788,45]
[null,null,"2014-05-06",77240,35]
[null,null,"2014-05-06",84359,44]
[null,null,"2014-05-06",98082,8]
[null,null,"2014-05-06",4837,52]
[null,null,"2014-05-06",763,58]
[null,null,"2014-05-06",9311,60]
[null,null,"2014-05-06",16762,71]
[null,null,"2014-05-06",13722,53]
[null,null,"2014-05-06",14981,89]
[null,null,"2014-05-06",12993,68]
[null,null,"2014-05-06",25989,84]
[null,null,"2014-05-06",28133,62]
[null,null,"2014-05-06",29257,74]
[null,null,"2014-05-06",33448,95]
[null,null,"2014-05-06",30319,77]
[null,null,"2014-05-06",42376,70]
[null,null,"2014-05-06",42173,97]
[null,null,"2014-05-06",51520,74]
[null,null,"2014-05-06",76654,94]
[null,null,"2014-05-06",93224,89]
[null,null,"2014-05-06",3137,196]
[null,null,"2014-05-06",3843,136]
[null,null,"2014-05-06",17985,197]
[null,null,"2014-05-06",14730,147]
[null,null,"2014-05-06",27992,150]
[null,null,"2014-05-06",24976,165]
[null,null,"2014-05-06",42289,172]
[null,null,"2014-05-06",44075,196]
[null,null,"2014-05-06",61802,183]
[null,null,"2014-05-06",71993,150]
[null,null,"2014-05-06",13033,300]
[null,null,"2014-05-06",15659,445]
[null,null,"2014-05-06",38778,234]
[null,null,"2014-05-06",34971,370]
[null,null,"2014-05-06",59255,403]
[null,null,"2014-05-07",6207,49]
[null,null,"2014-05-07",2670,1]
[null,null,"2014-05-07",8284,40]
[null,null,"2014-05-07",18899,14]
[null,null,"2014-05-07",15200,7]
[null,null,"2014-05-07",17155,46]
[null,null,"2014-05-07",18891,13]
[null,null,"2014-05-07",18210,24]
[null,null,"2014-05-07",17059,6]
[null,null,"2014-05-07",27858,26]
[null,null,"2014-05-07",21742,48]
[null,null,"2014-05-07",27137,12]
[null,null,"2014-05-07",32084,10]
[null,null,"2014-05-07",39290,3]
[null,null,"2014-05-07",35804,49]
[null,null,"2014-05-07",41373,19]
[null,null,"2014-05-07",51677,7]
[null,null,"2014-05-07",61308,26]
[null,null,"2014-05-07",80762,42]
[null,null,"2014-05-07",7845,86]
[null,null,"2014-05-07",7619,56]
[null,null,"2014-05-07",9434,72]
[null,null,"2014-05-07",14024,57]
[null,null,"2014-05-07",19339,75]
[null,null,"2014-05-07",10799,60]
[null,null,"2014-05-07",16922,67]
[null,null,"2014-05-07",26983,78]
[null,null,"2014-05-07",33887,53]
[null,null,"2014-05-07",39780,79]
[null,null,"2014-05-07",34382,64]
[null,null,"2014-05-07",42324,66]
[null,null,"2014-05-07",57671,87]
[null,null,"2014-05-07",56418,50]
[null,null,"2014-05-07",1289,101]
[null,null,"2014-05-07",18170,122]
[null,null,"2014-05-07",16382,135]
[null,null,"2014-05-07",16517,156]
[null,null,"2014-05-07",15026,176]
[null,null,"2014-05-07",19929,140]
[null,null,"2014-05-07",28989,121]
[null,null,"2014-05-07",27773,200]
[null,null,"2014-05-07",35540,185]
[null,null,"2014-05-07",35463,156]
[null,null,"2014-05-07",48348,173]
[null,null,"2014-05-07",788,410]
[null,null,"2014-05-07",8955,372]
[null,null,"2014-05-07",27119,253]
[null,null,"2014-05-07",31428,488]
[null,null,"2014-05-07",46300,388]
[null,null,"2014-05-08",3631,18]
[null,null,"2014-05-08",5544,45]
[null,null,"2014-05-08",8410,22]
[null,null,"2014-05-08",11230,11]
[null,null,"2014-05-08",10845,17]
[null,null,"2014-05-08",14695,45]
[null,null,"2014-05-08",24428,35]
[null,null,"2014-05-08",26891,6]
[null,null,"2014-05-08",29443,19]
[null,null,"2014-05-08",31857,22]
[null,null,"2014-05-08",37279,15]
[null,null,"2014-05-08",44768,30]
[null,null,"2014-05-08",59659,21]
[null,null,"2014-05-08",53683,35]
[null,null,"2014-05-08",57188,17]
[null,null,"2014-05-08",97776,25]
[null,null,"2014-05-08",1248,57]
[null,null,"2014-05-08",8297,95]
[null,null,"2014-05-08",11734,100]
[null,null,"2014-05-08",10826,60]
[null,null,"2014-05-08",17313,96]
[null,null,"2014-05-08",18943,78]
[null,null,"2014-05-08",28918,96]
[null,null,"2014-05-08",37834,99]
[null,null,"2014-05-08",30385,61]
[null,null,"2014-05-08",33512,94]
[null,null,"2014-05-08",46835,70]
[null,null,"2014-05-08",40803,51]
[null,null,"2014-05-08",41847,86]
[null,null,"2014-05-08",76186,94]
[null,null,"2014-05-08",74277,71]
[null,null,"2014-05-08",6662,143]
[null,null,"2014-05-08",4425,187]
[null,null,"2014-05-08",10721,101]
[null,null,"2014-05-08",17473,190]
[null,null,"2014-05-08",11769,127]
[null,null,"2014-05-08",17690,100]
[null,null,"2014-05-08",50083,167]
[null,null,"2014-05-08",78499,132]
[null,null,"2014-05-08",761,346]
[null,null,"2014-05-08",5468,450]
[null,null,"2014-05-08",18662,227]
[null,null,"2014-05-08",17156,465]
[null,null,"2014-05-08",15349,387]
[null,null,"2014-05-08",12099,229]
[null,null,"2014-05-08",29324,400]
[null,null,"2014-05-08",35690,311]
[null,null,"2014-05-08",57308,434]
[null,null,"2014-05-09",16562,11]
[null,null,"2014-05-09",11809,34]
[null,null,"2014-05-09",10180,7]
[null,null,"2014-05-09",21313,47]
[null,null,"2014-05-09",37128,13]
[null,null,"2014-05-09",36900,34]
[null,null,"2014-05-09",44123,17]
[null,null,"2014-05-09",40283,29]
[null,null,"2014-05-09",57736,37]
[null,null,"2014-05-09",9739,62]
[null,null,"2014-05-09",6171,75]
[null,null,"2014-05-09",6974,93]
[null,null,"2014-05-09",8955,63]
[null,null,"2014-05-09",18621,83]
[null,null,"2014-05-09",15372,82]
[null,null,"2014-05-09",10290,68]
[null,null,"2014-05-09",15031,66]
[null,null,"2014-05-09",14207,56]
[null,null,"2014-05-09",17739,50]
[null,null,"2014-05-09",22825,59]
[null,null,"2014-05-09",21258,64]
[null,null,"2014-05-09",35356,61]
[null,null,"2014-05-09",49982,52]
[null,null,"2014-05-09",42771,69]
[null,null,"2014-05-09",49209,61]
[null,null,"2014-05-09",46965,64]
[null,null,"2014-05-09",52947,76]
[null,null,"2014-05-09",64668,80]
[null,null,"2014-05-09",8448,146]
[null,null,"2014-05-09",8619,181]
[null,null,"2014-05-09",2484,174]
[null,null,"2014-05-09",14345,176]
[null,null,"2014-05-09",12805,144]
[null,null,"2014-05-09",12997,112]
[null,null,"2014-05-09",14794,111]
[null,null,"2014-05-09",21982,177]
[null,null,"2014-05-09",31338,110]
[null,null,"2014-05-09",41559,159]
[null,null,"2014-05-09",45566,129]
[null,null,"2014-05-09",53166,103]
[null,null,"2014-05-09",63434,148]
[null,null,"2014-05-09",12290,396]
[null,null,"2014-05-09",14032,470]
[null,null,"2014-05-09",28934,360]
[null,null,"2014-05-09",34968,218]
[null,null,"2014-05-09",45807,308]
[null,null,"2014-05-09",58303,400]
[null,null,"2014-05-10",24992,31]
[null,null,"2014-05-10",37966,12]
[null,null,"2014-05-10",39234,44]
[null,null,"2014-05-10",47539,12]
[null,null,"2014-05-10",66746,5]
[null,null,"2014-05-10",12653,82]
[null,null,"2014-05-10",15800,89]
[null,null,"2014-05-10",27627,55]
[null,null,"2014-05-10",26451,59]
[null,null,"2014-05-10",38234,95]
[null,null,"2014-05-10",36788,82]
[null,null,"2014-05-10",45982,100]
[null,null,"2014-05-10",6270,136]
[null,null,"2014-05-10",7003,171]
[null,null,"2014-05-10",28305,179]
[null,null,"2014-05-10",43650,200]
[null,null,"2014-05-10",42945,183]
[null,null,"2014-05-10",69138,177]
[null,null,"2014-05-10",76844,120]
[null,null,"2014-05-10",77586,162]
[null,null,"2014-05-10",8538,450]
[null,null,"2014-05-10",3658,441]
[null,null,"2014-05-10",28384,234]
[null,null,"2014-05-10",34486,342]
[null,null,"2014-05-10",39992,239]
[null,null,"2014-05-10",49431,226]
[null,null,"2014-05-10",43178,302]
[null,null,"2014-05-10",65273,363]
[null,null,"2014-05-11",8327,4]
[null,null,"2014-05-11",2163,20]
[null,null,"2014-05-11",8189,9]
[null,null,"2014-05-11",19529,36]
[null,null,"2014-05-11",16532,25]
[null,null,"2014-05-11",18116,27]
[null,null,"2014-05-11",24383,25]
[null,null,"2014-05-11",78278,21]
[null,null,"2014-05-11",7225,95]
[null,null,"2014-05-11",524,51]
[null,null,"2014-05-11",7919,84]
[null,null,"2014-05-11",4437,88]
[null,null,"2014-05-11",14828,87]
[null,null,"2014-05-11",16134,93]
[null,null,"2014-05-11",13423,55]
[null,null,"2014-05-11",18728,98]
[null,null,"2014-05-11",21472,62]
[null,null,"2014-05-11",25274,80]
[null,null,"2014-05-11",37261,61]
[null,null,"2014-05-11",39318,85]
[null,null,"2014-05-11",47398,75]
[null,null,"2014-05-11",54614,64]
[null,null,"2014-05-11",2045,193]
[null,null,"2014-05-11",3155,175]
[null,null,"2014-05-11",5969,161]
[null,null,"2014-05-11",14351,142]
[null,null,"2014-05-11",11392,163]
[null,null,"2014-05-11",26631,169]
[null,null,"2014-05-11",31348,109]
[null,null,"2014-05-11",45447,132]
[null,null,"2014-05-11",72539,147]
[null,null,"2014-05-11",13404,289]
[null,null,"2014-05-11",10116,382]
[null,null,"2014-05-11",14067,290]
[null,null,"2014-05-11",12544,307]
[null,null,"2014-05-11",12964,483]
[null,null,"2014-05-11",24429,321]
[null,null,"2014-05-11",53387,472]
[null,null,"2014-05-12",13120,27]
[null,null,"2014-05-12",13665,4]
[null,null,"2014-05-12",10675,32]
[null,null,"2014-05-12",27226,33]
[null,null,"2014-05-12",27396,23]
[null,null,"2014-05-12",53658,38]
[null,null,"2014-05-12",50647,39]
[null,null,"2014-05-12",56428,42]
[null,null,"2014-05-12",69424,4]
[null,null,"2014-05-12",71202,4]
[null,null,"2014-05-12",6086,86]
[null,null,"2014-05-12",11227,72]
[null,null,"2014-05-12",15644,93]
[null,null,"2014-05-12",25168,76]
[null,null,"2014-05-12",21685,72]
[null,null,"2014-05-12",42629,50]
[null,null,"2014-05-12",58800,66]
[null,null,"2014-05-12",3745,184]
[null,null,"2014-05-12",10099,155]
[null,null,"2014-05-12",15357,164]
[null,null,"2014-05-12",19465,118]
[null,null,"2014-05-12",27387,193]
[null,null,"2014-05-12",27597,200]
[null,null,"2014-05-12",34963,150]
[null,null,"2014-05-12",47414,195]
[null,null,"2014-05-12",50558,140]
[null,null,"2014-05-12",54628,161]
[null,null,"2014-05-12",68852,144]
[null,null,"2014-05-12",66252,118]
[null,null,"2014-05-12",77026,119]
[null,null,"2014-05-12",71063,175]
[null,null,"2014-05-12",92810,184]
[null,null,"2014-05-12",4822,233]
[null,null,"2014-05-12",13013,213]
[null,null,"2014-05-12",22647,209]
[null,null,"2014-05-12",25884,314]
[null,null,"2014-05-12",37331,363]
[null,null,"2014-05-12",41260,496]
[null,null,"2014-05-12",59053,264]
[null,null,"2014-05-13",1884,4]
[null,null,"2014-05-13",15001,14]
[null,null,"2014-05-13",25926,9]
[null,null,"2014-05-13",39059,8]
[null,null,"2014-05-13",34338,11]
[null,null,"2014-05-13",40356,49]
[null,null,"2014-05-13",55675,12]
[null,null,"2014-05-13",68237,23]
[null,null,"2014-05-13",8517,98]
[null,null,"2014-05-13",7024,89]
[null,null,"2014-05-13",6048,53]
[null,null,"2014-05-13",3066,78]
[null,null,"2014-05-13",6400,95]
[null,null,"2014-05-13",6960,81]
[null,null,"2014-05-13",2189,75]
[null,null,"2014-05-13",11051,60]
[null,null,"2014-05-13",15438,71]
[null,null,"2014-05-13",16608,83]
[null,null,"2014-05-13",14423,86]
[null,null,"2014-05-13",27445,81]
[null,null,"2014-05-13",28513,72]
[null,null,"2014-05-13",24383,80]
[null,null,"2014-05-13",28479,81]
[null,null,"2014-05-13",21028,57]
[null,null,"2014-05-13",49051,81]
[null,null,"2014-05-13",68517,96]
[null,null,"2014-05-13",77544,84]
[null,null,"2014-05-13",6652,155]
[null,null,"2014-05-13",6838,135]
[null,null,"2014-05-13",3385,195]
[null,null,"2014-05-13",14218,102]
[null,null,"2014-05-13",11335,112]
[null,null,"2014-05-13",15973,123]
[null,null,"2014-05-13",10448,176]
[null,null,"2014-05-13",16405,150]
[null,null,"2014-05-13",15606,198]
[null,null,"2014-05-13",15784,173]
[null,null,"2014-05-13",20704,101]
[null,null,"2014-05-13",34125,109]
[null,null,"2014-05-13",60050,114]
[null,null,"2014-05-13",65387,161]
[null,null,"2014-05-13",2202,443]
[null,null,"2014-05-13",13031,373]
[null,null,"2014-05-13",28409,379]
[null,null,"2014-05-13",23705,464]
[null,null,"2014-05-13",31585,340]
[null,null,"2014-05-13",37922,352]
[null,null,"2014-05-13",49064,280]
[null,null,"2014-05-14",14327,45]
[null,null,"2014-05-14",16977,14]
[null,null,"2014-05-14",17239,18]
[null,null,"2014-05-14",17250,25]
[null,null,"2014-05-14",29885,5]
[null,null,"2014-05-14",20063,47]
[null,null,"2014-05-14",25195,21]
[null,null,"2014-05-14",36897,17]
[null,null,"2014-05-14",45512,3]
[null,null,"2014-05-14",77312,20]
[null,null,"2014-05-14",76825,4]
[null,null,"2014-05-14",93471,25]
[null,null,"2014-05-14",5037,100]
[null,null,"2014-05-14",6940,62]
[null,null,"2014-05-14",8656,78]
[null,null,"2014-05-14",9257,99]
[null,null,"2014-05-14",10020,79]
[null,null,"2014-05-14",12963,78]
[null,null,"2014-05-14",17066,92]
[null,null,"2014-05-14",15929,94]
[null,null,"2014-05-14",18187,72]
[null,null,"2014-05-14",15783,53]
[null,null,"2014-05-14",27892,88]
[null,null,"2014-05-14",26465,65]
[null,null,"2014-05-14",59288,86]
[null,null,"2014-05-14",1877,186]
[null,null,"2014-05-14",1110,124]
[null,null,"2014-05-14",7145,128]
[null,null,"2014-05-14",4983,129]
[null,null,"2014-05-14",5609,152]
[null,null,"2014-05-14",16114,153]
[null,null,"2014-05-14",15528,179]
[null,null,"2014-05-14",26869,146]
[null,null,"2014-05-14",22034,113]
[null,null,"2014-05-14",33693,108]
[null,null,"2014-05-14",46803,168]
[null,null,"2014-05-14",51932,172]
[null,null,"2014-05-14",64782,143]
[null,null,"2014-05-14",68841,198]
[null,null,"2014-05-14",2310,286]
[null,null,"2014-05-14",2776,457]
[null,null,"2014-05-14",7746,455]
[null,null,"2014-05-14",20290,347]
[null,null,"2014-05-14",33259,442]
[null,null,"2014-05-15",2459,34]
[null,null,"2014-05-15",6206,9]
[null,null,"2014-05-15",19101,29]
[null,null,"2014-05-15",14647,32]
[null,null,"2014-05-15",23234,45]
[null,null,"2014-05-15",37689,32]
[null,null,"2014-05-15",41931,10]
[null,null,"2014-05-15",43919,2]
[null,null,"2014-05-15",53038,43]
[null,null,"2014-05-15",1473,63]
[null,null,"2014-05-15",4715,92]
[null,null,"2014-05-15",11021,66]
[null,null,"2014-05-15",17503,98]
[null,null,"2014-05-15",16153,52]
[null,null,"2014-05-15",12351,94]
[null,null,"2014-05-15",17253,60]
[null,null,"2014-05-15",28726,55]
[null,null,"2014-05-15",28809,99]
[null,null,"2014-05-15",45610,62]
[null,null,"2014-05-15",47794,86]
[null,null,"2014-05-15",2275,168]
[null,null,"2014-05-15",16843,187]
[null,null,"2014-05-15",16840,139]
[null,null,"2014-05-15",16333,177]
[null,null,"2014-05-15",15308,149]
[null,null,"2014-05-15",12461,128]
[null,null,"2014-05-15",11277,120]
[null,null,"2014-05-15",13702,133]
[null,null,"2014-05-15",25790,135]
[null,null,"2014-05-15",31614,192]
[null,null,"2014-05-15",46059,146]
[null,null,"2014-05-15",55553,157]
[null,null,"2014-05-15",56948,125]
[null,null,"2014-05-15",51414,147]
[null,null,"2014-05-15",9612,237]
[null,null,"2014-05-15",2059,320]
[null,null,"2014-05-15",1298,218]
[null,null,"2014-05-15",18574,228]
[null,null,"2014-05-15",16776,225]
[null,null,"2014-05-15",27848,211]
[null,null,"2014-05-15",23448,325]
[null,null,"2014-05-15",35661,462]
[null,null,"2014-05-15",48556,421]
[null,null,"2014-05-16",8437,34]
[null,null,"2014-05-16",2965,22]
[null,null,"2014-05-16",9849,40]
[null,null,"2014-05-16",7834,16]
[null,null,"2014-05-16",9097,1]
[null,null,"2014-05-16",5170,3]
[null,null,"2014-05-16",17368,39]
[null,null,"2014-05-16",12164,41]
[null,null,"2014-05-16",17286,1]
[null,null,"2014-05-16",34614,4]
[null,null,"2014-05-16",50959,5]
[null,null,"2014-05-16",64628,48]
[null,null,"2014-05-16",149,85]
[null,null,"2014-05-16",6964,79]
[null,null,"2014-05-16",14390,76]
[null,null,"2014-05-16",19993,87]
[null,null,"2014-05-16",15808,87]
[null,null,"2014-05-16",23980,68]
[null,null,"2014-05-16",29886,52]
[null,null,"2014-05-16",24778,92]
[null,null,"2014-05-16",24722,83]
[null,null,"2014-05-16",27766,52]
[null,null,"2014-05-16",39286,83]
[null,null,"2014-05-16",36805,77]
[null,null,"2014-05-16",40653,64]
[null,null,"2014-05-16",42787,86]
[null,null,"2014-05-16",96068,91]
[null,null,"2014-05-16",7409,117]
[null,null,"2014-05-16",17487,116]
[null,null,"2014-05-16",26425,112]
[null,null,"2014-05-16",27309,133]
[null,null,"2014-05-16",60825,105]
[null,null,"2014-05-16",6972,317]
[null,null,"2014-05-16",10081,208]
[null,null,"2014-05-16",20240,317]
[null,null,"2014-05-16",24028,385]
[null,null,"2014-05-16",34998,401]
[null,null,"2014-05-16",42676,429]
[null,null,"2014-05-16",52161,266]
[null,null,"2014-05-16",65887,496]
[null,null,"2014-05-16",75774,381]
[null,null,"2014-05-17",1986,27]
[null,null,"2014-05-17",3328,29]
[null,null,"2014-05-17",19968,8]
[null,null,"2014-05-17",17311,18]
[null,null,"2014-05-17",26051,48]
[null,null,"2014-05-17",38914,39]
[null,null,"2014-05-17",30833,37]
[null,null,"2014-05-17",45291,50]
[null,null,"2014-05-17",51657,10]
[null,null,"2014-05-17",50254,2]
[null,null,"2014-05-17",832,53]
[null,null,"2014-05-17",16737,70]
[null,null,"2014-05-17",12881,52]
[null,null,"2014-05-17",13944,58]
[null,null,"2014-05-17",27346,56]
[null,null,"2014-05-17",32459,91]
[null,null,"2014-05-17",34231,87]
[null,null,"2014-05-17",59940,75]
[null,null,"2014-05-17",62558,67]
[null,null,"2014-05-17",87785,83]
[null,null,"2014-05-17",8911,138]
[null,null,"2014-05-17",18680,126]
[null,null,"2014-05-17",10960,159]
[null,null,"2014-05-17",14193,180]
[null,null,"2014-05-17",24584,171]
[null,null,"2014-05-17",29569,197]
[null,null,"2014-05-17",22376,131]
[null,null,"2014-05-17",21748,160]
[null,null,"2014-05-17",37251,184]
[null,null,"2014-05-17",30526,102]
[null,null,"2014-05-17",44361,180]
[null,null,"2014-05-17",54990,105]
[null,null,"2014-05-17",12210,285]
[null,null,"2014-05-17",14546,500]
[null,null,"2014-05-17",14499,241]
[null,null,"2014-05-17",36022,282]
[null,null,"2014-05-18",3712,30]
[null,null,"2014-05-18",12996,4]
[null,null,"2014-05-18",17307,47]
[null,null,"2014-05-18",23258,34]
[null,null,"2014-05-18",25084,10]
[null,null,"2014-05-18",31193,39]
[null,null,"2014-05-18",42607,11]
[null,null,"2014-05-18",40282,46]
[null,null,"2014-05-18",48943,2]
[null,null,"2014-05-18",54916,27]
[null,null,"2014-05-18",3156,78]
[null,null,"2014-05-18",4618,70]
[null,null,"2014-05-18",9784,91]
[null,null,"2014-05-18",2182,100]
[null,null,"2014-05-18",10345,93]
[null,null,"2014-05-18",13320,98]
[null,null,"2014-05-18",13246,96]
[null,null,"2014-05-18",18363,65]
[null,null,"2014-05-18",29186,83]
[null,null,"2014-05-18",20593,53]
[null,null,"2014-05-18",31893,93]
[null,null,"2014-05-18",39824,71]
[null,null,"2014-05-18",42496,65]
[null,null,"2014-05-18",41501,76]
[null,null,"2014-05-18",76707,54]
[null,null,"2014-05-18",3199,180]
[null,null,"2014-05-18",7396,150]
[null,null,"2014-05-18",2666,128]
[null,null,"2014-05-18",10559,157]
[null,null,"2014-05-18",12636,101]
[null,null,"2014-05-18",18455,154]
[null,null,"2014-05-18",29780,123]
[null,null,"2014-05-18",21875,199]
[null,null,"2014-05-18",26460,135]
[null,null,"2014-05-18",34904,199]
[null,null,"2014-05-18",32568,120]
[null,null,"2014-05-18",36158,140]
[null,null,"2014-05-18",1153,224]
[null,null,"2014-05-18",8030,332]
[null,null,"2014-05-18",3296,227]
[null,null,"2014-05-18",155,221]
[null,null,"2014-05-18",15292,478]
[null,null,"2014-05-18",25886,369]
[null,null,"2014-05-18",25412,446]
[null,null,"2014-05-18",28183,267]
[null,null,"2014-05-19",1762,5]
[null,null,"2014-05-19",16494,19]
[null,null,"2014-05-19",13255,38]
[null,null,"2014-05-19",14880,46]
[null,null,"2014-05-19",18871,19]
[null,null,"2014-05-19",29301,39]
[null,null,"2014-05-19",32785,20]
[null,null,"2014-05-19",38608,34]
[null,null,"2014-05-19",40952,36]
[null,null,"2014-05-19",49699,16]
[null,null,"2014-05-19",61224,1]
[null,null,"2014-05-19",4888,64]
[null,null,"2014-05-19",4024,74]
[null,null,"2014-05-19",116,66]
[null,null,"2014-05-19",19728,67]
[null,null,"2014-05-19",27439,56]
[null,null,"2014-05-19",23283,61]
[null,null,"2014-05-19",20970,95]
[null,null,"2014-05-19",44297,100]
[null,null,"2014-05-19",49829,71]
[null,null,"2014-05-19",56327,99]
[null,null,"2014-05-19",54993,88]
[null,null,"2014-05-19",87035,85]
[null,null,"2014-05-19",60,144]
[null,null,"2014-05-19",3709,184]
[null,null,"2014-05-19",14071,101]
[null,null,"2014-05-19",17824,161]
[null,null,"2014-05-19",13233,165]
[null,null,"2014-05-19",21650,159]
[null,null,"2014-05-19",24478,128]
[null,null,"2014-05-19",39648,161]
[null,null,"2014-05-19",41656,122]
[null,null,"2014-05-19",48879,120]
[null,null,"2014-05-19",46881,171]
[null,null,"2014-05-19",93492,107]
[null,null,"2014-05-19",2799,485]
[null,null,"2014-05-19",14158,425]
[null,null,"2014-05-19",27408,471]
[null,null,"2014-05-19",23915,434]
[null,null,"2014-05-19",20839,449]
[null,null,"2014-05-19",27172,332]
[null,null,"2014-05-20",3484,30]
[null,null,"2014-05-20",7281,22]
[null,null,"2014-05-20",19874,18]
[null,null,"2014-05-20",10985,34]
[null,null,"2014-05-20",25405,8]
[null,null,"2014-05-20",28533,18]
[null,null,"2014-05-20",27972,41]
[null,null,"2014-05-20",20942,25]
[null,null,"2014-05-20",24909,35]
[null,null,"2014-05-20",36961,34]
[null,null,"2014-05-20",5968,94]
[null,null,"2014-05-20",1254,94]
[null,null,"2014-05-20",8155,58]
[null,null,"2014-05-20",17110,80]
[null,null,"2014-05-20",14951,51]
[null,null,"2014-05-20",12651,80]
[null,null,"2014-05-20",22348,90]
[null,null,"2014-05-20",20304,75]
[null,null,"2014-05-20",38590,51]
[null,null,"2014-05-20",53348,82]
[null,null,"2014-05-20",61432,61]
[null,null,"2014-05-20",5057,130]
[null,null,"2014-05-20",597,129]
[null,null,"2014-05-20",15533,108]
[null,null,"2014-05-20",22762,147]
[null,null,"2014-05-20",25415,176]
[null,null,"2014-05-20",31737,139]
[null,null,"2014-05-20",49018,195]
[null,null,"2014-05-20",42636,131]
[null,null,"2014-05-20",55529,168]
[null,null,"2014-05-20",17259,477]
[null,null,"2014-05-20",17967,219]
[null,null,"2014-05-20",28436,391]
[null,null,"2014-05-20",32523,328]
[null,null,"2014-05-20",39444,405]
[null,null,"2014-05-20",43223,211]
[null,null,"2014-05-21",5690,9]
[null,null,"2014-05-21",2842,34]
[null,null,"2014-05-21",25544,22]
[null,null,"2014-05-21",20349,5]
[null,null,"2014-05-21",34925,26]
[null,null,"2014-05-21",5816,81]
[null,null,"2014-05-21",14664,51]
[null,null,"2014-05-21",11278,52]
[null,null,"2014-05-21",12715,73]
[null,null,"2014-05-21",15943,61]
[null,null,"2014-05-21",17699,69]
[null,null,"2014-05-21",27651,56]
[null,null,"2014-05-21",24869,67]
[null,null,"2014-05-21",38396,83]
[null,null,"2014-05-21",50717,54]
[null,null,"2014-05-21",73976,65]
[null,null,"2014-05-21",4695,196]
[null,null,"2014-05-21",5702,104]
[null,null,"2014-05-21",15249,102]
[null,null,"2014-05-21",12185,138]
[null,null,"2014-05-21",11176,126]
[null,null,"2014-05-21",19758,138]
[null,null,"2014-05-21",27676,105]
[null,null,"2014-05-21",20114,178]
[null,null,"2014-05-21",28980,145]
[null,null,"2014-05-21",21410,137]
[null,null,"2014-05-21",34728,149]
[null,null,"2014-05-21",31888,174]
[null,null,"2014-05-21",36927,131]
[null,null,"2014-05-21",55381,128]
[null,null,"2014-05-21",73682,195]
[null,null,"2014-05-21",6571,435]
[null,null,"2014-05-21",536,387]
[null,null,"2014-05-21",3911,369]
[null,null,"2014-05-21",9909,296]
[null,null,"2014-05-21",19598,205]
[null,null,"2014-05-21",13419,427]
[null,null,"2014-05-21",20524,252]
[null,null,"2014-05-21",36999,320]
[null,null,"2014-05-21",38853,497]
[null,null,"2014-05-21",51526,420]
[null,null,"2014-05-22",1348,5]
[null,null,"2014-05-22",6242,50]
[null,null,"2014-05-22",7197,48]
[null,null,"2014-05-22",10138,32]
[null,null,"2014-05-22",14944,44]
[null,null,"2014-05-22",13711,8]
[null,null,"2014-05-22",23194,39]
[null,null,"2014-05-22",27035,50]
[null,null,"2014-05-22",37672,13]
[null,null,"2014-05-22",44544,48]
[null,null,"2014-05-22",54991,15]
[null,null,"2014-05-22",59611,27]
[null,null,"2014-05-22",80507,36]
[null,null,"2014-05-22",6685,82]
[null,null,"2014-05-22",5688,65]
[null,null,"2014-05-22",9818,100]
[null,null,"2014-05-22",765,70]
[null,null,"2014-05-22",14919,74]
[null,null,"2014-05-22",18123,87]
[null,null,"2014-05-22",14900,96]
[null,null,"2014-05-22",19955,97]
[null,null,"2014-05-22",17229,80]
[null,null,"2014-05-22",13464,72]
[null,null,"2014-05-22",17432,88]
[null,null,"2014-05-22",21593,54]
[null,null,"2014-05-22",21191,95]
[null,null,"2014-05-22",28997,72]
[null,null,"2014-05-22",28221,66]
[null,null,"2014-05-22",22650,66]
[null,null,"2014-05-22",38692,98]
[null,null,"2014-05-22",42213,77]
[null,null,"2014-05-22",53250,73]
[null,null,"2014-05-22",52884,51]
[null,null,"2014-05-22",79495,73]
[null,null,"2014-05-22",85142,81]
[null,null,"2014-05-22",672,183]
[null,null,"2014-05-22",8068,111]
[null,null,"2014-05-22",1545,130]
[null,null,"2014-05-22",17872,179]
[null,null,"2014-05-22",28042,129]
[null,null,"2014-05-22",27873,169]
[null,null,"2014-05-22",26109,182]
[null,null,"2014-05-22",25996,142]
[null,null,"2014-05-22",31696,112]
[null,null,"2014-05-22",33789,125]
[null,null,"2014-05-22",36180,125]
[null,null,"2014-05-22",40377,151]
[null,null,"2014-05-22",7365,440]
[null,null,"2014-05-22",2435,327]
[null,null,"2014-05-22",4267,483]
[null,null,"2014-05-22",5727,406]
[null,null,"2014-05-22",19110,471]
[null,null,"2014-05-22",16846,479]
[null,null,"2014-05-22",16603,363]
[null,null,"2014-05-22",14462,326]
[null,null,"2014-05-22",24110,355]
[null,null,"2014-05-22",26669,301]
[null,null,"2014-05-23",5805,22]
[null,null,"2014-05-23",6022,41]
[null,null,"2014-05-23",13132,42]
[null,null,"2014-05-23",12228,43]
[null,null,"2014-05-23",24388,47]
[null,null,"2014-05-23",23450,47]
[null,null,"2014-05-23",23247,38]
[null,null,"2014-05-23",36852,40]
[null,null,"2014-05-23",40634,29]
[null,null,"2014-05-23",55909,35]
[null,null,"2014-05-23",71239,26]
[null,null,"2014-05-23",94321,47]
[null,null,"2014-05-23",9834,100]
[null,null,"2014-05-23",3541,79]
[null,null,"2014-05-23",1805,77]
[null,null,"2014-05-23",6060,57]
[null,null,"2014-05-23",17322,83]
[null,null,"2014-05-23",15251,69]
[null,null,"2014-05-23",14600,57]
[null,null,"2014-05-23",23595,56]
[null,null,"2014-05-23",21922,92]
[null,null,"2014-05-23",39671,66]
[null,null,"2014-05-23",37645,73]
[null,null,"2014-05-23",43405,91]
[null,null,"2014-05-23",44315,95]
[null,null,"2014-05-23",48799,85]
[null,null,"2014-05-23",43812,88]
[null,null,"2014-05-23",55562,83]
[null,null,"2014-05-23",55379,91]
[null,null,"2014-05-23",56375,65]
[null,null,"2014-05-23",55926,50]
[null,null,"2014-05-23",10785,143]
[null,null,"2014-05-23",18439,157]
[null,null,"2014-05-23",16870,193]
[null,null,"2014-05-23",16828,200]
[null,null,"2014-05-23",25719,141]
[null,null,"2014-05-23",29306,147]
[null,null,"2014-05-23",25284,121]
[null,null,"2014-05-23",21457,139]
[null,null,"2014-05-23",20123,147]
[null,null,"2014-05-23",32767,177]
[null,null,"2014-05-23",39360,169]
[null,null,"2014-05-23",47207,108]
[null,null,"2014-05-23",49090,128]
[null,null,"2014-05-23",62341,147]
[null,null,"2014-05-23",66756,165]
[null,null,"2014-05-23",11595,450]
[null,null,"2014-05-23",15618,498]
[null,null,"2014-05-23",28644,308]
[null,null,"2014-05-23",28209,358]
[null,null,"2014-05-23",22501,390]
[null,null,"2014-05-23",68756,449]
[null,null,"2014-05-23",71270,365]
[null,null,"2014-05-24",3337,22]
[null,null,"2014-05-24",13371,28]
[null,null,"2014-05-24",16986,10]
[null,null,"2014-05-24",15150,34]
[null,null,"2014-05-24",38021,12]
[null,null,"2014-05-24",58815,39]
[null,null,"2014-05-24",65964,12]
[null,null,"2014-05-24",72823,36]
[null,null,"2014-05-24",97874,7]
[null,null,"2014-05-24",4278,83]
[null,null,"2014-05-24",851,61]
[null,null,"2014-05-24",2225,65]
[null,null,"2014-05-24",1847,70]
[null,null,"2014-05-24",8821,76]
[null,null,"2014-05-24",9306,70]
[null,null,"2014-05-24",8029,61]
[null,null,"2014-05-24",19669,80]
[null,null,"2014-05-24",16158,92]
[null,null,"2014-05-24",17163,91]
[null,null,"2014-05-24",19318,86]
[null,null,"2014-05-24",10476,64]
[null,null,"2014-05-24",21185,90]
[null,null,"2014-05-24",25303,75]
[null,null,"2014-05-24",25951,83]
[null,null,"2014-05-24",24999,76]
[null,null,"2014-05-24",39399,66]
[null,null,"2014-05-24",42769,99]
[null,null,"2014-05-24",54633,90]
[null,null,"2014-05-24",7374,106]
[null,null,"2014-05-24",2945,137]
[null,null,"2014-05-24",9477,101]
[null,null,"2014-05-24",2698,160]
[null,null,"2014-05-24",310,111]
[null,null,"2014-05-24",4677,139]
[null,null,"2014-05-24",9020,150]
[null,null,"2014-05-24",18507,180]
[null,null,"2014-05-24",11974,185]
[null,null,"2014-05-24",13426,108]
[null,null,"2014-05-24",23974,121]
[null,null,"2014-05-24",28550,142]
[null,null,"2014-05-24",26106,135]
[null,null,"2014-05-24",20867,105]
[null,null,"2014-05-24",21655,143]
[null,null,"2014-05-24",22627,120]
[null,null,"2014-05-24",29291,157]
[null,null,"2014-05-24",31266,105]
[null,null,"2014-05-24",40512,173]
[null,null,"2014-05-24",58326,139]
[null,null,"2014-05-24",25870,279]
[null,null,"2014-05-24",28198,279]
[null,null,"2014-05-24",21372,476]
[null,null,"2014-05-24",38042,402]
[null,null,"2014-05-24",30790,488]
[null,null,"2014-05-24",46844,219]
[null,null,"2014-05-24",41371,315]
[null,null,"2014-05-25",6133,42]
[null,null,"2014-05-25",18155,28]
[null,null,"2014-05-25",29736,19]
[null,null,"2014-05-25",25219,7]
[null,null,"2014-05-25",39123,4]
[null,null,"2014-05-25",56751,5]
[null,null,"2014-05-25",57120,15]
[null,null,"2014-05-25",54200,22]
[null,null,"2014-05-25",5860,77]
[null,null,"2014-05-25",5758,51]
[null,null,"2014-05-25",8310,60]
[null,null,"2014-05-25",704,50]
[null,null,"2014-05-25",17011,55]
[null,null,"2014-05-25",24878,65]
[null,null,"2014-05-25",24212,81]
[null,null,"2014-05-25",35710,72]
[null,null,"2014-05-25",57765,51]
[null,null,"2014-05-25",68717,50]
[null,null,"2014-05-25",4058,136]
[null,null,"2014-05-25",7415,108]
[null,null,"2014-05-25",5821,175]
[null,null,"2014-05-25",7297,118]
[null,null,"2014-05-25",3458,188]
[null,null,"2014-05-25",13556,162]
[null,null,"2014-05-25",10909,141]
[null,null,"2014-05-25",13666,186]
[null,null,"2014-05-25",31554,170]
[null,null,"2014-05-25",54907,123]
[null,null,"2014-05-25",5899,492]
[null,null,"2014-05-25",19537,462]
[null,null,"2014-05-25",27929,356]
[null,null,"2014-05-25",34182,270]
[null,null,"2014-05-26",6235,43]
[null,null,"2014-05-26",6559,32]
[null,null,"2014-05-26",14132,19]
[null,null,"2014-05-26",11999,48]
[null,null,"2014-05-26",19988,38]
[null,null,"2014-05-26",18100,21]
[null,null,"2014-05-26",23926,3]
[null,null,"2014-05-26",20265,34]
[null,null,"2014-05-26",42728,48]
[null,null,"2014-05-26",89275,47]
[null,null,"2014-05-26",6679,77]
[null,null,"2014-05-26",7096,90]
[null,null,"2014-05-26",2077,80]
[null,null,"2014-05-26",2185,99]
[null,null,"2014-05-26",15991,55]
[null,null,"2014-05-26",13215,70]
[null,null,"2014-05-26",11626,66]
[null,null,"2014-05-26",10168,74]
[null,null,"2014-05-26",11096,74]
[null,null,"2014-05-26",20560,56]
[null,null,"2014-05-26",26444,76]
[null,null,"2014-05-26",41586,64]
[null,null,"2014-05-26",52526,56]
[null,null,"2014-05-26",58306,95]
[null,null,"2014-05-26",50177,84]
[null,null,"2014-05-26",70088,80]
[null,null,"2014-05-26",1342,194]
[null,null,"2014-05-26",10358,138]
[null,null,"2014-05-26",14043,158]
[null,null,"2014-05-26",10222,115]
[null,null,"2014-05-26",29475,157]
[null,null,"2014-05-26",26100,173]
[null,null,"2014-05-26",26493,126]
[null,null,"2014-05-26",29518,169]
[null,null,"2014-05-26",39080,170]
[null,null,"2014-05-26",36554,178]
[null,null,"2014-05-26",48121,160]
[null,null,"2014-05-26",54505,115]
[null,null,"2014-05-26",88360,175]
[null,null,"2014-05-26",7739,349]
[null,null,"2014-05-26",8391,258]
[null,null,"2014-05-26",13274,416]
[null,null,"2014-05-26",25957,315]
[null,null,"2014-05-26",43999,437]
[null,null,"2014-05-26",43961,307]
[null,null,"2014-05-26",56476,363]
[null,null,"2014-05-27",1543,33]
[null,null,"2014-05-27",6237,45]
[null,null,"2014-05-27",4435,19]
[null,null,"2014-05-27",18765,18]
[null,null,"2014-05-27",19207,10]
[null,null,"2014-05-27",26875,11]
[null,null,"2014-05-27",34641,24]
[null,null,"2014-05-27",33648,18]
[null,null,"2014-05-27",48502,23]
[null,null,"2014-05-27",83130,36]
[null,null,"2014-05-27",937,71]
[null,null,"2014-05-27",5853,51]
[null,null,"2014-05-27",11184,93]
[null,null,"2014-05-27",18776,64]
[null,null,"2014-05-27",15888,83]
[null,null,"2014-05-27",29479,81]
[null,null,"2014-05-27",41690,79]
[null,null,"2014-05-27",59223,76]
[null,null,"2014-05-27",58921,52]
[null,null,"2014-05-27",2590,179]
[null,null,"2014-05-27",3854,121]
[null,null,"2014-05-27",30062,125]
[null,null,"2014-05-27",30307,121]
[null,null,"2014-05-27",44129,176]
[null,null,"2014-05-27",59188,159]
[null,null,"2014-05-27",60601,119]
[null,null,"2014-05-27",70879,102]
[null,null,"2014-05-27",319,319]
[null,null,"2014-05-27",26050,218]
[null,null,"2014-05-27",30066,431]
[null,null,"2014-05-27",45602,341]
[null,null,"2014-05-27",55309,267]
[null,null,"2014-05-27",64583,418]
[null,null,"2014-05-28",16783,9]
[null,null,"2014-05-28",10189,50]
[null,null,"2014-05-28",19276,19]
[null,null,"2014-05-28",13104,11]
[null,null,"2014-05-28",21817,2]
[null,null,"2014-05-28",23923,23]
[null,null,"2014-05-28",29089,40]
[null,null,"2014-05-28",30661,25]
[null,null,"2014-05-28",44853,3]
[null,null,"2014-05-28",53374,15]
[null,null,"2014-05-28",65510,9]
[null,null,"2014-05-28",7731,69]
[null,null,"2014-05-28",1674,60]
[null,null,"2014-05-28",3105,85]
[null,null,"2014-05-28",10144,79]
[null,null,"2014-05-28",23598,80]
[null,null,"2014-05-28",29812,81]
[null,null,"2014-05-28",35048,85]
[null,null,"2014-05-28",32416,66]
[null,null,"2014-05-28",54071,92]
[null,null,"2014-05-28",68930,57]
[null,null,"2014-05-28",85206,90]
[null,null,"2014-05-28",4186,124]
[null,null,"2014-05-28",8729,107]
[null,null,"2014-05-28",9984,159]
[null,null,"2014-05-28",17791,117]
[null,null,"2014-05-28",33231,146]
[null,null,"2014-05-28",35198,193]
[null,null,"2014-05-28",42836,126]
[null,null,"2014-05-28",54529,153]
[null,null,"2014-05-28",56802,186]
[null,null,"2014-05-28",63870,128]
[null,null,"2014-05-28",74006,130]
[null,null,"2014-05-28",11412,368]
[null,null,"2014-05-28",10292,245]
[null,null,"2014-05-28",29809,278]
[null,null,"2014-05-28",23708,288]
[null,null,"2014-05-28",35180,335]
[null,null,"2014-05-28",54501,360]
[null,null,"2014-05-29",7487,27]
[null,null,"2014-05-29",3526,2]
[null,null,"2014-05-29",17996,15]
[null,null,"2014-05-29",29297,34]
[null,null,"2014-05-29",22778,45]
[null,null,"2014-05-29",40378,20]
[null,null,"2014-05-29",49494,6]
[null,null,"2014-05-29",42221,15]
[null,null,"2014-05-29",53858,33]
[null,null,"2014-05-29",69790,47]
[null,null,"2014-05-29",98256,7]
[null,null,"2014-05-29",2876,71]
[null,null,"2014-05-29",6542,81]
[null,null,"2014-05-29",473,74]
[null,null,"2014-05-29",9876,51]
[null,null,"2014-05-29",5063,73]
[null,null,"2014-05-29",7068,85]
[null,null,"2014-05-29",8921,52]
[null,null,"2014-05-29",1769,63]
[null,null,"2014-05-29",5065,99]
[null,null,"2014-05-29",2795,68]
[null,null,"2014-05-29",17017,83]
[null,null,"2014-05-29",13071,76]
[null,null,"2014-05-29",14410,96]
[null,null,"2014-05-29",13578,89]
[null,null,"2014-05-29",15688,52]
[null,null,"2014-05-29",29274,58]
[null,null,"2014-05-29",26239,73]
[null,null,"2014-05-29",39861,70]
[null,null,"2014-05-29",34135,54]
[null,null,"2014-05-29",35630,83]
[null,null,"2014-05-29",33892,66]
[null,null,"2014-05-29",45640,92]
[null,null,"2014-05-29",45113,96]
[null,null,"2014-05-29",12972,193]
[null,null,"2014-05-29",20162,167]
[null,null,"2014-05-29",52790,144]
[null,null,"2014-05-29",51306,148]
[null,null,"2014-05-29",61230,199]
[null,null,"2014-05-29",65588,152]
[null,null,"2014-05-29",78737,169]
[null,null,"2014-05-29",11207,291]
[null,null,"2014-05-29",29708,341]
[null,null,"2014-05-29",29968,325]
[null,null,"2014-05-29",29036,411]
[null,null,"2014-05-29",36255,375]
[null,null,"2014-05-29",33662,305]
[null,null,"2014-05-29",47005,275]

{"sheet":"12 Tarifanalyse (A1)_","index":34,"n_rows":11,"n_cols":8,"rows_kept":11,"cut":false,"hidden":true,"merged":[]}
[null,2,2,2,1,1,1,0]
[1,"12 Charge analysis (E1)_",null,null,null,{"$f":"B2","v":"12 Charge analysis (E1)_"}]
[2,"12 Tarifanalyse (A1)_"]
[0]
[null,1,"Wir wollen jetzt den kombinierten S-W-VERWEIS benutzen, um die Einnahmen zu vergleichen, die sich auf der Basis verschiedener Tariftabellen erzielen ließen.\n\nDazu berechnen Sie Ihre Einnahmen mit der Standard-Tariftabelle A, mit zwei modifizierten Tariftabellen B und C und mit der Tariftabelle Ihres Wettbewerbers.\n\nIn der Tabelle B sollen die Tarife für kurze Strecken und kleine Gewichte etwas erhöht werden. Der Bereich ist gelb markiert.\n\nIn der Tabelle C sollen die Tarife für lange Strecken und große Gewichte etwas erhöht werden. Der Bereich ist gelb markiert.",null,1,"We will now use the combined V-H-LOOKUP to compare the earnings that could be generated on the basis of different charge tables.\n\nTo do this, calculate your earnings using the standard charge table A, two modified charge tables B and C and your competitor's charge table.\n\nIn table B the tariffs for short distances and small weights are to be increased slightly. The range is marked yellow.\n\nIn table C, the tariffs for long distances and heavy weights are to be increased slightly. The range is marked yellow."]
[null,{"$f":"IF(C6<>\"\",B5+1,\"\")","v":2},"Der Erhöhungsbetrag soll in Zelle J20 eingegeben werden (gelb markiert). \n\nWenn Sie dort also z.B. 2 € eingeben, dann soll in L37 erscheinen: 32 €. Auch alle anderen Werte in den gelb markierten Bereichen sollen sich dann um 2 € erhöhen.\n\nGeben Sie die dafür notwendige Formel in L37 bzw. N56 ein (Dollarzeichen richtig setzen!) und kopieren Sie die Formel nach rechts und nach unten.\n\nACHTUNG: \nFormeln in formatierten Tabellen mit der RECHTEN Maustaste kopieren!",null,{"$f":"IF(F6<>\"\",E5+1,\"\")","v":2},"The amount of increase should be entered in cell J20 (highlighted in yellow). \n\nFor example, if you enter 2 € there, then 32 € should appear in L37. All other values in the yellow marked ranges should then also increase by 2 €.\n\nEnter the necessary formula in L37 or N56 (set the dollar sign correctly!) and copy the formula to the right and down.\n\nATTENTION: \nCopy formulas in formatted tables with the RIGHT mouse button!"]
[null,{"$f":"IF(C7<>\"\",B6+1,\"\")","v":3},"Geben Sie dann die S-W-VERWEIS-Formeln in Zeile 21 ein und kopieren Sie sie nach unten.\n\nACHTUNG: \nNicht mit der Maus ziehen bis zum Fingerkrampf, sondern mit Doppelklick auf den Kopierpunkt in der rechten unteren Ecke der Zelle! \n\nSummieren Sie die vier Spalten in Zeile 20 auf.\n\nACHTUNG: \nIn der Summenformel nicht mit der Maus ziehen bis zum Fingerkrampf, sondern erste Zelle anklicken und dann Strg-Umschalt-PfeilUnten drücken!\n\nSetzen Sie verschiedene sinnvolle Werte in J20 ein, sehen Sie sich die Summen an, vergleichen Sie sie und interpretieren Sie das Ergebnis!",null,{"$f":"IF(F7<>\"\",E6+1,\"\")","v":3},"Then enter the V-H-LOOKUP-formulas in row 21 and copy them down.\n\nATTENTION: \nDo not drag the mouse until the finger cramps, but double-click on the copy point in the bottom right corner of the cell! \n\nSum up the four columns in row 20.\n\nATTENTION: \nIn the summation formula, don't drag the mouse until the finger cramps, but click on the first cell and then press Ctrl-Shift-DownArrow!\n\nPut different meaningful values in J20, look at the sums, compare them and interpret the result!"]
[null,{"$f":"IF(C8<>\"\",B7+1,\"\")","v":""},null,null,""]
[null,"",null,null,""]
[null,"",null,null,{"$f":"IF(F10<>\"\",E9+1,\"\")","v":""}]
[null,"",null,null,""]

{"sheet":"13 Bevor Sie weitermachen … (1)","index":35,"n_rows":21,"n_cols":6,"rows_kept":21,"cut":false,"hidden":false,"merged":[[1,1,1,4],[2,1,2,4],[5,2,7,8],[8,2,10,8]]}
[null,null,null,null,null,0]
[1,"13 Before you continue … (1)",null,null,null,"Back to Start"]
[2,"13 Bevor Sie weitermachen … (1)",null,null,null,"Startseite"]
[]
[]
[1,null,"… please work throught the worksheet \n   \"Scroll bars\" \nin the file \"Excel-Controls\"!"]
[1]
[1]
[2,null,"… arbeiten Sie bitte das Arbeitsblatt \n   \"Bildlaufleisten\" \nin der Datei \"Excel-Controls\" durch!"]
[2]
[2]
[]
[]
[]
[]
[]
[]
[]
[]
[]
[0]

{"sheet":"14 Tarifanalyse (A2)","index":36,"n_rows":1355,"n_cols":21,"rows_kept":1355,"cut":false,"hidden":false,"merged":[[16,2,16,7],[17,2,17,7],[1,1,1,4],[2,1,2,4],[4,2,5,7],[7,2,8,7]]}
[null,null,null,null,null,null,null,null,null,null,null,0]
[1,"14 Charge analysis (E2)",null,null,null,"Back to Start"]
[2,"14 Tarifanalyse (A2)",null,null,null,"Startseite"]
[]
[2,"Übung 1","Stellen Sie den Erhöhungsbetrag in J20 mit Hilfe einer Bildlaufleiste ein. (siehe \"Excel-Controls\"!) Sie soll folgende Parameter haben:"]
[2]
[2]
[1,"Exercise 1","Use a scroll bar to define the increase value in J20. (see \"Excel-Controls\"!)\nThe scroll bar shall have the following parameters:"]
[1]
[1]
[null,null,null,null,"Min:",0]
[null,null,null,null,"Max:",20]
[null,null,null,null,"SmallChange:",1]
[null,null,null,null,"LargeChange:",5]
[null,null,null,null,"LinkedCell:","J20"]
[]
[2,"Übung 2","Stellen Sie die vier Summen in einem Säulendiagramm dar!"]
[1,"Exercise 2","Display the four resulting sums with a column chart!"]
[null,null,"date","ZIP code","weight","earnings A","earnings B","earnings C","competitor"]
[null,null,null,null,null,null,null,null,null,null,"A",null,null,null,null,null,"competitor"]
[null,null,"2014-04-29",9715,28,null,null,null,null,null,"ZIP / weight",0,50,100,300,null,"ZIP / weight",0,50,100,300]
[null,null,"2014-04-29",10960,28,null,null,null,null,null,null,2,3,4,5,null,null,2,3,4,5]
[null,null,"2014-04-29",13399,13,null,null,null,null,null,0,30,40,70,100,null,0,40,50,80,110]
[null,null,"2014-04-29",16393,10,null,null,null,null,null,10000,20,30,60,80,null,10000,30,40,70,100]
[null,null,"2014-04-29",21682,28,null,null,null,null,null,20000,10,20,50,70,null,20000,20,30,60,80]
[null,null,"2014-04-29",24116,41,null,null,null,null,null,30000,20,30,60,90,null,30000,10,20,50,70]
[null,null,"2014-04-29",24121,19,null,null,null,null,null,40000,30,50,80,110,null,40000,20,30,60,90]
[null,null,"2014-04-29",32412,9,null,null,null,null,null,50000,40,70,100,140,null,50000,30,50,80,110]
[null,null,"2014-04-29",32331,31,null,null,null,null,null,60000,50,100,130,160,null,60000,40,70,100,140]
[null,null,"2014-04-29",43959,40,null,null,null,null,null,70000,60,120,150,190,null,70000,50,100,130,160]
[null,null,"2014-04-29",58335,6,null,null,null,null,null,80000,70,140,180,220,null,80000,60,120,150,190]
[null,null,"2014-04-29",55568,3,null,null,null,null,null,90000,80,160,200,250,null,90000,70,140,180,220]
[null,null,"2014-04-29",74572,8]
[null,null,"2014-04-29",83703,29,null,null,null,null,null,"B (increase for short distances and small weights))"]
[null,null,"2014-04-29",1068,56,null,null,null,null,null,"ZIP / weight",0,50,100,300]
[null,null,"2014-04-29",11897,53,null,null,null,null,null,null,2,3,4,5]
[null,null,"2014-04-29",16739,63,null,null,null,null,null,0,{"$f":"L23+$J$20","v":30},{"$f":"M23+$J$20","v":40},70,100]
[null,null,"2014-04-29",20453,90,null,null,null,null,null,10000,{"$f":"L24+$J$20","v":20},30,60,80]
[null,null,"2014-04-29",38855,73,null,null,null,null,null,20000,10,20,50,70]
[null,null,"2014-04-29",47878,97,null,null,null,null,null,30000,20,30,60,90]
[null,null,"2014-04-29",56777,79,null,null,null,null,null,40000,30,50,80,110]
[null,null,"2014-04-29",87024,89,null,null,null,null,null,50000,40,70,100,140]
[null,null,"2014-04-29",5672,190,null,null,null,null,null,60000,50,100,130,160]
[null,null,"2014-04-29",1304,116,null,null,null,null,null,70000,60,120,150,190]
[0,null,"2014-04-29",4105,168,null,null,null,null,null,80000,70,140,180,220]
[null,null,"2014-04-29",1880,183,null,null,null,null,null,90000,80,160,200,250]
[null,null,"2014-04-29",4808,200]
[null,null,"2014-04-29",13411,142,null,null,null,null,null,"C (increase for long distances and large weights)"]
[null,null,"2014-04-29",24542,147,null,null,null,null,null,"ZIP / weight",0,50,100,300]
[null,null,"2014-04-29",44698,105,null,null,null,null,null,null,2,3,4,5]
[null,null,"2014-04-29",54367,111,null,null,null,null,null,0,30,40,70,100]
[null,null,"2014-04-29",58891,111,null,null,null,null,null,10000,20,30,60,80]
[null,null,"2014-04-29",57890,133,null,null,null,null,null,20000,10,20,50,70]
[null,null,"2014-04-29",67734,159,null,null,null,null,null,30000,20,30,60,90]
[null,null,"2014-04-29",60752,118,null,null,null,null,null,40000,30,50,80,110]
[null,null,"2014-04-29",83742,157,null,null,null,null,null,50000,40,70,{"$f":"N28+$J$20","v":100},{"$f":"O28+$J$20","v":140}]
[null,null,"2014-04-29",7413,211,null,null,null,null,null,60000,50,100,{"$f":"N29+$J$20","v":130},160]
[null,null,"2014-04-29",8713,421,null,null,null,null,null,70000,60,120,150,190]
[null,null,"2014-04-29",2114,482,null,null,null,null,null,80000,70,140,180,220]
[null,null,"2014-04-29",15821,419,null,null,null,null,null,90000,80,160,200,250]
[null,null,"2014-04-29",12611,259]
[null,null,"2014-04-29",22393,427]
[null,null,"2014-04-29",20834,290]
[null,null,"2014-04-29",40181,292]
[null,null,"2014-04-29",45541,478]
[null,null,"2014-04-29",61074,281]
[null,null,"2014-04-30",3372,26]
[null,null,"2014-04-30",15869,40]
[null,null,"2014-04-30",22587,42]
[null,null,"2014-04-30",34190,42]
[null,null,"2014-04-30",34374,31]
[null,null,"2014-04-30",48000,4]
[null,null,"2014-04-30",59531,7]
[null,null,"2014-04-30",54969,42]
[null,null,"2014-04-30",6102,92]
[null,null,"2014-04-30",2006,88]
[null,null,"2014-04-30",11215,85]
[null,null,"2014-04-30",14828,63]
[null,null,"2014-04-30",13306,52]
[null,null,"2014-04-30",11022,50]
[null,null,"2014-04-30",29565,55]
[null,null,"2014-04-30",23319,89]
[null,null,"2014-04-30",25474,66]
[null,null,"2014-04-30",22077,66]
[null,null,"2014-04-30",32793,67]
[null,null,"2014-04-30",58758,73]
[null,null,"2014-04-30",78133,67]
[null,null,"2014-04-30",82382,65]
[null,null,"2014-04-30",6273,151]
[null,null,"2014-04-30",806,106]
[null,null,"2014-04-30",7387,154]
[null,null,"2014-04-30",17894,179]
[null,null,"2014-04-30",10005,109]
[null,null,"2014-04-30",23535,171]
[null,null,"2014-04-30",23044,127]
[null,null,"2014-04-30",27025,131]
[null,null,"2014-04-30",38456,169]
[null,null,"2014-04-30",39953,155]
[null,null,"2014-04-30",51963,101]
[null,null,"2014-04-30",67329,126]
[null,null,"2014-04-30",3923,290]
[null,null,"2014-04-30",14355,437]
[null,null,"2014-04-30",14259,489]
[null,null,"2014-04-30",28906,421]
[null,null,"2014-04-30",53927,402]
[null,null,"2014-05-01",2353,26]
[null,null,"2014-05-01",48,20]
[null,null,"2014-05-01",3876,38]
[null,null,"2014-05-01",18149,5]
[null,null,"2014-05-01",21219,28]
[null,null,"2014-05-01",27620,49]
[null,null,"2014-05-01",49110,31]
[null,null,"2014-05-01",44525,34]
[null,null,"2014-05-01",42290,34]
[null,null,"2014-05-01",60064,19]
[null,null,"2014-05-01",68709,34]
[null,null,"2014-05-01",62253,20]
[null,null,"2014-05-01",73546,38]
[null,null,"2014-05-01",81119,41]
[null,null,"2014-05-01",862,52]
[null,null,"2014-05-01",7517,95]
[null,null,"2014-05-01",6176,100]
[null,null,"2014-05-01",8269,64]
[null,null,"2014-05-01",17747,74]
[null,null,"2014-05-01",12919,52]
[null,null,"2014-05-01",10582,80]
[null,null,"2014-05-01",14784,59]
[null,null,"2014-05-01",18528,98]
[null,null,"2014-05-01",26479,62]
[null,null,"2014-05-01",29176,65]
[null,null,"2014-05-01",38515,68]
[null,null,"2014-05-01",35423,85]
[null,null,"2014-05-01",43024,89]
[null,null,"2014-05-01",49904,66]
[null,null,"2014-05-01",62647,99]
[null,null,"2014-05-01",60749,93]
[null,null,"2014-05-01",79107,60]
[null,null,"2014-05-01",4663,121]
[null,null,"2014-05-01",2053,114]
[null,null,"2014-05-01",13965,103]
[null,null,"2014-05-01",15616,138]
[null,null,"2014-05-01",17341,120]
[null,null,"2014-05-01",11823,139]
[null,null,"2014-05-01",17612,160]
[null,null,"2014-05-01",21532,154]
[null,null,"2014-05-01",20059,192]
[null,null,"2014-05-01",38200,140]
[null,null,"2014-05-01",35997,107]
[null,null,"2014-05-01",42672,177]
[null,null,"2014-05-01",3042,202]
[null,null,"2014-05-01",5254,201]
[null,null,"2014-05-01",1115,204]
[null,null,"2014-05-01",16627,400]
[null,null,"2014-05-01",17772,383]
[null,null,"2014-05-01",15195,488]
[null,null,"2014-05-01",40079,428]
[null,null,"2014-05-01",44875,477]
[null,null,"2014-05-02",1281,41]
[null,null,"2014-05-02",12060,43]
[null,null,"2014-05-02",12685,6]
[null,null,"2014-05-02",12164,49]
[null,null,"2014-05-02",25964,43]
[null,null,"2014-05-02",21925,24]
[null,null,"2014-05-02",25046,16]
[null,null,"2014-05-02",49041,45]
[null,null,"2014-05-02",62277,27]
[null,null,"2014-05-02",83356,42]
[null,null,"2014-05-02",96325,36]
[null,null,"2014-05-02",3711,60]
[null,null,"2014-05-02",526,58]
[null,null,"2014-05-02",9993,71]
[null,null,"2014-05-02",9729,85]
[null,null,"2014-05-02",6171,86]
[null,null,"2014-05-02",18658,90]
[null,null,"2014-05-02",24413,93]
[null,null,"2014-05-02",39583,79]
[null,null,"2014-05-02",32728,64]
[null,null,"2014-05-02",39771,57]
[null,null,"2014-05-02",35593,53]
[null,null,"2014-05-02",69830,69]
[null,null,"2014-05-02",65106,60]
[null,null,"2014-05-02",62244,63]
[null,null,"2014-05-02",69965,88]
[null,null,"2014-05-02",8590,127]
[null,null,"2014-05-02",10440,155]
[null,null,"2014-05-02",14661,183]
[null,null,"2014-05-02",16859,131]
[null,null,"2014-05-02",19475,133]
[null,null,"2014-05-02",22580,106]
[null,null,"2014-05-02",29118,174]
[null,null,"2014-05-02",22910,181]
[null,null,"2014-05-02",27816,147]
[null,null,"2014-05-02",30737,185]
[null,null,"2014-05-02",39398,106]
[null,null,"2014-05-02",31722,100]
[null,null,"2014-05-02",40886,104]
[null,null,"2014-05-02",45873,193]
[null,null,"2014-05-02",51749,140]
[null,null,"2014-05-02",67195,172]
[null,null,"2014-05-02",66540,184]
[null,null,"2014-05-02",80131,190]
[null,null,"2014-05-02",84616,192]
[null,null,"2014-05-02",5541,488]
[null,null,"2014-05-02",9834,473]
[null,null,"2014-05-02",17974,428]
[null,null,"2014-05-02",14602,315]
[null,null,"2014-05-02",13667,441]
[null,null,"2014-05-02",29499,398]
[null,null,"2014-05-02",26651,408]
[null,null,"2014-05-02",21176,497]
[null,null,"2014-05-02",38365,258]
[null,null,"2014-05-02",48340,216]
[null,null,"2014-05-03",7657,42]
[null,null,"2014-05-03",18841,48]
[null,null,"2014-05-03",14110,12]
[null,null,"2014-05-03",21057,43]
[null,null,"2014-05-03",26926,17]
[null,null,"2014-05-03",24935,3]
[null,null,"2014-05-03",36848,3]
[null,null,"2014-05-03",34232,47]
[null,null,"2014-05-03",46537,19]
[null,null,"2014-05-03",72647,1]
[null,null,"2014-05-03",1336,80]
[null,null,"2014-05-03",32,57]
[null,null,"2014-05-03",10027,54]
[null,null,"2014-05-03",19728,87]
[null,null,"2014-05-03",28235,56]
[null,null,"2014-05-03",29644,78]
[null,null,"2014-05-03",42517,58]
[null,null,"2014-05-03",43620,58]
[null,null,"2014-05-03",52962,67]
[null,null,"2014-05-03",4427,141]
[null,null,"2014-05-03",25273,162]
[null,null,"2014-05-03",28362,117]
[null,null,"2014-05-03",22091,131]
[null,null,"2014-05-03",57733,198]
[null,null,"2014-05-03",4502,256]
[null,null,"2014-05-03",13178,208]
[null,null,"2014-05-03",18418,495]
[null,null,"2014-05-03",45437,331]
[null,null,"2014-05-04",6294,29]
[null,null,"2014-05-04",4937,9]
[null,null,"2014-05-04",12227,23]
[null,null,"2014-05-04",16986,2]
[null,null,"2014-05-04",15947,27]
[null,null,"2014-05-04",19245,35]
[null,null,"2014-05-04",22187,1]
[null,null,"2014-05-04",26240,38]
[null,null,"2014-05-04",28619,10]
[null,null,"2014-05-04",22714,23]
[null,null,"2014-05-04",39353,1]
[null,null,"2014-05-04",50283,25]
[null,null,"2014-05-04",93057,35]
[null,null,"2014-05-04",7886,72]
[null,null,"2014-05-04",18856,74]
[null,null,"2014-05-04",10213,61]
[null,null,"2014-05-04",13896,82]
[null,null,"2014-05-04",26910,70]
[null,null,"2014-05-04",27725,61]
[null,null,"2014-05-04",20071,80]
[null,null,"2014-05-04",23522,64]
[null,null,"2014-05-04",28509,55]
[null,null,"2014-05-04",26532,97]
[null,null,"2014-05-04",36842,86]
[null,null,"2014-05-04",47079,100]
[null,null,"2014-05-04",54538,80]
[null,null,"2014-05-04",74767,50]
[null,null,"2014-05-04",78701,83]
[null,null,"2014-05-04",1122,182]
[null,null,"2014-05-04",11256,175]
[null,null,"2014-05-04",17731,169]
[null,null,"2014-05-04",12750,184]
[null,null,"2014-05-04",13622,140]
[null,null,"2014-05-04",14263,167]
[null,null,"2014-05-04",13799,186]
[null,null,"2014-05-04",20672,161]
[null,null,"2014-05-04",31445,106]
[null,null,"2014-05-04",48157,159]
[null,null,"2014-05-04",68891,106]
[null,null,"2014-05-04",6063,420]
[null,null,"2014-05-04",12672,376]
[null,null,"2014-05-04",14378,494]
[null,null,"2014-05-04",19454,309]
[null,null,"2014-05-04",24452,287]
[null,null,"2014-05-04",26195,295]
[null,null,"2014-05-04",60607,231]
[null,null,"2014-05-05",7771,40]
[null,null,"2014-05-05",1394,36]
[null,null,"2014-05-05",352,6]
[null,null,"2014-05-05",19466,3]
[null,null,"2014-05-05",26607,49]
[null,null,"2014-05-05",23374,45]
[null,null,"2014-05-05",22902,14]
[null,null,"2014-05-05",26674,49]
[null,null,"2014-05-05",45586,33]
[null,null,"2014-05-05",60908,26]
[null,null,"2014-05-05",433,57]
[null,null,"2014-05-05",19559,90]
[null,null,"2014-05-05",10637,80]
[null,null,"2014-05-05",14125,91]
[null,null,"2014-05-05",13368,92]
[null,null,"2014-05-05",10443,65]
[null,null,"2014-05-05",27481,75]
[null,null,"2014-05-05",25838,51]
[null,null,"2014-05-05",20179,75]
[null,null,"2014-05-05",26303,66]
[null,null,"2014-05-05",34203,80]
[null,null,"2014-05-05",46274,52]
[null,null,"2014-05-05",6726,163]
[null,null,"2014-05-05",9863,136]
[null,null,"2014-05-05",1125,152]
[null,null,"2014-05-05",13731,129]
[null,null,"2014-05-05",14395,188]
[null,null,"2014-05-05",19450,175]
[null,null,"2014-05-05",29952,152]
[null,null,"2014-05-05",41882,190]
[null,null,"2014-05-05",67579,105]
[null,null,"2014-05-05",97488,120]
[null,null,"2014-05-05",8389,333]
[null,null,"2014-05-05",7619,259]
[null,null,"2014-05-05",22763,236]
[null,null,"2014-05-05",30802,319]
[null,null,"2014-05-05",33703,377]
[null,null,"2014-05-05",41783,334]
[null,null,"2014-05-05",58905,295]
[null,null,"2014-05-06",5275,23]
[null,null,"2014-05-06",3643,22]
[null,null,"2014-05-06",6729,3]
[null,null,"2014-05-06",19595,26]
[null,null,"2014-05-06",13324,43]
[null,null,"2014-05-06",41364,2]
[null,null,"2014-05-06",43974,42]
[null,null,"2014-05-06",63788,45]
[null,null,"2014-05-06",77240,35]
[null,null,"2014-05-06",84359,44]
[null,null,"2014-05-06",98082,8]
[null,null,"2014-05-06",4837,52]
[null,null,"2014-05-06",763,58]
[null,null,"2014-05-06",9311,60]
[null,null,"2014-05-06",16762,71]
[null,null,"2014-05-06",13722,53]
[null,null,"2014-05-06",14981,89]
[null,null,"2014-05-06",12993,68]
[null,null,"2014-05-06",25989,84]
[null,null,"2014-05-06",28133,62]
[null,null,"2014-05-06",29257,74]
[null,null,"2014-05-06",33448,95]
[null,null,"2014-05-06",30319,77]
[null,null,"2014-05-06",42376,70]
[null,null,"2014-05-06",42173,97]
[null,null,"2014-05-06",51520,74]
[null,null,"2014-05-06",76654,94]
[null,null,"2014-05-06",93224,89]
[null,null,"2014-05-06",3137,196]
[null,null,"2014-05-06",3843,136]
[null,null,"2014-05-06",17985,197]
[null,null,"2014-05-06",14730,147]
[null,null,"2014-05-06",27992,150]
[null,null,"2014-05-06",24976,165]
[null,null,"2014-05-06",42289,172]
[null,null,"2014-05-06",44075,196]
[null,null,"2014-05-06",61802,183]
[null,null,"2014-05-06",71993,150]
[null,null,"2014-05-06",13033,300]
[null,null,"2014-05-06",15659,445]
[null,null,"2014-05-06",38778,234]
[null,null,"2014-05-06",34971,370]
[null,null,"2014-05-06",59255,403]
[null,null,"2014-05-07",6207,49]
[null,null,"2014-05-07",2670,1]
[null,null,"2014-05-07",8284,40]
[null,null,"2014-05-07",18899,14]
[null,null,"2014-05-07",15200,7]
[null,null,"2014-05-07",17155,46]
[null,null,"2014-05-07",18891,13]
[null,null,"2014-05-07",18210,24]
[null,null,"2014-05-07",17059,6]
[null,null,"2014-05-07",27858,26]
[null,null,"2014-05-07",21742,48]
[null,null,"2014-05-07",27137,12]
[null,null,"2014-05-07",32084,10]
[null,null,"2014-05-07",39290,3]
[null,null,"2014-05-07",35804,49]
[null,null,"2014-05-07",41373,19]
[null,null,"2014-05-07",51677,7]
[null,null,"2014-05-07",61308,26]
[null,null,"2014-05-07",80762,42]
[null,null,"2014-05-07",7845,86]
[null,null,"2014-05-07",7619,56]
[null,null,"2014-05-07",9434,72]
[null,null,"2014-05-07",14024,57]
[null,null,"2014-05-07",19339,75]
[null,null,"2014-05-07",10799,60]
[null,null,"2014-05-07",16922,67]
[null,null,"2014-05-07",26983,78]
[null,null,"2014-05-07",33887,53]
[null,null,"2014-05-07",39780,79]
[null,null,"2014-05-07",34382,64]
[null,null,"2014-05-07",42324,66]
[null,null,"2014-05-07",57671,87]
[null,null,"2014-05-07",56418,50]
[null,null,"2014-05-07",1289,101]
[null,null,"2014-05-07",18170,122]
[null,null,"2014-05-07",16382,135]
[null,null,"2014-05-07",16517,156]
[null,null,"2014-05-07",15026,176]
[null,null,"2014-05-07",19929,140]
[null,null,"2014-05-07",28989,121]
[null,null,"2014-05-07",27773,200]
[null,null,"2014-05-07",35540,185]
[null,null,"2014-05-07",35463,156]
[null,null,"2014-05-07",48348,173]
[null,null,"2014-05-07",788,410]
[null,null,"2014-05-07",8955,372]
[null,null,"2014-05-07",27119,253]
[null,null,"2014-05-07",31428,488]
[null,null,"2014-05-07",46300,388]
[null,null,"2014-05-08",3631,18]
[null,null,"2014-05-08",5544,45]
[null,null,"2014-05-08",8410,22]
[null,null,"2014-05-08",11230,11]
[null,null,"2014-05-08",10845,17]
[null,null,"2014-05-08",14695,45]
[null,null,"2014-05-08",24428,35]
[null,null,"2014-05-08",26891,6]
[null,null,"2014-05-08",29443,19]
[null,null,"2014-05-08",31857,22]
[null,null,"2014-05-08",37279,15]
[null,null,"2014-05-08",44768,30]
[null,null,"2014-05-08",59659,21]
[null,null,"2014-05-08",53683,35]
[null,null,"2014-05-08",57188,17]
[null,null,"2014-05-08",97776,25]
[null,null,"2014-05-08",1248,57]
[null,null,"2014-05-08",8297,95]
[null,null,"2014-05-08",11734,100]
[null,null,"2014-05-08",10826,60]
[null,null,"2014-05-08",17313,96]
[null,null,"2014-05-08",18943,78]
[null,null,"2014-05-08",28918,96]
[null,null,"2014-05-08",37834,99]
[null,null,"2014-05-08",30385,61]
[null,null,"2014-05-08",33512,94]
[null,null,"2014-05-08",46835,70]
[null,null,"2014-05-08",40803,51]
[null,null,"2014-05-08",41847,86]
[null,null,"2014-05-08",76186,94]
[null,null,"2014-05-08",74277,71]
[null,null,"2014-05-08",6662,143]
[null,null,"2014-05-08",4425,187]
[null,null,"2014-05-08",10721,101]
[null,null,"2014-05-08",17473,190]
[null,null,"2014-05-08",11769,127]
[null,null,"2014-05-08",17690,100]
[null,null,"2014-05-08",50083,167]
[null,null,"2014-05-08",78499,132]
[null,null,"2014-05-08",761,346]
[null,null,"2014-05-08",5468,450]
[null,null,"2014-05-08",18662,227]
[null,null,"2014-05-08",17156,465]
[null,null,"2014-05-08",15349,387]
[null,null,"2014-05-08",12099,229]
[null,null,"2014-05-08",29324,400]
[null,null,"2014-05-08",35690,311]
[null,null,"2014-05-08",57308,434]
[null,null,"2014-05-09",16562,11]
[null,null,"2014-05-09",11809,34]
[null,null,"2014-05-09",10180,7]
[null,null,"2014-05-09",21313,47]
[null,null,"2014-05-09",37128,13]
[null,null,"2014-05-09",36900,34]
[null,null,"2014-05-09",44123,17]
[null,null,"2014-05-09",40283,29]
[null,null,"2014-05-09",57736,37]
[null,null,"2014-05-09",9739,62]
[null,null,"2014-05-09",6171,75]
[null,null,"2014-05-09",6974,93]
[null,null,"2014-05-09",8955,63]
[null,null,"2014-05-09",18621,83]
[null,null,"2014-05-09",15372,82]
[null,null,"2014-05-09",10290,68]
[null,null,"2014-05-09",15031,66]
[null,null,"2014-05-09",14207,56]
[null,null,"2014-05-09",17739,50]
[null,null,"2014-05-09",22825,59]
[null,null,"2014-05-09",21258,64]
[null,null,"2014-05-09",35356,61]
[null,null,"2014-05-09",49982,52]
[null,null,"2014-05-09",42771,69]
[null,null,"2014-05-09",49209,61]
[null,null,"2014-05-09",46965,64]
[null,null,"2014-05-09",52947,76]
[null,null,"2014-05-09",64668,80]
[null,null,"2014-05-09",8448,146]
[null,null,"2014-05-09",8619,181]
[null,null,"2014-05-09",2484,174]
[null,null,"2014-05-09",14345,176]
[null,null,"2014-05-09",12805,144]
[null,null,"2014-05-09",12997,112]
[null,null,"2014-05-09",14794,111]
[null,null,"2014-05-09",21982,177]
[null,null,"2014-05-09",31338,110]
[null,null,"2014-05-09",41559,159]
[null,null,"2014-05-09",45566,129]
[null,null,"2014-05-09",53166,103]
[null,null,"2014-05-09",63434,148]
[null,null,"2014-05-09",12290,396]
[null,null,"2014-05-09",14032,470]
[null,null,"2014-05-09",28934,360]
[null,null,"2014-05-09",34968,218]
[null,null,"2014-05-09",45807,308]
[null,null,"2014-05-09",58303,400]
[null,null,"2014-05-10",24992,31]
[null,null,"2014-05-10",37966,12]
[null,null,"2014-05-10",39234,44]
[null,null,"2014-05-10",47539,12]
[null,null,"2014-05-10",66746,5]
[null,null,"2014-05-10",12653,82]
[null,null,"2014-05-10",15800,89]
[null,null,"2014-05-10",27627,55]
[null,null,"2014-05-10",26451,59]
[null,null,"2014-05-10",38234,95]
[null,null,"2014-05-10",36788,82]
[null,null,"2014-05-10",45982,100]
[null,null,"2014-05-10",6270,136]
[null,null,"2014-05-10",7003,171]
[null,null,"2014-05-10",28305,179]
[null,null,"2014-05-10",43650,200]
[null,null,"2014-05-10",42945,183]
[null,null,"2014-05-10",69138,177]
[null,null,"2014-05-10",76844,120]
[null,null,"2014-05-10",77586,162]
[null,null,"2014-05-10",8538,450]
[null,null,"2014-05-10",3658,441]
[null,null,"2014-05-10",28384,234]
[null,null,"2014-05-10",34486,342]
[null,null,"2014-05-10",39992,239]
[null,null,"2014-05-10",49431,226]
[null,null,"2014-05-10",43178,302]
[null,null,"2014-05-10",65273,363]
[null,null,"2014-05-11",8327,4]
[null,null,"2014-05-11",2163,20]
[null,null,"2014-05-11",8189,9]
[null,null,"2014-05-11",19529,36]
[null,null,"2014-05-11",16532,25]
[null,null,"2014-05-11",18116,27]
[null,null,"2014-05-11",24383,25]
[null,null,"2014-05-11",78278,21]
[null,null,"2014-05-11",7225,95]
[null,null,"2014-05-11",524,51]
[null,null,"2014-05-11",7919,84]
[null,null,"2014-05-11",4437,88]
[null,null,"2014-05-11",14828,87]
[null,null,"2014-05-11",16134,93]
[null,null,"2014-05-11",13423,55]
[null,null,"2014-05-11",18728,98]
[null,null,"2014-05-11",21472,62]
[null,null,"2014-05-11",25274,80]
[null,null,"2014-05-11",37261,61]
[null,null,"2014-05-11",39318,85]
[null,null,"2014-05-11",47398,75]
[null,null,"2014-05-11",54614,64]
[null,null,"2014-05-11",2045,193]
[null,null,"2014-05-11",3155,175]
[null,null,"2014-05-11",5969,161]
[null,null,"2014-05-11",14351,142]
[null,null,"2014-05-11",11392,163]
[null,null,"2014-05-11",26631,169]
[null,null,"2014-05-11",31348,109]
[null,null,"2014-05-11",45447,132]
[null,null,"2014-05-11",72539,147]
[null,null,"2014-05-11",13404,289]
[null,null,"2014-05-11",10116,382]
[null,null,"2014-05-11",14067,290]
[null,null,"2014-05-11",12544,307]
[null,null,"2014-05-11",12964,483]
[null,null,"2014-05-11",24429,321]
[null,null,"2014-05-11",53387,472]
[null,null,"2014-05-12",13120,27]
[null,null,"2014-05-12",13665,4]
[null,null,"2014-05-12",10675,32]
[null,null,"2014-05-12",27226,33]
[null,null,"2014-05-12",27396,23]
[null,null,"2014-05-12",53658,38]
[null,null,"2014-05-12",50647,39]
[null,null,"2014-05-12",56428,42]
[null,null,"2014-05-12",69424,4]
[null,null,"2014-05-12",71202,4]
[null,null,"2014-05-12",6086,86]
[null,null,"2014-05-12",11227,72]
[null,null,"2014-05-12",15644,93]
[null,null,"2014-05-12",25168,76]
[null,null,"2014-05-12",21685,72]
[null,null,"2014-05-12",42629,50]
[null,null,"2014-05-12",58800,66]
[null,null,"2014-05-12",3745,184]
[null,null,"2014-05-12",10099,155]
[null,null,"2014-05-12",15357,164]
[null,null,"2014-05-12",19465,118]
[null,null,"2014-05-12",27387,193]
[null,null,"2014-05-12",27597,200]
[null,null,"2014-05-12",34963,150]
[null,null,"2014-05-12",47414,195]
[null,null,"2014-05-12",50558,140]
[null,null,"2014-05-12",54628,161]
[null,null,"2014-05-12",68852,144]
[null,null,"2014-05-12",66252,118]
[null,null,"2014-05-12",77026,119]
[null,null,"2014-05-12",71063,175]
[null,null,"2014-05-12",92810,184]
[null,null,"2014-05-12",4822,233]
[null,null,"2014-05-12",13013,213]
[null,null,"2014-05-12",22647,209]
[null,null,"2014-05-12",25884,314]
[null,null,"2014-05-12",37331,363]
[null,null,"2014-05-12",41260,496]
[null,null,"2014-05-12",59053,264]
[null,null,"2014-05-13",1884,4]
[null,null,"2014-05-13",15001,14]
[null,null,"2014-05-13",25926,9]
[null,null,"2014-05-13",39059,8]
[null,null,"2014-05-13",34338,11]
[null,null,"2014-05-13",40356,49]
[null,null,"2014-05-13",55675,12]
[null,null,"2014-05-13",68237,23]
[null,null,"2014-05-13",8517,98]
[null,null,"2014-05-13",7024,89]
[null,null,"2014-05-13",6048,53]
[null,null,"2014-05-13",3066,78]
[null,null,"2014-05-13",6400,95]
[null,null,"2014-05-13",6960,81]
[null,null,"2014-05-13",2189,75]
[null,null,"2014-05-13",11051,60]
[null,null,"2014-05-13",15438,71]
[null,null,"2014-05-13",16608,83]
[null,null,"2014-05-13",14423,86]
[null,null,"2014-05-13",27445,81]
[null,null,"2014-05-13",28513,72]
[null,null,"2014-05-13",24383,80]
[null,null,"2014-05-13",28479,81]
[null,null,"2014-05-13",21028,57]
[null,null,"2014-05-13",49051,81]
[null,null,"2014-05-13",68517,96]
[null,null,"2014-05-13",77544,84]
[null,null,"2014-05-13",6652,155]
[null,null,"2014-05-13",6838,135]
[null,null,"2014-05-13",3385,195]
[null,null,"2014-05-13",14218,102]
[null,null,"2014-05-13",11335,112]
[null,null,"2014-05-13",15973,123]
[null,null,"2014-05-13",10448,176]
[null,null,"2014-05-13",16405,150]
[null,null,"2014-05-13",15606,198]
[null,null,"2014-05-13",15784,173]
[null,null,"2014-05-13",20704,101]
[null,null,"2014-05-13",34125,109]
[null,null,"2014-05-13",60050,114]
[null,null,"2014-05-13",65387,161]
[null,null,"2014-05-13",2202,443]
[null,null,"2014-05-13",13031,373]
[null,null,"2014-05-13",28409,379]
[null,null,"2014-05-13",23705,464]
[null,null,"2014-05-13",31585,340]
[null,null,"2014-05-13",37922,352]
[null,null,"2014-05-13",49064,280]
[null,null,"2014-05-14",14327,45]
[null,null,"2014-05-14",16977,14]
[null,null,"2014-05-14",17239,18]
[null,null,"2014-05-14",17250,25]
[null,null,"2014-05-14",29885,5]
[null,null,"2014-05-14",20063,47]
[null,null,"2014-05-14",25195,21]
[null,null,"2014-05-14",36897,17]
[null,null,"2014-05-14",45512,3]
[null,null,"2014-05-14",77312,20]
[null,null,"2014-05-14",76825,4]
[null,null,"2014-05-14",93471,25]
[null,null,"2014-05-14",5037,100]
[null,null,"2014-05-14",6940,62]
[null,null,"2014-05-14",8656,78]
[null,null,"2014-05-14",9257,99]
[null,null,"2014-05-14",10020,79]
[null,null,"2014-05-14",12963,78]
[null,null,"2014-05-14",17066,92]
[null,null,"2014-05-14",15929,94]
[null,null,"2014-05-14",18187,72]
[null,null,"2014-05-14",15783,53]
[null,null,"2014-05-14",27892,88]
[null,null,"2014-05-14",26465,65]
[null,null,"2014-05-14",59288,86]
[null,null,"2014-05-14",1877,186]
[null,null,"2014-05-14",1110,124]
[null,null,"2014-05-14",7145,128]
[null,null,"2014-05-14",4983,129]
[null,null,"2014-05-14",5609,152]
[null,null,"2014-05-14",16114,153]
[null,null,"2014-05-14",15528,179]
[null,null,"2014-05-14",26869,146]
[null,null,"2014-05-14",22034,113]
[null,null,"2014-05-14",33693,108]
[null,null,"2014-05-14",46803,168]
[null,null,"2014-05-14",51932,172]
[null,null,"2014-05-14",64782,143]
[null,null,"2014-05-14",68841,198]
[null,null,"2014-05-14",2310,286]
[null,null,"2014-05-14",2776,457]
[null,null,"2014-05-14",7746,455]
[null,null,"2014-05-14",20290,347]
[null,null,"2014-05-14",33259,442]
[null,null,"2014-05-15",2459,34]
[null,null,"2014-05-15",6206,9]
[null,null,"2014-05-15",19101,29]
[null,null,"2014-05-15",14647,32]
[null,null,"2014-05-15",23234,45]
[null,null,"2014-05-15",37689,32]
[null,null,"2014-05-15",41931,10]
[null,null,"2014-05-15",43919,2]
[null,null,"2014-05-15",53038,43]
[null,null,"2014-05-15",1473,63]
[null,null,"2014-05-15",4715,92]
[null,null,"2014-05-15",11021,66]
[null,null,"2014-05-15",17503,98]
[null,null,"2014-05-15",16153,52]
[null,null,"2014-05-15",12351,94]
[null,null,"2014-05-15",17253,60]
[null,null,"2014-05-15",28726,55]
[null,null,"2014-05-15",28809,99]
[null,null,"2014-05-15",45610,62]
[null,null,"2014-05-15",47794,86]
[null,null,"2014-05-15",2275,168]
[null,null,"2014-05-15",16843,187]
[null,null,"2014-05-15",16840,139]
[null,null,"2014-05-15",16333,177]
[null,null,"2014-05-15",15308,149]
[null,null,"2014-05-15",12461,128]
[null,null,"2014-05-15",11277,120]
[null,null,"2014-05-15",13702,133]
[null,null,"2014-05-15",25790,135]
[null,null,"2014-05-15",31614,192]
[null,null,"2014-05-15",46059,146]
[null,null,"2014-05-15",55553,157]
[null,null,"2014-05-15",56948,125]
[null,null,"2014-05-15",51414,147]
[null,null,"2014-05-15",9612,237]
[null,null,"2014-05-15",2059,320]
[null,null,"2014-05-15",1298,218]
[null,null,"2014-05-15",18574,228]
[null,null,"2014-05-15",16776,225]
[null,null,"2014-05-15",27848,211]
[null,null,"2014-05-15",23448,325]
[null,null,"2014-05-15",35661,462]
[null,null,"2014-05-15",48556,421]
[null,null,"2014-05-16",8437,34]
[null,null,"2014-05-16",2965,22]
[null,null,"2014-05-16",9849,40]
[null,null,"2014-05-16",7834,16]
[null,null,"2014-05-16",9097,1]
[null,null,"2014-05-16",5170,3]
[null,null,"2014-05-16",17368,39]
[null,null,"2014-05-16",12164,41]
[null,null,"2014-05-16",17286,1]
[null,null,"2014-05-16",34614,4]
[null,null,"2014-05-16",50959,5]
[null,null,"2014-05-16",64628,48]
[null,null,"2014-05-16",149,85]
[null,null,"2014-05-16",6964,79]
[null,null,"2014-05-16",14390,76]
[null,null,"2014-05-16",19993,87]
[null,null,"2014-05-16",15808,87]
[null,null,"2014-05-16",23980,68]
[null,null,"2014-05-16",29886,52]
[null,null,"2014-05-16",24778,92]
[null,null,"2014-05-16",24722,83]
[null,null,"2014-05-16",27766,52]
[null,null,"2014-05-16",39286,83]
[null,null,"2014-05-16",36805,77]
[null,null,"2014-05-16",40653,64]
[null,null,"2014-05-16",42787,86]
[null,null,"2014-05-16",96068,91]
[null,null,"2014-05-16",7409,117]
[null,null,"2014-05-16",17487,116]
[null,null,"2014-05-16",26425,112]
[null,null,"2014-05-16",27309,133]
[null,null,"2014-05-16",60825,105]
[null,null,"2014-05-16",6972,317]
[null,null,"2014-05-16",10081,208]
[null,null,"2014-05-16",20240,317]
[null,null,"2014-05-16",24028,385]
[null,null,"2014-05-16",34998,401]
[null,null,"2014-05-16",42676,429]
[null,null,"2014-05-16",52161,266]
[null,null,"2014-05-16",65887,496]
[null,null,"2014-05-16",75774,381]
[null,null,"2014-05-17",1986,27]
[null,null,"2014-05-17",3328,29]
[null,null,"2014-05-17",19968,8]
[null,null,"2014-05-17",17311,18]
[null,null,"2014-05-17",26051,48]
[null,null,"2014-05-17",38914,39]
[null,null,"2014-05-17",30833,37]
[null,null,"2014-05-17",45291,50]
[null,null,"2014-05-17",51657,10]
[null,null,"2014-05-17",50254,2]
[null,null,"2014-05-17",832,53]
[null,null,"2014-05-17",16737,70]
[null,null,"2014-05-17",12881,52]
[null,null,"2014-05-17",13944,58]
[null,null,"2014-05-17",27346,56]
[null,null,"2014-05-17",32459,91]
[null,null,"2014-05-17",34231,87]
[null,null,"2014-05-17",59940,75]
[null,null,"2014-05-17",62558,67]
[null,null,"2014-05-17",87785,83]
[null,null,"2014-05-17",8911,138]
[null,null,"2014-05-17",18680,126]
[null,null,"2014-05-17",10960,159]
[null,null,"2014-05-17",14193,180]
[null,null,"2014-05-17",24584,171]
[null,null,"2014-05-17",29569,197]
[null,null,"2014-05-17",22376,131]
[null,null,"2014-05-17",21748,160]
[null,null,"2014-05-17",37251,184]
[null,null,"2014-05-17",30526,102]
[null,null,"2014-05-17",44361,180]
[null,null,"2014-05-17",54990,105]
[null,null,"2014-05-17",12210,285]
[null,null,"2014-05-17",14546,500]
[null,null,"2014-05-17",14499,241]
[null,null,"2014-05-17",36022,282]
[null,null,"2014-05-18",3712,30]
[null,null,"2014-05-18",12996,4]
[null,null,"2014-05-18",17307,47]
[null,null,"2014-05-18",23258,34]
[null,null,"2014-05-18",25084,10]
[null,null,"2014-05-18",31193,39]
[null,null,"2014-05-18",42607,11]
[null,null,"2014-05-18",40282,46]
[null,null,"2014-05-18",48943,2]
[null,null,"2014-05-18",54916,27]
[null,null,"2014-05-18",3156,78]
[null,null,"2014-05-18",4618,70]
[null,null,"2014-05-18",9784,91]
[null,null,"2014-05-18",2182,100]
[null,null,"2014-05-18",10345,93]
[null,null,"2014-05-18",13320,98]
[null,null,"2014-05-18",13246,96]
[null,null,"2014-05-18",18363,65]
[null,null,"2014-05-18",29186,83]
[null,null,"2014-05-18",20593,53]
[null,null,"2014-05-18",31893,93]
[null,null,"2014-05-18",39824,71]
[null,null,"2014-05-18",42496,65]
[null,null,"2014-05-18",41501,76]
[null,null,"2014-05-18",76707,54]
[null,null,"2014-05-18",3199,180]
[null,null,"2014-05-18",7396,150]
[null,null,"2014-05-18",2666,128]
[null,null,"2014-05-18",10559,157]
[null,null,"2014-05-18",12636,101]
[null,null,"2014-05-18",18455,154]
[null,null,"2014-05-18",29780,123]
[null,null,"2014-05-18",21875,199]
[null,null,"2014-05-18",26460,135]
[null,null,"2014-05-18",34904,199]
[null,null,"2014-05-18",32568,120]
[null,null,"2014-05-18",36158,140]
[null,null,"2014-05-18",1153,224]
[null,null,"2014-05-18",8030,332]
[null,null,"2014-05-18",3296,227]
[null,null,"2014-05-18",155,221]
[null,null,"2014-05-18",15292,478]
[null,null,"2014-05-18",25886,369]
[null,null,"2014-05-18",25412,446]
[null,null,"2014-05-18",28183,267]
[null,null,"2014-05-19",1762,5]
[null,null,"2014-05-19",16494,19]
[null,null,"2014-05-19",13255,38]
[null,null,"2014-05-19",14880,46]
[null,null,"2014-05-19",18871,19]
[null,null,"2014-05-19",29301,39]
[null,null,"2014-05-19",32785,20]
[null,null,"2014-05-19",38608,34]
[null,null,"2014-05-19",40952,36]
[null,null,"2014-05-19",49699,16]
[null,null,"2014-05-19",61224,1]
[null,null,"2014-05-19",4888,64]
[null,null,"2014-05-19",4024,74]
[null,null,"2014-05-19",116,66]
[null,null,"2014-05-19",19728,67]
[null,null,"2014-05-19",27439,56]
[null,null,"2014-05-19",23283,61]
[null,null,"2014-05-19",20970,95]
[null,null,"2014-05-19",44297,100]
[null,null,"2014-05-19",49829,71]
[null,null,"2014-05-19",56327,99]
[null,null,"2014-05-19",54993,88]
[null,null,"2014-05-19",87035,85]
[null,null,"2014-05-19",60,144]
[null,null,"2014-05-19",3709,184]
[null,null,"2014-05-19",14071,101]
[null,null,"2014-05-19",17824,161]
[null,null,"2014-05-19",13233,165]
[null,null,"2014-05-19",21650,159]
[null,null,"2014-05-19",24478,128]
[null,null,"2014-05-19",39648,161]
[null,null,"2014-05-19",41656,122]
[null,null,"2014-05-19",48879,120]
[null,null,"2014-05-19",46881,171]
[null,null,"2014-05-19",93492,107]
[null,null,"2014-05-19",2799,485]
[null,null,"2014-05-19",14158,425]
[null,null,"2014-05-19",27408,471]
[null,null,"2014-05-19",23915,434]
[null,null,"2014-05-19",20839,449]
[null,null,"2014-05-19",27172,332]
[null,null,"2014-05-20",3484,30]
[null,null,"2014-05-20",7281,22]
[null,null,"2014-05-20",19874,18]
[null,null,"2014-05-20",10985,34]
[null,null,"2014-05-20",25405,8]
[null,null,"2014-05-20",28533,18]
[null,null,"2014-05-20",27972,41]
[null,null,"2014-05-20",20942,25]
[null,null,"2014-05-20",24909,35]
[null,null,"2014-05-20",36961,34]
[null,null,"2014-05-20",5968,94]
[null,null,"2014-05-20",1254,94]
[null,null,"2014-05-20",8155,58]
[null,null,"2014-05-20",17110,80]
[null,null,"2014-05-20",14951,51]
[null,null,"2014-05-20",12651,80]
[null,null,"2014-05-20",22348,90]
[null,null,"2014-05-20",20304,75]
[null,null,"2014-05-20",38590,51]
[null,null,"2014-05-20",53348,82]
[null,null,"2014-05-20",61432,61]
[null,null,"2014-05-20",5057,130]
[null,null,"2014-05-20",597,129]
[null,null,"2014-05-20",15533,108]
[null,null,"2014-05-20",22762,147]
[null,null,"2014-05-20",25415,176]
[null,null,"2014-05-20",31737,139]
[null,null,"2014-05-20",49018,195]
[null,null,"2014-05-20",42636,131]
[null,null,"2014-05-20",55529,168]
[null,null,"2014-05-20",17259,477]
[null,null,"2014-05-20",17967,219]
[null,null,"2014-05-20",28436,391]
[null,null,"2014-05-20",32523,328]
[null,null,"2014-05-20",39444,405]
[null,null,"2014-05-20",43223,211]
[null,null,"2014-05-21",5690,9]
[null,null,"2014-05-21",2842,34]
[null,null,"2014-05-21",25544,22]
[null,null,"2014-05-21",20349,5]
[null,null,"2014-05-21",34925,26]
[null,null,"2014-05-21",5816,81]
[null,null,"2014-05-21",14664,51]
[null,null,"2014-05-21",11278,52]
[null,null,"2014-05-21",12715,73]
[null,null,"2014-05-21",15943,61]
[null,null,"2014-05-21",17699,69]
[null,null,"2014-05-21",27651,56]
[null,null,"2014-05-21",24869,67]
[null,null,"2014-05-21",38396,83]
[null,null,"2014-05-21",50717,54]
[null,null,"2014-05-21",73976,65]
[null,null,"2014-05-21",4695,196]
[null,null,"2014-05-21",5702,104]
[null,null,"2014-05-21",15249,102]
[null,null,"2014-05-21",12185,138]
[null,null,"2014-05-21",11176,126]
[null,null,"2014-05-21",19758,138]
[null,null,"2014-05-21",27676,105]
[null,null,"2014-05-21",20114,178]
[null,null,"2014-05-21",28980,145]
[null,null,"2014-05-21",21410,137]
[null,null,"2014-05-21",34728,149]
[null,null,"2014-05-21",31888,174]
[null,null,"2014-05-21",36927,131]
[null,null,"2014-05-21",55381,128]
[null,null,"2014-05-21",73682,195]
[null,null,"2014-05-21",6571,435]
[null,null,"2014-05-21",536,387]
[null,null,"2014-05-21",3911,369]
[null,null,"2014-05-21",9909,296]
[null,null,"2014-05-21",19598,205]
[null,null,"2014-05-21",13419,427]
[null,null,"2014-05-21",20524,252]
[null,null,"2014-05-21",36999,320]
[null,null,"2014-05-21",38853,497]
[null,null,"2014-05-21",51526,420]
[null,null,"2014-05-22",1348,5]
[null,null,"2014-05-22",6242,50]
[null,null,"2014-05-22",7197,48]
[null,null,"2014-05-22",10138,32]
[null,null,"2014-05-22",14944,44]
[null,null,"2014-05-22",13711,8]
[null,null,"2014-05-22",23194,39]
[null,null,"2014-05-22",27035,50]
[null,null,"2014-05-22",37672,13]
[null,null,"2014-05-22",44544,48]
[null,null,"2014-05-22",54991,15]
[null,null,"2014-05-22",59611,27]
[null,null,"2014-05-22",80507,36]
[null,null,"2014-05-22",6685,82]
[null,null,"2014-05-22",5688,65]
[null,null,"2014-05-22",9818,100]
[null,null,"2014-05-22",765,70]
[null,null,"2014-05-22",14919,74]
[null,null,"2014-05-22",18123,87]
[null,null,"2014-05-22",14900,96]
[null,null,"2014-05-22",19955,97]
[null,null,"2014-05-22",17229,80]
[null,null,"2014-05-22",13464,72]
[null,null,"2014-05-22",17432,88]
[null,null,"2014-05-22",21593,54]
[null,null,"2014-05-22",21191,95]
[null,null,"2014-05-22",28997,72]
[null,null,"2014-05-22",28221,66]
[null,null,"2014-05-22",22650,66]
[null,null,"2014-05-22",38692,98]
[null,null,"2014-05-22",42213,77]
[null,null,"2014-05-22",53250,73]
[null,null,"2014-05-22",52884,51]
[null,null,"2014-05-22",79495,73]
[null,null,"2014-05-22",85142,81]
[null,null,"2014-05-22",672,183]
[null,null,"2014-05-22",8068,111]
[null,null,"2014-05-22",1545,130]
[null,null,"2014-05-22",17872,179]
[null,null,"2014-05-22",28042,129]
[null,null,"2014-05-22",27873,169]
[null,null,"2014-05-22",26109,182]
[null,null,"2014-05-22",25996,142]
[null,null,"2014-05-22",31696,112]
[null,null,"2014-05-22",33789,125]
[null,null,"2014-05-22",36180,125]
[null,null,"2014-05-22",40377,151]
[null,null,"2014-05-22",7365,440]
[null,null,"2014-05-22",2435,327]
[null,null,"2014-05-22",4267,483]
[null,null,"2014-05-22",5727,406]
[null,null,"2014-05-22",19110,471]
[null,null,"2014-05-22",16846,479]
[null,null,"2014-05-22",16603,363]
[null,null,"2014-05-22",14462,326]
[null,null,"2014-05-22",24110,355]
[null,null,"2014-05-22",26669,301]
[null,null,"2014-05-23",5805,22]
[null,null,"2014-05-23",6022,41]
[null,null,"2014-05-23",13132,42]
[null,null,"2014-05-23",12228,43]
[null,null,"2014-05-23",24388,47]
[null,null,"2014-05-23",23450,47]
[null,null,"2014-05-23",23247,38]
[null,null,"2014-05-23",36852,40]
[null,null,"2014-05-23",40634,29]
[null,null,"2014-05-23",55909,35]
[null,null,"2014-05-23",71239,26]
[null,null,"2014-05-23",94321,47]
[null,null,"2014-05-23",9834,100]
[null,null,"2014-05-23",3541,79]
[null,null,"2014-05-23",1805,77]
[null,null,"2014-05-23",6060,57]
[null,null,"2014-05-23",17322,83]
[null,null,"2014-05-23",15251,69]
[null,null,"2014-05-23",14600,57]
[null,null,"2014-05-23",23595,56]
[null,null,"2014-05-23",21922,92]
[null,null,"2014-05-23",39671,66]
[null,null,"2014-05-23",37645,73]
[null,null,"2014-05-23",43405,91]
[null,null,"2014-05-23",44315,95]
[null,null,"2014-05-23",48799,85]
[null,null,"2014-05-23",43812,88]
[null,null,"2014-05-23",55562,83]
[null,null,"2014-05-23",55379,91]
[null,null,"2014-05-23",56375,65]
[null,null,"2014-05-23",55926,50]
[null,null,"2014-05-23",10785,143]
[null,null,"2014-05-23",18439,157]
[null,null,"2014-05-23",16870,193]
[null,null,"2014-05-23",16828,200]
[null,null,"2014-05-23",25719,141]
[null,null,"2014-05-23",29306,147]
[null,null,"2014-05-23",25284,121]
[null,null,"2014-05-23",21457,139]
[null,null,"2014-05-23",20123,147]
[null,null,"2014-05-23",32767,177]
[null,null,"2014-05-23",39360,169]
[null,null,"2014-05-23",47207,108]
[null,null,"2014-05-23",49090,128]
[null,null,"2014-05-23",62341,147]
[null,null,"2014-05-23",66756,165]
[null,null,"2014-05-23",11595,450]
[null,null,"2014-05-23",15618,498]
[null,null,"2014-05-23",28644,308]
[null,null,"2014-05-23",28209,358]
[null,null,"2014-05-23",22501,390]
[null,null,"2014-05-23",68756,449]
[null,null,"2014-05-23",71270,365]
[null,null,"2014-05-24",3337,22]
[null,null,"2014-05-24",13371,28]
[null,null,"2014-05-24",16986,10]
[null,null,"2014-05-24",15150,34]
[null,null,"2014-05-24",38021,12]
[null,null,"2014-05-24",58815,39]
[null,null,"2014-05-24",65964,12]
[null,null,"2014-05-24",72823,36]
[null,null,"2014-05-24",97874,7]
[null,null,"2014-05-24",4278,83]
[null,null,"2014-05-24",851,61]
[null,null,"2014-05-24",2225,65]
[null,null,"2014-05-24",1847,70]
[null,null,"2014-05-24",8821,76]
[null,null,"2014-05-24",9306,70]
[null,null,"2014-05-24",8029,61]
[null,null,"2014-05-24",19669,80]
[null,null,"2014-05-24",16158,92]
[null,null,"2014-05-24",17163,91]
[null,null,"2014-05-24",19318,86]
[null,null,"2014-05-24",10476,64]
[null,null,"2014-05-24",21185,90]
[null,null,"2014-05-24",25303,75]
[null,null,"2014-05-24",25951,83]
[null,null,"2014-05-24",24999,76]
[null,null,"2014-05-24",39399,66]
[null,null,"2014-05-24",42769,99]
[null,null,"2014-05-24",54633,90]
[null,null,"2014-05-24",7374,106]
[null,null,"2014-05-24",2945,137]
[null,null,"2014-05-24",9477,101]
[null,null,"2014-05-24",2698,160]
[null,null,"2014-05-24",310,111]
[null,null,"2014-05-24",4677,139]
[null,null,"2014-05-24",9020,150]
[null,null,"2014-05-24",18507,180]
[null,null,"2014-05-24",11974,185]
[null,null,"2014-05-24",13426,108]
[null,null,"2014-05-24",23974,121]
[null,null,"2014-05-24",28550,142]
[null,null,"2014-05-24",26106,135]
[null,null,"2014-05-24",20867,105]
[null,null,"2014-05-24",21655,143]
[null,null,"2014-05-24",22627,120]
[null,null,"2014-05-24",29291,157]
[null,null,"2014-05-24",31266,105]
[null,null,"2014-05-24",40512,173]
[null,null,"2014-05-24",58326,139]
[null,null,"2014-05-24",25870,279]
[null,null,"2014-05-24",28198,279]
[null,null,"2014-05-24",21372,476]
[null,null,"2014-05-24",38042,402]
[null,null,"2014-05-24",30790,488]
[null,null,"2014-05-24",46844,219]
[null,null,"2014-05-24",41371,315]
[null,null,"2014-05-25",6133,42]
[null,null,"2014-05-25",18155,28]
[null,null,"2014-05-25",29736,19]
[null,null,"2014-05-25",25219,7]
[null,null,"2014-05-25",39123,4]
[null,null,"2014-05-25",56751,5]
[null,null,"2014-05-25",57120,15]
[null,null,"2014-05-25",54200,22]
[null,null,"2014-05-25",5860,77]
[null,null,"2014-05-25",5758,51]
[null,null,"2014-05-25",8310,60]
[null,null,"2014-05-25",704,50]
[null,null,"2014-05-25",17011,55]
[null,null,"2014-05-25",24878,65]
[null,null,"2014-05-25",24212,81]
[null,null,"2014-05-25",35710,72]
[null,null,"2014-05-25",57765,51]
[null,null,"2014-05-25",68717,50]
[null,null,"2014-05-25",4058,136]
[null,null,"2014-05-25",7415,108]
[null,null,"2014-05-25",5821,175]
[null,null,"2014-05-25",7297,118]
[null,null,"2014-05-25",3458,188]
[null,null,"2014-05-25",13556,162]
[null,null,"2014-05-25",10909,141]
[null,null,"2014-05-25",13666,186]
[null,null,"2014-05-25",31554,170]
[null,null,"2014-05-25",54907,123]
[null,null,"2014-05-25",5899,492]
[null,null,"2014-05-25",19537,462]
[null,null,"2014-05-25",27929,356]
[null,null,"2014-05-25",34182,270]
[null,null,"2014-05-26",6235,43]
[null,null,"2014-05-26",6559,32]
[null,null,"2014-05-26",14132,19]
[null,null,"2014-05-26",11999,48]
[null,null,"2014-05-26",19988,38]
[null,null,"2014-05-26",18100,21]
[null,null,"2014-05-26",23926,3]
[null,null,"2014-05-26",20265,34]
[null,null,"2014-05-26",42728,48]
[null,null,"2014-05-26",89275,47]
[null,null,"2014-05-26",6679,77]
[null,null,"2014-05-26",7096,90]
[null,null,"2014-05-26",2077,80]
[null,null,"2014-05-26",2185,99]
[null,null,"2014-05-26",15991,55]
[null,null,"2014-05-26",13215,70]
[null,null,"2014-05-26",11626,66]
[null,null,"2014-05-26",10168,74]
[null,null,"2014-05-26",11096,74]
[null,null,"2014-05-26",20560,56]
[null,null,"2014-05-26",26444,76]
[null,null,"2014-05-26",41586,64]
[null,null,"2014-05-26",52526,56]
[null,null,"2014-05-26",58306,95]
[null,null,"2014-05-26",50177,84]
[null,null,"2014-05-26",70088,80]
[null,null,"2014-05-26",1342,194]
[null,null,"2014-05-26",10358,138]
[null,null,"2014-05-26",14043,158]
[null,null,"2014-05-26",10222,115]
[null,null,"2014-05-26",29475,157]
[null,null,"2014-05-26",26100,173]
[null,null,"2014-05-26",26493,126]
[null,null,"2014-05-26",29518,169]
[null,null,"2014-05-26",39080,170]
[null,null,"2014-05-26",36554,178]
[null,null,"2014-05-26",48121,160]
[null,null,"2014-05-26",54505,115]
[null,null,"2014-05-26",88360,175]
[null,null,"2014-05-26",7739,349]
[null,null,"2014-05-26",8391,258]
[null,null,"2014-05-26",13274,416]
[null,null,"2014-05-26",25957,315]
[null,null,"2014-05-26",43999,437]
[null,null,"2014-05-26",43961,307]
[null,null,"2014-05-26",56476,363]
[null,null,"2014-05-27",1543,33]
[null,null,"2014-05-27",6237,45]
[null,null,"2014-05-27",4435,19]
[null,null,"2014-05-27",18765,18]
[null,null,"2014-05-27",19207,10]
[null,null,"2014-05-27",26875,11]
[null,null,"2014-05-27",34641,24]
[null,null,"2014-05-27",33648,18]
[null,null,"2014-05-27",48502,23]
[null,null,"2014-05-27",83130,36]
[null,null,"2014-05-27",937,71]
[null,null,"2014-05-27",5853,51]
[null,null,"2014-05-27",11184,93]
[null,null,"2014-05-27",18776,64]
[null,null,"2014-05-27",15888,83]
[null,null,"2014-05-27",29479,81]
[null,null,"2014-05-27",41690,79]
[null,null,"2014-05-27",59223,76]
[null,null,"2014-05-27",58921,52]
[null,null,"2014-05-27",2590,179]
[null,null,"2014-05-27",3854,121]
[null,null,"2014-05-27",30062,125]
[null,null,"2014-05-27",30307,121]
[null,null,"2014-05-27",44129,176]
[null,null,"2014-05-27",59188,159]
[null,null,"2014-05-27",60601,119]
[null,null,"2014-05-27",70879,102]
[null,null,"2014-05-27",319,319]
[null,null,"2014-05-27",26050,218]
[null,null,"2014-05-27",30066,431]
[null,null,"2014-05-27",45602,341]
[null,null,"2014-05-27",55309,267]
[null,null,"2014-05-27",64583,418]
[null,null,"2014-05-28",16783,9]
[null,null,"2014-05-28",10189,50]
[null,null,"2014-05-28",19276,19]
[null,null,"2014-05-28",13104,11]
[null,null,"2014-05-28",21817,2]
[null,null,"2014-05-28",23923,23]
[null,null,"2014-05-28",29089,40]
[null,null,"2014-05-28",30661,25]
[null,null,"2014-05-28",44853,3]
[null,null,"2014-05-28",53374,15]
[null,null,"2014-05-28",65510,9]
[null,null,"2014-05-28",7731,69]
[null,null,"2014-05-28",1674,60]
[null,null,"2014-05-28",3105,85]
[null,null,"2014-05-28",10144,79]
[null,null,"2014-05-28",23598,80]
[null,null,"2014-05-28",29812,81]
[null,null,"2014-05-28",35048,85]
[null,null,"2014-05-28",32416,66]
[null,null,"2014-05-28",54071,92]
[null,null,"2014-05-28",68930,57]
[null,null,"2014-05-28",85206,90]
[null,null,"2014-05-28",4186,124]
[null,null,"2014-05-28",8729,107]
[null,null,"2014-05-28",9984,159]
[null,null,"2014-05-28",17791,117]
[null,null,"2014-05-28",33231,146]
[null,null,"2014-05-28",35198,193]
[null,null,"2014-05-28",42836,126]
[null,null,"2014-05-28",54529,153]
[null,null,"2014-05-28",56802,186]
[null,null,"2014-05-28",63870,128]
[null,null,"2014-05-28",74006,130]
[null,null,"2014-05-28",11412,368]
[null,null,"2014-05-28",10292,245]
[null,null,"2014-05-28",29809,278]
[null,null,"2014-05-28",23708,288]
[null,null,"2014-05-28",35180,335]
[null,null,"2014-05-28",54501,360]
[null,null,"2014-05-29",7487,27]
[null,null,"2014-05-29",3526,2]
[null,null,"2014-05-29",17996,15]
[null,null,"2014-05-29",29297,34]
[null,null,"2014-05-29",22778,45]
[null,null,"2014-05-29",40378,20]
[null,null,"2014-05-29",49494,6]
[null,null,"2014-05-29",42221,15]
[null,null,"2014-05-29",53858,33]
[null,null,"2014-05-29",69790,47]
[null,null,"2014-05-29",98256,7]
[null,null,"2014-05-29",2876,71]
[null,null,"2014-05-29",6542,81]
[null,null,"2014-05-29",473,74]
[null,null,"2014-05-29",9876,51]
[null,null,"2014-05-29",5063,73]
[null,null,"2014-05-29",7068,85]
[null,null,"2014-05-29",8921,52]
[null,null,"2014-05-29",1769,63]
[null,null,"2014-05-29",5065,99]
[null,null,"2014-05-29",2795,68]
[null,null,"2014-05-29",17017,83]
[null,null,"2014-05-29",13071,76]
[null,null,"2014-05-29",14410,96]
[null,null,"2014-05-29",13578,89]
[null,null,"2014-05-29",15688,52]
[null,null,"2014-05-29",29274,58]
[null,null,"2014-05-29",26239,73]
[null,null,"2014-05-29",39861,70]
[null,null,"2014-05-29",34135,54]
[null,null,"2014-05-29",35630,83]
[null,null,"2014-05-29",33892,66]
[null,null,"2014-05-29",45640,92]
[null,null,"2014-05-29",45113,96]
[null,null,"2014-05-29",12972,193]
[null,null,"2014-05-29",20162,167]
[null,null,"2014-05-29",52790,144]
[null,null,"2014-05-29",51306,148]
[null,null,"2014-05-29",61230,199]
[null,null,"2014-05-29",65588,152]
[null,null,"2014-05-29",78737,169]
[null,null,"2014-05-29",11207,291]
[null,null,"2014-05-29",29708,341]
[null,null,"2014-05-29",29968,325]
[null,null,"2014-05-29",29036,411]
[null,null,"2014-05-29",36255,375]
[null,null,"2014-05-29",33662,305]
[null,null,"2014-05-29",47005,275]

{"sheet":"14 Tarifanalyse (A2)_","index":37,"n_rows":13,"n_cols":8,"rows_kept":13,"cut":false,"hidden":true,"merged":[]}
[null,2,2,2,1,1,1,0]
[1,"14 Charge analysis (E2)_",null,null,null,{"$f":"B2","v":"14 Charge analysis (E2)_"}]
[2,"14 Tarifanalyse (A2)_"]
[0]
[null,1,"Die Tarifanalyse ist ein typisches Beispiel für \"Was-wäre-wenn\"-Analysen mit Excel. Dabei werden ein oder mehrere Parameter verändert und man untersucht, welche Folgen das hat. In diesem Fall ist das Erhöhungsbetrag in Zelle J20.\n\nDiesen Wert einzutippen, ist aber viel zu unpraktisch. Das geht mit Excel sehr viel eleganter - und zwar mit Hilfe eines Scrollbalkens. Wie ein solcher Scrollbalken erstellt wird, lesen Sie bitte in der Übungsdatei \"Excel-Controls\" nach!",null,1,"Tariff analysis is a typical example of \"what-if\" analyses with Excel. Here, one or more parameters are changed and the consequences are investigated - in this case, the amount of increase in cell J20.\n\nBut typing this value is far too impractical. This can be done much more elegantly with Excel - with the help of a scroll bar. To find out how to create such a scroll bar, please refer to the exercise file \"Excel Controls\"!\n"]
[null,{"$f":"IF(C6<>\"\",B5+1,\"\")","v":2},"Im Video wird das vorgeführt. \n\nACHTUNG:\nFalls das Register \"Entwicklertools\" bei Ihnen noch nicht angezeigt wird, müssen Sie es zuerst einschalten!\n\nACHTUNG:\nBenutzen Sie NICHT die Formularsteuerelemente, SONDERN die ActiveX-Steuerelemente!!\n\nDie Parameter des Scrollbalkens sind: \nMin = 0\nMax = 20\nSmallChange = 1\nLargeChange = 5\nLinkedCell = J20",null,{"$f":"IF(F6<>\"\",E5+1,\"\")","v":2},"This is demonstrated in the video. \n\nATTENTION:\nIf the tab \"Developer\" is not yet displayed on your screen, you have to turn it on first!\n\nATTENTION:\nDO NOT use the form controls, BUT the ActiveX controls!\n\nThe parameters of the scrollbar are: \nMin = 0\nMax = 20\nSmallChange = 1\nLargeChange = 5\nLinkedCell = J20"]
[null,{"$f":"IF(C7<>\"\",B6+1,\"\")","v":3},"Stellen Sie mit Hilfe des Scrollbalkens verschiedene sinnvolle Werte in J20 ein, sehen Sie sich die Summen an, vergleichen Sie sie und interpretieren Sie das Ergebnis!",null,{"$f":"IF(F7<>\"\",E6+1,\"\")","v":3},"Use the scroll bar to set various meaningful values in J20, look at the totals, compare them and interpret the result!"]
[null,{"$f":"IF(C8<>\"\",B7+1,\"\")","v":4},"Stellen Sie die Summen in einem Säulendiagramm dar. Verändern Sie mit Hilfe des Scrollbalkens den Erhöhungsbetrag und beobachten Sie die Wirkung auf das Diagramm. \n\nFällt Ihnen auf, dass daran etwas schlecht ist? Beobachten Sie mal beim Ziehen am Scrollbalken die erste und die vierte Säule im Diagramm! Welchen (falschen!) Eindruck bekommt der Benutzer? Wie kann man das ändern?",null,4,"Display the totals in a bar chart. Use the scroll bar to change the amount of increase and observe the effect on the chart. \n\nDo you notice that there is something wrong with it? Observe the first and fourth column in the chart while dragging the scroll bar! What (wrong!) impression does the user get? How can this be changed?"]
[null,{"$f":"IF(C9<>\"\",B8+1,\"\")","v":""},null,null,{"$f":"IF(F9<>\"\",E8+1,\"\")","v":""}]
[null,"",null,null,""]
[null,"",null,null,""]
[null,null,null,null,""]
[null,null,null,null,""]

{"sheet":"14 Tarifanalyse (L2)_","index":38,"n_rows":13,"n_cols":8,"rows_kept":13,"cut":false,"hidden":true,"merged":[]}
[null,2,2,2,1,1,1,0]
[1,"14 Charge analysis (S2)_",null,null,null,{"$f":"B2","v":"14 Charge analysis (S2)_"}]
[2,"14 Tarifanalyse (L2)_"]
[0]
[null,1,"Die Tarifanalyse ist ein typisches Beispiel für \"Was-wäre-wenn\"-Analysen mit Excel. Dabei werden ein oder mehrere Parameter verändert und man untersucht, welche Folgen das hat. In diesem Fall ist das Erhöhungsbetrag in Zelle J20.\n\nDiesen Wert einzutippen, ist aber viel zu unpraktisch. Das geht mit Excel sehr viel eleganter - und zwar mit Hilfe eines Scrollbalkens. Wie ein solcher Scrollbalken erstellt wird, lesen Sie bitte in der Übungsdatei \"Excel-Controls\" nach!","B19",1,"Tariff analysis is a typical example of \"what-if\" analyses with Excel. Here, one or more parameters are changed and the consequences are investigated - in this case, the amount of increase in cell J20.\n\nBut typing this value is far too impractical. This can be done much more elegantly with Excel - with the help of a scroll bar. To find out how to create such a scroll bar, please refer to the exercise file \"Excel Controls\"!\n","B19"]
[null,{"$f":"IF(C6<>\"\",B5+1,\"\")","v":2},"Im Video wird das vorgeführt. \n\nACHTUNG:\nFalls das Register \"Entwicklertools\" bei Ihnen noch nicht angezeigt wird, müssen Sie es zuerst einschalten!\n\nACHTUNG:\nBenutzen Sie NICHT die Formularsteuerelemente, SONDERN die ActiveX-Steuerelemente!!\n\nDie Parameter des Scrollbalkens sind: \nMin = 0\nMax = 20\nSmallChange = 1\nLargeChange = 5\nLinkedCell = J20","B19",{"$f":"IF(F6<>\"\",E5+1,\"\")","v":2},"This is demonstrated in the video. \n\nATTENTION:\nIf the tab \"Developer\" is not yet displayed on your screen, you have to turn it on first!\n\nATTENTION:\nDO NOT use the form controls, BUT the ActiveX controls!\n\nThe parameters of the scrollbar are: \nMin = 0\nMax = 20\nSmallChange = 1\nLargeChange = 5\nLinkedCell = J20","B19"]
[null,{"$f":"IF(C7<>\"\",B6+1,\"\")","v":3},"Stellen Sie mit Hilfe des Scrollbalkens verschiedene sinnvolle Werte in J20 ein, sehen Sie sich die Summen an, vergleichen Sie sie und interpretieren Sie das Ergebnis!","B19",{"$f":"IF(F7<>\"\",E6+1,\"\")","v":3},"Use the scroll bar to set various meaningful values in J20, look at the totals, compare them and interpret the result!","B19"]
[null,{"$f":"IF(C8<>\"\",B7+1,\"\")","v":4},"Stellen Sie die Summen in einem Säulendiagramm dar. Verändern Sie mit Hilfe des Scrollbalkens den Erhöhungsbetrag und beobachten Sie die Wirkung auf das Diagramm. \n\nFällt Ihnen auf, dass daran etwas schlecht ist? Beobachten Sie mal beim Ziehen am Scrollbalken die erste und die vierte Säule im Diagramm! Welchen (falschen!) Eindruck bekommt der Benutzer? Wie kann man das ändern?","I3",4,"Display the totals in a bar chart. Use the scroll bar to change the amount of increase and observe the effect on the chart. \n\nDo you notice that there is something wrong with it? Observe the first and fourth column in the chart while dragging the scroll bar! What (wrong!) impression does the user get? How can this be changed?","I3"]
[null,"",null,null,{"$f":"IF(F9<>\"\",E8+1,\"\")","v":""}]
[null,"",null,null,""]
[null,"",null,null,""]
[null,null,null,null,""]
[null,null,null,null,""]

{"sheet":"15 Bevor Sie weitermachen … (2)","index":39,"n_rows":21,"n_cols":6,"rows_kept":21,"cut":false,"hidden":false,"merged":[[1,1,1,4],[2,1,2,4],[5,2,7,8],[8,2,10,8]]}
[null,null,null,null,null,0]
[1,"15 Before you continue … (2)",null,null,null,"Back to Start"]
[2,"15 Bevor Sie weitermachen … (2)",null,null,null,"Startseite"]
[]
[]
[1,null,"… please work throught the worksheet \n   \"Data validation\" \nin the file \"Excel-Basics\"!"]
[1]
[1]
[2,null,"… arbeiten Sie bitte das Arbeitsblatt \n   \"Datenüberprüfung\" \nin der Datei \"Excel-Basics\" durch!"]
[2]
[2]
[]
[]
[]
[]
[]
[]
[]
[]
[]
[0]

{"sheet":"16 Rechnung (A)","index":40,"n_rows":50,"n_cols":11,"rows_kept":50,"cut":false,"hidden":false,"merged":[[23,2,23,3],[24,2,24,3],[1,1,1,4],[2,1,2,4],[5,2,11,7],[12,2,18,7],[21,2,21,3],[22,2,22,3]]}
[null,null,null,null,null,null,null,null,null,null,0]
[1,"16 Invoice (E)",null,null,null,"Back to Start"]
[2,"16 Rechnung (A)",null,null,null,"Startseite"]
[]
[]
[2,"Übung","Vervollständigen Sie die folgende Rechnung entsprechend dem Bild rechts. Die orange gefärbten Zellen sollen mittels\n\n\"Daten / Datentools / Datenüberprüfung / Datenüberprüfung\"\n\nformatiert werden. Die gelb gefärbten Zellen sollen sich ihren Inhalt über SVERWEISe holen. Die erforderlichen Daten stehen auf den Arbeitsblättern \"Firmen\" bzw. \"Waren\"."]
[2]
[2]
[2]
[2]
[2]
[2]
[1,"Exercise","Complete the following invoice according to the picture on the right side. The orange cells shall be formatted using\n\n\"Data / Data Tools / Data Validation / Data Validation\"\n\nThe yellow cells shall use VLOOKUPs to get their content. The necessary data are stored on the worksheets \"Companies\" and \"Goods\", respectively."]
[1]
[1]
[1]
[1]
[1]
[1]
[]
[]
[]
[]
[]
[]
[]
[]
[null,null,"Good nr.","Good name","net price","per","Amount","Total net"]
[]
[]
[]
[]
[]
[]
[]
[]
[]
[]
[]
[]
[]
[]
[]
[]
[]
[null,null,null,null,null,null,"Net price"]
[null,null,"VAT:",0.19,null,null,"VAT"]
[null,null,null,null,null,null,"Gross price"]
[]
[0]

{"sheet":"16 Rechnung (A)_","index":41,"n_rows":12,"n_cols":8,"rows_kept":12,"cut":false,"hidden":true,"merged":[]}
[null,2,2,2,1,1,1,0]
[1,"16 Invoice (E)_",null,null,null,{"$f":"B2","v":"16 Invoice (E)_"}]
[2,"16 Rechnung (A)_"]
[0]
[null,1,"Vervollständigen Sie die folgende Rechnung entsprechend dem Bild rechts daneben. Die orange gefärbten Zellen sollen mittels\n\n\"Daten / Datentools / Datenüberprüfung / Datenüberprüfung\"\n\nformatiert werden.\n\nEine detaillierte Beschreibung des Funktion \"Datenüberprüfung\" finden Sie in der Übungsdatei \"Excel-Basics\"!\n\nDie gelb gefärbten Zellen sollen sich ihren Inhalt über SVERWEISe holen. Die erforderlichen Daten stehen auf den Arbeitsblättern \"Firmen\" bzw. \"Waren\".",null,1,"Complete the following calculation according to the picture to the right. The cells colored in orange should be formatted using\n\n\"Data / Data Tools / Data Validation / Data Validation\"\n\nYou will find a detailed description of the function \"Data Validation\" in the exercise file \"Excel-Basics\"!\n\nThe cells colored in yellow should get their contents by means of VLOOKUP. The required data are on the worksheets \"Companies\" or \"Goods\"."]
[null,{"$f":"IF(C6<>\"\",B5+1,\"\")","v":2},"Das Video zeigt die Funktionsweise der Datenüberprüfung und der SVERWEISe:\n\nDer Benutzer wählt eine Firma aus und der Rest der Adresse wird automatisch mit Hilfe von SVERWEISen eingefügt.\n\nDer Benutzer wählt eine Warenbezeichnung aus und der Rest wird mit Hilfe von SVERWEISen eingefügt.\n\nACHTUNG:\n\nIn der Adresse müssen Sie die Anrede und den Namen bzw. die Postleitzahl und den Ort mit zwei SVERWEISen holen und beide mit \"&\" miteinander verknüpfen!",null,{"$f":"IF(F6<>\"\",E5+1,\"\")","v":2},"The video shows how the data verification and the VLOOKUPs work:\n\nThe user selects a company and the rest of the address is automatically inserted using the VLOOKUPs.\n\nThe user selects a product description and the rest of the address is inserted using the VLOOKUP.\n\nATTENTION:\n\nIn the address you have to get the salutation and the name or the postcode and the city, respectively, with two VLOOKUPs and connect them with a \"&\" with each other!"]
[null,{"$f":"IF(C7<>\"\",B6+1,\"\")","v":""},null,null,{"$f":"IF(F7<>\"\",E6+1,\"\")","v":""}]
[null,"",null,null,{"$f":"IF(F8<>\"\",E7+1,\"\")","v":""}]
[null,"",null,null,{"$f":"IF(F9<>\"\",E8+1,\"\")","v":""}]
[null,"",null,null,""]
[null,"",null,null,""]
[null,{"$f":"IF(C12<>\"\",B11+1,\"\")","v":""},null,null,{"$f":"IF(F12<>\"\",E11+1,\"\")","v":""}]

{"sheet":"16 Firmen","index":42,"n_rows":21,"n_cols":9,"rows_kept":21,"cut":false,"hidden":false,"merged":[[1,1,1,4],[2,1,2,4]]}
[null,null,null,null,null,null,null,null,0]
[1,"16 Companies",null,null,null,"Back to Start"]
[2,"16 Firmen",null,null,null,"Startseite"]
[]
[]
[null,null,"Company","Salutation","Contact person","Address","ZIP code","City"]
[null,null,"Babin Machine Inc.","Mr","Oliver Young","East Street 111","EC2 5NT","London"]
[null,null,"Ready Tool Co.","Ms","Olivia Brewster","West Av. 222","T2F 8M4","Tsawassen"]
[null,null,"McCrosky Tool Corp.","Ms","Jessica Miller","Middle Boulevard 333",87110,"Albuquerque"]
[null,null,"Turner Ace Hardware","Mr","Charlie Nolan","South Place 444",97201,"Portland"]
[null,null,"Tool House Inc.","Mr","Thomas Sawyer","North Way 555","H1J 1C3","Montréal"]
[null,null,"GlobalAxxs","Ms","Isabella Hanson","East Av. 666","LA9 PX8","Hedge End"]
[null,null,"Pelham Tool Company Inc.","Mr","Jack Rodriguez","West Str. 777",83720,"Boise"]
[null,null,"Gasser True Value & Farm Sup","Mr","Jacob Wayne","South Place 888",98128,"Seattle"]
[null,null,"Hardware Bath & More","Mr","William West","South Avenue 123",97403,"Eugene"]
[null,null,"Mountaineer Precision Tools","Ms","Sophie Ward","North Street 456",94117,"San Francisco"]
[null,null,"Mayer Paint & Hardware","Mr","James Brown","East Av. 789",5022,"San Cristóbal"]
[]
[]
[]
[0]

{"sheet":"16 Waren","index":43,"n_rows":20,"n_cols":9,"rows_kept":20,"cut":false,"hidden":false,"merged":[[1,1,1,4],[2,1,2,4]]}
[null,null,null,null,null,null,null,null,0]
[1,"16 Goods",null,null,null,"Back to Start"]
[2,"16 Waren",null,null,null,"Startseite"]
[]
[]
[null,null,"Good name","Good nr.","Net price","per"]
[null,null,"Planks","111-001",1.99,"meter",null,"meter"]
[null,null,"Cement","111-002",2.99,"kg",null,"kg"]
[null,null,"Green color","222-001",4.99,"liter",null,"liter"]
[null,null,"Red color","222-002",4.99,"liter",null,"item"]
[null,null,"Pushcart","333-001",24.99,"item"]
[null,null,"Nails, 40 mm","444-001",2.99,"kg"]
[null,null,"Nails, 60 mm","444-002",3.49,"kg"]
[null,null,"Nails, 80 mm","444-003",3.89,"kg"]
[null,null,"tube, 50mm","555-001",7.99,"meter"]
[null,null,"tube, 80mm","555-002",12.99,"meter"]
[null,null,"tube, 120mm","555-003",15.99,"meter"]
[]
[]
[0]

{"sheet":"17 Wert in Liste","index":44,"n_rows":69,"n_cols":14,"rows_kept":69,"cut":false,"hidden":false,"merged":[[1,1,1,4],[2,1,2,4],[4,2,6,7],[7,2,9,7]]}
[null,null,null,null,null,null,null,null,null,null,null,2,1,0]
[1,"17 Value in list",null,null,null,"Back to Start"]
[2,"17 Wert in Liste",null,null,null,"Startseite"]
[]
[2,null,"Ist ein bestimmter Tag ein Feiertag?\nd.h.: \"Befindet sich der Wert aus Spalte C auch in Spalte K?\""]
[2]
[2]
[1,null,"Is a certain day a holiday?\ni.e.: \"Is the value from column C also in column K?\""]
[1]
[1]
[]
[1,null,null,null,null,null,null,null,null,null,"Holidays"]
[2,null,null,null,null,null,null,null,null,null,"Feiertage"]
[]
[null,null,"2020-04-10",{"$f":"IFERROR(VLOOKUP(C15,$K$15:$L$20,2,FALSE),\"\")","v":"Karfreitag"},{"$f":"IFERROR(VLOOKUP(C15,$K$15:$M$20,3,FALSE),\"\")","v":"Good Friday"},null,null,null,null,null,"2020-04-10","Karfreitag","Good Friday"]
[null,null,{"$f":"C15+1","v":"2020-04-11"},"",{"$f":"IFERROR(VLOOKUP(C16,$K$15:$M$20,3,FALSE),\"\")","v":""},null,null,null,null,null,{"$f":"K15+2","v":"2020-04-12"},"Ostersonntag","Easter Sunday"]
[null,null,{"$f":"C16+1","v":"2020-04-12"},"Ostersonntag","Easter Sunday",null,null,null,null,null,{"$f":"K16+1","v":"2020-04-13"},"Ostermontag","Easter Monday"]
[null,null,"2020-04-13","Ostermontag","Easter Monday",null,null,null,null,null,"2020-05-01","Tag der Arbeit","Labour Day"]
[null,null,"2020-04-14","","",null,null,null,null,null,"2020-05-31","Pfingstsonntag","Whit Sunday"]
[null,null,"2020-04-15","","",null,null,null,null,null,{"$f":"K19+1","v":"2020-06-01"},"Pfingstmontag","Whit Monday"]
[null,null,"2020-04-16","",""]
[null,null,"2020-04-17","",""]
[null,null,"2020-04-18","",""]
[null,null,"2020-04-19","",""]
[null,null,"2020-04-20","",""]
[null,null,"2020-04-21","",""," "]
[null,null,"2020-04-22","",""]
[null,null,"2020-04-23","",""]
[null,null,"2020-04-24","",""]
[null,null,"2020-04-25","",""]
[null,null,"2020-04-26","",""]
[null,null,"2020-04-27","",""]
[null,null,"2020-04-28","",""]
[null,null,"2020-04-29","",""]
[null,null,"2020-04-30","",""]
[0,null,"2020-05-01","Tag der Arbeit","Labour Day"]
[null,null,"2020-05-02","",""]
[null,null,"2020-05-03","",""]
[null,null,{"$f":"C38+1","v":"2020-05-04"},"",""]
[null,null,"2020-05-05","",""]
[null,null,"2020-05-06","",""]
[null,null,"2020-05-07","",""]
[null,null,"2020-05-08","",""]
[null,null,"2020-05-09","",""]
[null,null,"2020-05-10","",""]
[null,null,"2020-05-11","",""]
[null,null,"2020-05-12","",""]
[null,null,"2020-05-13","",""]
[null,null,"2020-05-14","",""]
[null,null,"2020-05-15","",""]
[null,null,"2020-05-16","",""]
[null,null,"2020-05-17","",""]
[null,null,"2020-05-18","",""]
[null,null,"2020-05-19","",""]
[null,null,"2020-05-20","",""]
[null,null,"2020-05-21","",""]
[null,null,{"$f":"C56+1","v":"2020-05-22"},"",""]
[null,null,"2020-05-23","",""]
[null,null,"2020-05-24","",""]
[null,null,"2020-05-25","",""]
[null,null,"2020-05-26","",""]
[null,null,"2020-05-27","",""]
[null,null,"2020-05-28","",""]
[null,null,"2020-05-29","",""]
[null,null,"2020-05-30","",""]
[null,null,"2020-05-31","Pfingstsonntag","Whit Sunday"]
[null,null,"2020-06-01","Pfingstmontag","Whit Monday"]
[null,null,"2020-06-02","",""]
[null,null,"2020-06-03","",""]

{"sheet":"17 Wert in Liste_","index":45,"n_rows":13,"n_cols":8,"rows_kept":13,"cut":false,"hidden":true,"merged":[]}
[null,2,2,2,1,1,1,0]
[1,"17 Value in list_",null,null,null,{"$f":"B2","v":"17 Value in list_"}]
[2,"17 Wert in Liste_"]
[0]
[null,1,"Hier kommt nochmal eine ganz andere Anwendung des SVERWEISes.\n\nManchmal (z.B. für eine Inventur) möchte man wissen, ob ein Wert aus einer Liste in einer anderen Liste auch vorhanden ist. Sehen Sie sich dazu bitte das Beispiel an:\n\nWir haben hier eine Liste mit Feiertagen und möchten dann in einer anderen Liste wissen, ob ein bestimmter Tag ein Feiertag ist. ",null,1,"Here is a completely different application of the VLOOKUP.\n\nSometimes (e.g. for an inventory) you want to know if a value from one list is also existing in another list. Please have a look at the example:\n\nWe have a list of holidays here and then want to know in another list whether a certain day is a holiday. "]
[null,{"$f":"IF(C6<>\"\",B5+1,\"\")","v":2},"Der Trick dabei besteht in der Verwendung der Formel WENNFEHLER. Das erste Argument dieser Formel ist wieder eine Formel - in diesem Beispiel ein SVERWEIS. Wird diese Formel (also der SVERWEIS) erfolgreich ausgeführt, so ist hat man damit das Ergebnis - wenn nicht, kann man als zweites Argument eine Alternative angeben.\n\nIn diesem Beispiel fordern wir also: Wenn der SVERWEIS nicht erfolgreich ausgeführt werden kann (wenn der Wert aus der linken Liste also NICHT in der rechten Liste gefunden wird), soll die Ergebniszelle leer bleiben. \n\nIn Spalte D tauchen dann also diejenigen Werte auf, die auch in Spalte L gefunden wurden. Voila!",null,{"$f":"IF(F6<>\"\",E5+1,\"\")","v":2},"The trick is to use the formula IFERROR.  The first argument of this formula is again a formula - in this example a VLOOKUP. If this formula (i.e. the VLOOKUP) is executed successfully, you have the result - if not, you can specify an alternative as the second argument.\n\nIn this example, we therefore require: If the VLOOKUP cannot be executed successfully (if the value from the left-hand list is NOT found in the right-hand list), the result cell should remain empty. \n\nThen, in column D those values appear, which were also found in column L. Voila!"]
[null,{"$f":"IF(C7<>\"\",B6+1,\"\")","v":""},null,null,{"$f":"IF(F7<>\"\",E6+1,\"\")","v":""}]
[null,"",null,null,""]
[null,"",null,null,""]
[null,"",null,null,""]
[null,"",null,null,""]
[null,"",null,null,""]
[null,"",null,null,""]

{"sheet":"18 Wert nicht in Liste","index":46,"n_rows":69,"n_cols":14,"rows_kept":69,"cut":false,"hidden":false,"merged":[[1,1,1,4],[2,1,2,4],[4,2,6,7],[7,2,9,7]]}
[null,null,null,null,null,null,null,null,null,null,null,2,1,0]
[1,"18 Value not in list",null,null,null,"Back to Start"]
[2,"18 Wert nicht in Liste",null,null,null,"Startseite"]
[]
[2,null,"Ist ein bestimmter Tag KEIN Feiertag?\nd.h.: \"Befindet sich der Wert aus Spalte C NICHT in Spalte K?\""]
[2]
[2]
[1,null,"Is a certain day NOT a holiday?\ni.e.: \"Is the value from column C NOT in column K?\""]
[1]
[1]
[]
[1,null,null,null,null,null,null,null,null,null,"Holidays"]
[2,null,null,null,null,null,null,null,null,null,"Feiertage"]
[]
[null,null,"2020-04-10",{"$f":"IF(ISERROR(VLOOKUP(C15,$K$15:$M$20,2,FALSE)),\"Kein Feiertag!\",\"\")","v":""},{"$f":"IF(ISERROR(VLOOKUP(C15,$K$15:$M$20,2,FALSE)),\"No holiday!\",\"\")","v":""},null,null,null,null,null,"2020-04-10","Karfreitag","Good Friday"]
[null,null,{"$f":"C15+1","v":"2020-04-11"},{"$f":"IF(ISERROR(VLOOKUP(C16,$K$15:$M$20,2,FALSE)),\"Kein Feiertag!\",\"\")","v":"Kein Feiertag!"},{"$f":"IF(ISERROR(VLOOKUP(C16,$K$15:$M$20,2,FALSE)),\"No holiday!\",\"\")","v":"No holiday!"},null,null,null,null,null,{"$f":"K15+2","v":"2020-04-12"},"Ostersonntag","Easter Sunday"]
[null,null,{"$f":"C16+1","v":"2020-04-12"},"","",null,null,null,null,null,{"$f":"K16+1","v":"2020-04-13"},"Ostermontag","Easter Monday"]
[null,null,"2020-04-13","","",null,null,null,null,null,"2020-05-01","Tag der Arbeit","Labour Day"]
[null,null,"2020-04-14","Kein Feiertag!","No holiday!",null,null,null,null,null,"2020-05-31","Pfingstsonntag","Whit Sunday"]
[null,null,"2020-04-15","Kein Feiertag!","No holiday!",null,null,null,null,null,{"$f":"K19+1","v":"2020-06-01"},"Pfingstmontag","Whit Monday"]
[null,null,"2020-04-16","Kein Feiertag!","No holiday!"]
[null,null,"2020-04-17","Kein Feiertag!","No holiday!"]
[null,null,"2020-04-18","Kein Feiertag!","No holiday!"]
[null,null,"2020-04-19","Kein Feiertag!","No holiday!"]
[null,null,"2020-04-20","Kein Feiertag!","No holiday!"]
[null,null,"2020-04-21","Kein Feiertag!","No holiday!"," "]
[null,null,"2020-04-22","Kein Feiertag!","No holiday!"]
[null,null,"2020-04-23","Kein Feiertag!","No holiday!"]
[null,null,"2020-04-24","Kein Feiertag!","No holiday!"]
[null,null,"2020-04-25","Kein Feiertag!","No holiday!"]
[null,null,"2020-04-26","Kein Feiertag!","No holiday!"]
[null,null,"2020-04-27","Kein Feiertag!","No holiday!"]
[null,null,"2020-04-28","Kein Feiertag!","No holiday!"]
[null,null,"2020-04-29","Kein Feiertag!","No holiday!"]
[null,null,"2020-04-30","Kein Feiertag!","No holiday!"]
[0,null,"2020-05-01","",""]
[null,null,"2020-05-02","Kein Feiertag!","No holiday!"]
[null,null,"2020-05-03","Kein Feiertag!","No holiday!"]
[null,null,{"$f":"C38+1","v":"2020-05-04"},"Kein Feiertag!","No holiday!"]
[null,null,"2020-05-05","Kein Feiertag!","No holiday!"]
[null,null,"2020-05-06","Kein Feiertag!","No holiday!"]
[null,null,"2020-05-07","Kein Feiertag!","No holiday!"]
[null,null,"2020-05-08","Kein Feiertag!","No holiday!"]
[null,null,"2020-05-09","Kein Feiertag!","No holiday!"]
[null,null,"2020-05-10","Kein Feiertag!","No holiday!"]
[null,null,"2020-05-11","Kein Feiertag!","No holiday!"]
[null,null,"2020-05-12","Kein Feiertag!","No holiday!"]
[null,null,"2020-05-13","Kein Feiertag!","No holiday!"]
[null,null,"2020-05-14","Kein Feiertag!","No holiday!"]
[null,null,"2020-05-15","Kein Feiertag!","No holiday!"]
[null,null,"2020-05-16","Kein Feiertag!","No holiday!"]
[null,null,"2020-05-17","Kein Feiertag!","No holiday!"]
[null,null,"2020-05-18","Kein Feiertag!","No holiday!"]
[null,null,"2020-05-19","Kein Feiertag!","No holiday!"]
[null,null,"2020-05-20","Kein Feiertag!","No holiday!"]
[null,null,"2020-05-21","Kein Feiertag!","No holiday!"]
[null,null,{"$f":"C56+1","v":"2020-05-22"},"Kein Feiertag!","No holiday!"]
[null,null,"2020-05-23","Kein Feiertag!","No holiday!"]
[null,null,"2020-05-24","Kein Feiertag!","No holiday!"]
[null,null,"2020-05-25","Kein Feiertag!","No holiday!"]
[null,null,"2020-05-26","Kein Feiertag!","No holiday!"]
[null,null,"2020-05-27","Kein Feiertag!","No holiday!"]
[null,null,"2020-05-28","Kein Feiertag!","No holiday!"]
[null,null,"2020-05-29","Kein Feiertag!","No holiday!"]
[null,null,"2020-05-30","Kein Feiertag!","No holiday!"]
[null,null,"2020-05-31","",""]
[null,null,"2020-06-01","",""]
[null,null,"2020-06-02","Kein Feiertag!","No holiday!"]
[null,null,"2020-06-03","Kein Feiertag!","No holiday!"]

{"sheet":"18 Wert nicht in Liste_","index":47,"n_rows":13,"n_cols":8,"rows_kept":13,"cut":false,"hidden":true,"merged":[]}
[null,2,2,2,1,1,1,0]
[1,"18 Value not in list_",null,null,null,{"$f":"B2","v":"18 Value not in list_"}]
[2,"18 Wert nicht in Liste_"]
[0]
[null,1,"Jetzt lösen wir die umgekehrte Aufgabe zu \"Wert in Liste\" - nämlich \"Wert nicht in Liste\". Dazu gehen wir wieder von denselben beiden Listen aus - links alle Tage eines Zeitraums, rechts einige Feiertage. Wir wollen jetzt links alle Tage markieren, die KEINE Feiertage sind, die also NICHT in der rechten Liste auftauchen.",null,1,"Now we solve the reverse task to \"Value in list\" - namely \"Value not in list\". Again, we start from the same two lists - on the left all days of a period, on the right some holidays. Now we want to mark all days on the left that are NOT holidays, i.e. that do NOT appear in the right list."]
[null,{"$f":"IF(C6<>\"\",B5+1,\"\")","v":2},"Dafür benutzen wir die Konstruktion WENN(ISTFEHLER(…) ). Die Formel ISTFEHLER hat als Argument wieder eine Formel. Wenn diese als Ergebnis einen Fehler liefert, liefert ISTFEHLER den Wert WAHR, sonst FALSCH. Das kann man dann wiederum mit WENN auswerten und entsprechend reagieren.\n\nIm vorliegenden Beispiel wird also \"Kein Feiertag!\" in die Ergebniszelle geschrieben, wenn der SVERWEIS einen Fehler liefert - wenn also der Wert aus Spalte C NICHT in Spalte K gefunden wurde. Ansonsten bleibt die Ergebniszelle leer.",null,{"$f":"IF(F6<>\"\",E5+1,\"\")","v":2},"For this we use the construction IF(ISERROR(...) ). The formula ISERROR again has a formula as an argument. If the formula returns an error as a result, ISERROR returns the value TRUE, otherwise FALSE. You can then evaluate this again with IF and react accordingly.\n\nIn this example, \"No holiday\" is written to the result cell if the VLOOKUP returns an error - i.e. if the value from column C was NOT found in column K. Otherwise the result cell remains empty."]
[null,{"$f":"IF(C7<>\"\",B6+1,\"\")","v":""},null,null,{"$f":"IF(F7<>\"\",E6+1,\"\")","v":""}]
[null,"",null,null,""]
[null,"",null,null,""]
[null,"",null,null,""]
[null,"",null,null,""]
[null,"",null,null,""]
[null,"",null,null,""]

{"sheet":"19 Containerlisten (A)","index":48,"n_rows":1031,"n_cols":17,"rows_kept":1031,"cut":false,"hidden":false,"merged":[[1,1,1,4],[2,1,2,4],[4,2,16,7],[17,2,27,7]]}
[null,null,null,null,null,null,null,null,null,null,null,0]
[1,"19 Container lists (E)",null,null,null,"Back to Start"]
[2,"19 Containerlisten (A)",null,null,null,"Startseite"]
[]
[2,null,"Sehr geehrter Herr Prof. Stern,\n\nich befinde mich momentan im Praxissemester im Bereich des Customer Order Managements bei ... und habe die Aufgabe bekommen, die sich im selben Depot befindenden Container zu vergleichen. Dazu habe ich zwei große Excel Dateien bekommen, eine mit allen Nummern der Container, die sich in einem bestimmten Depot X befinden und eine Datei mit Containern die sich laut B/L tatsächlich in dem bestimmten Depot X befinden dürfen, da oft Container im falschen Depot angeliefert werden. \n\nMeine Aufgabe ist es nun, die Container, die laut B/L im falschen Depot gelandet sind, herauszufiltern und aufzuzeigen."]
[2]
[2]
[2]
[2]
[2]
[2]
[2]
[2]
[2]
[2]
[2]
[2]
[1,null,"Dear Prof. Stern,\nI am currently in my practical semester in the area of Customer Order Management at . . . and got the task to compare the containers in the same depot. I got two big Excel files, one with all numbers of the containers, which are in a certain depot X and a file with containers, which according to B/L are allowed to be in the certain depot X, because often containers are delivered in the wrong depot.\n\nMy task now is to filter out and display the containers which, according to B/L, were delivered to the wrong depot. "]
[1]
[1]
[1]
[1]
[1]
[1]
[1]
[1]
[1]
[1]
[]
[1,null,null,null,null,null,null,null,"nr.",null,"should be","should-be-IN-is","should-be-NOT-IN-is",null,"is","is-IN-should-be","is-NOT-IN-should-be"]
[2,null,null,null,null,null,null,null,"lfd. Nr.",null,"Soll","Soll-IN-Ist","Soll-NICHT-IN-Ist",null,"Ist","Ist-IN-Soll","Ist-NICHT-IN-Soll"]
[null,null,null,null,null,null,null,null,1,null,"AAGL3468480",null,null,null,"AAON4796427"]
[null,null,null,null,null,null,null,null,2,null,"AAON4796427",null,null,null,"AAPV2473902"]
[null,null,null,null,null,null,null,null,3,null,"ABEM9913717",null,null,null,"ABEM9913717"]
[0,null,null,null,null,null,null,null,4,null,"ADAF3086286",null,null,null,"ACMA8539466"]
[null,null,null,null,null,null,null,null,5,null,"ADHQ4657848",null,null,null,"ADAF3086286"]
[null,null,null,null,null,null,null,null,6,null,"AECB8921848",null,null,null,"ADGF5583764"]
[null,null,null,null,null,null,null,null,7,null,"AERJ3543740",null,null,null,"ADHQ4657848"]
[null,null,null,null,null,null,null,null,8,null,"AFBI6509514",null,null,null,"ADIK6715729"]
[null,null,null,null,null,null,null,null,9,null,"AFPV8020951",null,null,null,"AECB8921848"]
[null,null,null,null,null,null,null,null,10,null,"AHBZ3857900",null,null,null,"AERJ3543740"]
[null,null,null,null,null,null,null,null,11,null,"AIBF3411259",null,null,null,"AFBI6509514"]
[null,null,null,null,null,null,null,null,12,null,"AIFN5823376",null,null,null,"AFPV8020951"]
[null,null,null,null,null,null,null,null,13,null,"AIQG4043854",null,null,null,"AHBZ3857900"]
[null,null,null,null,null,null,null,null,14,null,"AJCS7471893",null,null,null,"AHIF1905068"]
[null,null,null,null,null,null,null,null,15,null,"AJEY8464502",null,null,null,"AIQG4043854"]
[null,null,null,null,null,null,null,null,16,null,"AKIZ7728615",null,null,null,"AJEY8464502"]
[null,null,null,null,null,null,null,null,17,null,"AKMG6727897",null,null,null,"AKIZ7728615"]
[null,null,null,null,null,null,null,null,18,null,"AKRO7759177",null,null,null,"AKMG6727897"]
[null,null,null,null,null,null,null,null,19,null,"AKVS9989768",null,null,null,"AKRO7759177"]
[null,null,null,null,null,null,null,null,20,null,"ALDU3559198",null,null,null,"AKVS9989768"]
[null,null,null,null,null,null,null,null,21,null,"ALHR1574575",null,null,null,"ALAT8099538"]
[null,null,null,null,null,null,null,null,22,null,"ALPL4283872",null,null,null,"ALDU3559198"]
[null,null,null,null,null,null,null,null,23,null,"ALXM7618346",null,null,null,"ALHR1574575"]
[null,null,null,null,null,null,null,null,24,null,"AMJO5626498",null,null,null,"ALPL4283872"]
[null,null,null,null,null,null,null,null,25,null,"APKE5601144",null,null,null,"ALXM7618346"]
[null,null,null,null,null,null,null,null,26,null,"AQAK9147514",null,null,null,"AMJO5626498"]
[null,null,null,null,null,null,null,null,27,null,"AQMJ7595349",null,null,null,"AOLM1315106"]
[null,null,null,null,null,null,null,null,28,null,"ARMJ7968798",null,null,null,"APKE5601144"]
[null,null,null,null,null,null,null,null,29,null,"ASMH7923552",null,null,null,"AQAK9147514"]
[null,null,null,null,null,null,null,null,30,null,"ATGM7527329",null,null,null,"AQMJ7595349"]
[null,null,null,null,null,null,null,null,31,null,"ATIW6266470",null,null,null,"ARKS5092763"]
[null,null,null,null,null,null,null,null,32,null,"ATYX5551995",null,null,null,"AROU5041740"]
[null,null,null,null,null,null,null,null,33,null,"AUFV5796926",null,null,null,"ATRP6772300"]
[null,null,null,null,null,null,null,null,34,null,"AUSC4724451",null,null,null,"AUEE3043551"]
[null,null,null,null,null,null,null,null,35,null,"AVAG1582954",null,null,null,"AVAG1582954"]
[null,null,null,null,null,null,null,null,36,null,"AVFA6278608",null,null,null,"AVBO3221988"]
[null,null,null,null,null,null,null,null,37,null,"AWDV7180581",null,null,null,"AWDV7180581"]
[null,null,null,null,null,null,null,null,38,null,"AWFE5297872",null,null,null,"AWFE5297872"]
[null,null,null,null,null,null,null,null,39,null,"AYMV1524101",null,null,null,"AYUQ1318173"]
[null,null,null,null,null,null,null,null,40,null,"AYUQ1318173",null,null,null,"AZAQ7140066"]
[null,null,null,null,null,null,null,null,41,null,"AZAQ7140066",null,null,null,"AZOY3689351"]
[null,null,null,null,null,null,null,null,42,null,"AZIX3735263",null,null,null,"BAJI8636166"]
[null,null,null,null,null,null,null,null,43,null,"BAMG8508997",null,null,null,"BAMG8508997"]
[null,null,null,null,null,null,null,null,44,null,"BAYK6747518",null,null,null,"BBAM9507963"]
[null,null,null,null,null,null,null,null,45,null,"BBED2202157",null,null,null,"BBED2202157"]
[null,null,null,null,null,null,null,null,46,null,"BBYU9886359",null,null,null,"BBFV6729661"]
[null,null,null,null,null,null,null,null,47,null,"BCQN2308941",null,null,null,"BCDI3327263"]
[null,null,null,null,null,null,null,null,48,null,"BCZQ4535008",null,null,null,"BCQN2308941"]
[null,null,null,null,null,null,null,null,49,null,"BDAQ9217017",null,null,null,"BCZQ4535008"]
[null,null,null,null,null,null,null,null,50,null,"BDIQ7756374",null,null,null,"BEHJ9971711"]
[null,null,null,null,null,null,null,null,51,null,"BDRA6540004",null,null,null,"BFXN6431977"]
[null,null,null,null,null,null,null,null,52,null,"BEEB7835712",null,null,null,"BGED8966532"]
[null,null,null,null,null,null,null,null,53,null,"BFBS2791471",null,null,null,"BGGN9021587"]
[null,null,null,null,null,null,null,null,54,null,"BFXN6431977",null,null,null,"BGTQ7706886"]
[null,null,null,null,null,null,null,null,55,null,"BGED8966532",null,null,null,"BGVW3385518"]
[null,null,null,null,null,null,null,null,56,null,"BGGN9021587",null,null,null,"BGZL3518850"]
[null,null,null,null,null,null,null,null,57,null,"BGVW3385518",null,null,null,"BIAW8801787"]
[null,null,null,null,null,null,null,null,58,null,"BGZL3518850",null,null,null,"BIXP7260437"]
[null,null,null,null,null,null,null,null,59,null,"BIAW8801787",null,null,null,"BJHZ8301553"]
[null,null,null,null,null,null,null,null,60,null,"BJHZ8301553",null,null,null,"BJYM8169989"]
[null,null,null,null,null,null,null,null,61,null,"BLBW2070040",null,null,null,"BLBW2070040"]
[null,null,null,null,null,null,null,null,62,null,"BLDR4857690",null,null,null,"BLJH8537883"]
[null,null,null,null,null,null,null,null,63,null,"BLJA5108045",null,null,null,"BLMX4395590"]
[null,null,null,null,null,null,null,null,64,null,"BLJH8537883",null,null,null,"BLSW3154408"]
[null,null,null,null,null,null,null,null,65,null,"BLMX4395590",null,null,null,"BLTD7553076"]
[null,null,null,null,null,null,null,null,66,null,"BLSW3154408",null,null,null,"BLUI6385415"]
[null,null,null,null,null,null,null,null,67,null,"BLTD7553076",null,null,null,"BNDW6027659"]
[null,null,null,null,null,null,null,null,68,null,"BLUI6385415",null,null,null,"BNGK3456799"]
[null,null,null,null,null,null,null,null,69,null,"BMLN7453284",null,null,null,"BNPX1441833"]
[null,null,null,null,null,null,null,null,70,null,"BNBX4750087",null,null,null,"BOWN1814687"]
[null,null,null,null,null,null,null,null,71,null,"BNDW6027659",null,null,null,"BPDT2222933"]
[null,null,null,null,null,null,null,null,72,null,"BNGY2167197",null,null,null,"BPSV3748662"]
[null,null,null,null,null,null,null,null,73,null,"BNPX1441833",null,null,null,"BRXO8881733"]
[null,null,null,null,null,null,null,null,74,null,"BOFS9068341",null,null,null,"BSAJ7343382"]
[null,null,null,null,null,null,null,null,75,null,"BPBN9096088",null,null,null,"BSOG6986815"]
[null,null,null,null,null,null,null,null,76,null,"BPDT2222933",null,null,null,"BSWJ2047541"]
[null,null,null,null,null,null,null,null,77,null,"BPHC4509081",null,null,null,"BTRV3024597"]
[null,null,null,null,null,null,null,null,78,null,"BPSV3748662",null,null,null,"BUPG7221952"]
[null,null,null,null,null,null,null,null,79,null,"BPZK2251567",null,null,null,"BVBI3404136"]
[null,null,null,null,null,null,null,null,80,null,"BRXO8881733",null,null,null,"BVHM7376942"]
[null,null,null,null,null,null,null,null,81,null,"BSAJ7343382",null,null,null,"BWOG2806472"]
[null,null,null,null,null,null,null,null,82,null,"BSFK9051749",null,null,null,"BXIO7296449"]
[null,null,null,null,null,null,null,null,83,null,"BSIG9660099",null,null,null,"BXNX6340796"]
[null,null,null,null,null,null,null,null,84,null,"BSWJ2047541",null,null,null,"BXQS9637665"]
[null,null,null,null,null,null,null,null,85,null,"BTRV3024597",null,null,null,"BYYH5819569"]
[null,null,null,null,null,null,null,null,86,null,"BUPG7221952",null,null,null,"BZBJ9187287"]
[null,null,null,null,null,null,null,null,87,null,"BVBI3404136",null,null,null,"BZCX5634217"]
[null,null,null,null,null,null,null,null,88,null,"BVTV4937062",null,null,null,"CDSF7394163"]
[null,null,null,null,null,null,null,null,89,null,"BWMW1594164",null,null,null,"CESB6671121"]
[null,null,null,null,null,null,null,null,90,null,"BXIO7296449",null,null,null,"CGHM1565848"]
[null,null,null,null,null,null,null,null,91,null,"BXNX6340796",null,null,null,"CIRZ2640757"]
[null,null,null,null,null,null,null,null,92,null,"BXQS9637665",null,null,null,"CKQS5474430"]
[null,null,null,null,null,null,null,null,93,null,"BYYH5819569",null,null,null,"CKSG4720785"]
[null,null,null,null,null,null,null,null,94,null,"BZBJ9187287",null,null,null,"CMIC1777404"]
[null,null,null,null,null,null,null,null,95,null,"CDJP4840351",null,null,null,"CMRH8391556"]
[null,null,null,null,null,null,null,null,96,null,"CDMN6374218",null,null,null,"COAN4048265"]
[null,null,null,null,null,null,null,null,97,null,"CDSF7394163",null,null,null,"COYK8001924"]
[null,null,null,null,null,null,null,null,98,null,"CEJX3287496",null,null,null,"CPFL8374346"]
[null,null,null,null,null,null,null,null,99,null,"CESB6671121",null,null,null,"CQFL4463987"]
[null,null,null,null,null,null,null,null,100,null,"CGFG9551530",null,null,null,"CQQC6171803"]
[null,null,null,null,null,null,null,null,101,null,"CGFN6932273",null,null,null,"CREC5019274"]
[null,null,null,null,null,null,null,null,102,null,"CGHM1565848",null,null,null,"CRKG4230621"]
[null,null,null,null,null,null,null,null,103,null,"CHDJ3076179",null,null,null,"CSJQ4346477"]
[null,null,null,null,null,null,null,null,104,null,"CIGJ9434761",null,null,null,"CUIW5065150"]
[null,null,null,null,null,null,null,null,105,null,"CIRZ2640757",null,null,null,"CUMJ7563745"]
[null,null,null,null,null,null,null,null,106,null,"CKQS5474430",null,null,null,"CUWR1778465"]
[null,null,null,null,null,null,null,null,107,null,"CKSG4720785",null,null,null,"CWLR1369227"]
[null,null,null,null,null,null,null,null,108,null,"CMIC1777404",null,null,null,"CWOE1460468"]
[null,null,null,null,null,null,null,null,109,null,"COAN4048265",null,null,null,"CWZU9109610"]
[null,null,null,null,null,null,null,null,110,null,"COBS1191491",null,null,null,"CXNP8230243"]
[null,null,null,null,null,null,null,null,111,null,"CPFL8374346",null,null,null,"CZBU3909814"]
[null,null,null,null,null,null,null,null,112,null,"CPLK3029544",null,null,null,"DDKK6623295"]
[null,null,null,null,null,null,null,null,113,null,"CQQC6171803",null,null,null,"DDYZ6991605"]
[null,null,null,null,null,null,null,null,114,null,"CQWW7967365",null,null,null,"DDZR9192474"]
[null,null,null,null,null,null,null,null,115,null,"CREC5019274",null,null,null,"DEOV7725281"]
[null,null,null,null,null,null,null,null,116,null,"CRKG4230621",null,null,null,"DEXI7157404"]
[null,null,null,null,null,null,null,null,117,null,"CTJP5863734",null,null,null,"DFED2542285"]
[null,null,null,null,null,null,null,null,118,null,"CTLD2782420",null,null,null,"DIGO8780969"]
[null,null,null,null,null,null,null,null,119,null,"CUIW5065150",null,null,null,"DJGT7321368"]
[null,null,null,null,null,null,null,null,120,null,"CUWR1778465",null,null,null,"DJQJ6174640"]
[null,null,null,null,null,null,null,null,121,null,"CWFZ7765337",null,null,null,"DKFH6942280"]
[null,null,null,null,null,null,null,null,122,null,"CWLR1369227",null,null,null,"DLED7859342"]
[null,null,null,null,null,null,null,null,123,null,"CWOE1460468",null,null,null,"DLHR4308016"]
[null,null,null,null,null,null,null,null,124,null,"CWPN8382125",null,null,null,"DLPY8058652"]
[null,null,null,null,null,null,null,null,125,null,"CWZU9109610",null,null,null,"DLTK5317954"]
[null,null,null,null,null,null,null,null,126,null,"CXNP8230243",null,null,null,"DMDO5852450"]
[null,null,null,null,null,null,null,null,127,null,"CXSN9575065",null,null,null,"DMPE5918158"]
[null,null,null,null,null,null,null,null,128,null,"CZBU3909814",null,null,null,"DMTX4605486"]
[null,null,null,null,null,null,null,null,129,null,"DAGF5349315",null,null,null,"DNAV8302127"]
[null,null,null,null,null,null,null,null,130,null,"DBLT5093723",null,null,null,"DNBV2987443"]
[null,null,null,null,null,null,null,null,131,null,"DCIR9041866",null,null,null,"DNYJ4603022"]
[null,null,null,null,null,null,null,null,132,null,"DDKK6623295",null,null,null,"DNZO2996349"]
[null,null,null,null,null,null,null,null,133,null,"DDYZ6991605",null,null,null,"DOFE2815995"]
[null,null,null,null,null,null,null,null,134,null,"DDZR9192474",null,null,null,"DOGH6141878"]
[null,null,null,null,null,null,null,null,135,null,"DEAW8975789",null,null,null,"DOXN8844141"]
[null,null,null,null,null,null,null,null,136,null,"DECG7271039",null,null,null,"DPAA3489266"]
[null,null,null,null,null,null,null,null,137,null,"DEGK1650785",null,null,null,"DRDF9694648"]
[null,null,null,null,null,null,null,null,138,null,"DEOV7725281",null,null,null,"DRSJ9347745"]
[null,null,null,null,null,null,null,null,139,null,"DEXI7157404",null,null,null,"DSMO2376696"]
[null,null,null,null,null,null,null,null,140,null,"DFED2542285",null,null,null,"DTAX4728293"]
[null,null,null,null,null,null,null,null,141,null,"DFNM6856759",null,null,null,"DTPN4424998"]
[null,null,null,null,null,null,null,null,142,null,"DIGO8780969",null,null,null,"DTRA3724683"]
[null,null,null,null,null,null,null,null,143,null,"DIWS2299588",null,null,null,"DTXM8113337"]
[null,null,null,null,null,null,null,null,144,null,"DJGT7321368",null,null,null,"DUDT3213342"]
[null,null,null,null,null,null,null,null,145,null,"DJQJ6174640",null,null,null,"DVAJ6674188"]
[null,null,null,null,null,null,null,null,146,null,"DKFH6942280",null,null,null,"DVHS7075373"]
[null,null,null,null,null,null,null,null,147,null,"DLED7859342",null,null,null,"DVYV7231327"]
[null,null,null,null,null,null,null,null,148,null,"DLHR4308016",null,null,null,"DXPG5181294"]
[null,null,null,null,null,null,null,null,149,null,"DLML8685388",null,null,null,"DYJV1505127"]
[null,null,null,null,null,null,null,null,150,null,"DLPY8058652",null,null,null,"DYRX7445580"]
[null,null,null,null,null,null,null,null,151,null,"DLTK5317954",null,null,null,"DYVL6913643"]
[null,null,null,null,null,null,null,null,152,null,"DMDO5852450",null,null,null,"DYWZ8549182"]
[null,null,null,null,null,null,null,null,153,null,"DMPE5918158",null,null,null,"EBJR5517798"]
[null,null,null,null,null,null,null,null,154,null,"DMTX4605486",null,null,null,"ECHO5387999"]
[null,null,null,null,null,null,null,null,155,null,"DNAV8302127",null,null,null,"EDWP6410791"]
[null,null,null,null,null,null,null,null,156,null,"DNZO2996349",null,null,null,"EEAP7086828"]
[null,null,null,null,null,null,null,null,157,null,"DODH6275362",null,null,null,"EEDB7957493"]
[null,null,null,null,null,null,null,null,158,null,"DOFE2815995",null,null,null,"EEKE3520431"]
[null,null,null,null,null,null,null,null,159,null,"DONH4784639",null,null,null,"EEMT8384118"]
[null,null,null,null,null,null,null,null,160,null,"DOZI4379644",null,null,null,"EEWG9311170"]
[null,null,null,null,null,null,null,null,161,null,"DPAA3489266",null,null,null,"EFMU2870906"]
[null,null,null,null,null,null,null,null,162,null,"DPDE4614858",null,null,null,"EFPY2458921"]
[null,null,null,null,null,null,null,null,163,null,"DRDF9694648",null,null,null,"EGLY7124116"]
[null,null,null,null,null,null,null,null,164,null,"DSMO2376696",null,null,null,"EHAG1541056"]
[null,null,null,null,null,null,null,null,165,null,"DTAX4728293",null,null,null,"EHCH5596477"]
[null,null,null,null,null,null,null,null,166,null,"DUDT3213342",null,null,null,"EHKE6652576"]
[null,null,null,null,null,null,null,null,167,null,"DVAJ6674188",null,null,null,"EHKP9542740"]
[null,null,null,null,null,null,null,null,168,null,"DVAV3310522",null,null,null,"EIJX2847262"]
[null,null,null,null,null,null,null,null,169,null,"DVHS7075373",null,null,null,"EINV5394352"]
[null,null,null,null,null,null,null,null,170,null,"DVHU5484518",null,null,null,"EJKN9458257"]
[null,null,null,null,null,null,null,null,171,null,"DVYV7231327",null,null,null,"EJTE6001112"]
[null,null,null,null,null,null,null,null,172,null,"DXPG5181294",null,null,null,"EJTV3249397"]
[null,null,null,null,null,null,null,null,173,null,"DYJV1505127",null,null,null,"EJXN4957497"]
[null,null,null,null,null,null,null,null,174,null,"DYRX7445580",null,null,null,"EJYI6074799"]
[null,null,null,null,null,null,null,null,175,null,"EBJR5517798",null,null,null,"ENYF2893724"]
[null,null,null,null,null,null,null,null,176,null,"ECHO5387999",null,null,null,"EOIZ2962540"]
[null,null,null,null,null,null,null,null,177,null,"ECXG9284040",null,null,null,"EQCD3940679"]
[null,null,null,null,null,null,null,null,178,null,"EDWP6410791",null,null,null,"EQDA7022471"]
[null,null,null,null,null,null,null,null,179,null,"EEAP7086828",null,null,null,"EQUO6917813"]
[null,null,null,null,null,null,null,null,180,null,"EEDB7957493",null,null,null,"ERVG5698902"]
[null,null,null,null,null,null,null,null,181,null,"EEKE3520431",null,null,null,"ESHG9021497"]
[null,null,null,null,null,null,null,null,182,null,"EEMT8384118",null,null,null,"ESKV1768879"]
[null,null,null,null,null,null,null,null,183,null,"EEWG9311170",null,null,null,"ESWT4738142"]
[null,null,null,null,null,null,null,null,184,null,"EFFR1338395",null,null,null,"ETBA2376837"]
[null,null,null,null,null,null,null,null,185,null,"EFMU2870906",null,null,null,"ETQC7403480"]
[null,null,null,null,null,null,null,null,186,null,"EGLY7124116",null,null,null,"EUTY9173441"]
[null,null,null,null,null,null,null,null,187,null,"EHAG1541056",null,null,null,"EVBF1811570"]
[null,null,null,null,null,null,null,null,188,null,"EHKP9542740",null,null,null,"EVDD4458002"]
[null,null,null,null,null,null,null,null,189,null,"EHSE7620488",null,null,null,"EVWR1260134"]
[null,null,null,null,null,null,null,null,190,null,"EIIQ7136151",null,null,null,"EXEF6188886"]
[null,null,null,null,null,null,null,null,191,null,"EIJX2847262",null,null,null,"EXIS3070334"]
[null,null,null,null,null,null,null,null,192,null,"EIKX1240523",null,null,null,"EYZG2274764"]
[null,null,null,null,null,null,null,null,193,null,"EINV5394352",null,null,null,"FAGQ1985599"]
[null,null,null,null,null,null,null,null,194,null,"EJAJ4179787",null,null,null,"FAQD9977240"]
[null,null,null,null,null,null,null,null,195,null,"EJKN9458257",null,null,null,"FBKQ5376452"]
[null,null,null,null,null,null,null,null,196,null,"EJTE6001112",null,null,null,"FCLD2906924"]
[null,null,null,null,null,null,null,null,197,null,"EJTV3249397",null,null,null,"FDCS6477361"]
[null,null,null,null,null,null,null,null,198,null,"EJXN4957497",null,null,null,"FDTG4208990"]
[null,null,null,null,null,null,null,null,199,null,"EJYI6074799",null,null,null,"FFNZ3170308"]
[null,null,null,null,null,null,null,null,200,null,"EKSE4835137",null,null,null,"FFPU5756514"]
[null,null,null,null,null,null,null,null,201,null,"ELAG2359981",null,null,null,"FFUF5718433"]
[null,null,null,null,null,null,null,null,202,null,"ELIT4996051",null,null,null,"FGET5490453"]
[null,null,null,null,null,null,null,null,203,null,"ENQO9645980",null,null,null,"FGFT9958633"]
[null,null,null,null,null,null,null,null,204,null,"ENZF4935660",null,null,null,"FGHK7636916"]
[null,null,null,null,null,null,null,null,205,null,"EQCD3940679",null,null,null,"FGXO4453743"]
[null,null,null,null,null,null,null,null,206,null,"ERIT2900758",null,null,null,"FJMA7132524"]
[null,null,null,null,null,null,null,null,207,null,"ESHG9021497",null,null,null,"FKAN4143314"]
[null,null,null,null,null,null,null,null,208,null,"ESKV1768879",null,null,null,"FKNP3612632"]
[null,null,null,null,null,null,null,null,209,null,"ESWT4738142",null,null,null,"FMJS8512946"]
[null,null,null,null,null,null,null,null,210,null,"ETBA2376837",null,null,null,"FMLV9499925"]
[null,null,null,null,null,null,null,null,211,null,"ETQC7403480",null,null,null,"FNJC4767912"]
[null,null,null,null,null,null,null,null,212,null,"EUTY9173441",null,null,null,"FNNS2867656"]
[null,null,null,null,null,null,null,null,213,null,"EVBF1811570",null,null,null,"FNQA9380564"]
[null,null,null,null,null,null,null,null,214,null,"EVWR1260134",null,null,null,"FNRR9313125"]
[null,null,null,null,null,null,null,null,215,null,"EWSJ6030432",null,null,null,"FNSE1160529"]
[null,null,null,null,null,null,null,null,216,null,"EXIS3070334",null,null,null,"FOOB2212209"]
[null,null,null,null,null,null,null,null,217,null,"EXUE6999556",null,null,null,"FOZF8908223"]
[null,null,null,null,null,null,null,null,218,null,"EYZG2274764",null,null,null,"FPVF2825688"]
[null,null,null,null,null,null,null,null,219,null,"FAGQ1985599",null,null,null,"FQNL5723667"]
[null,null,null,null,null,null,null,null,220,null,"FAOE8924674",null,null,null,"FSBY1117177"]
[null,null,null,null,null,null,null,null,221,null,"FCIR9325257",null,null,null,"FSFC6946329"]
[null,null,null,null,null,null,null,null,222,null,"FCJR1756060",null,null,null,"FSSB8268173"]
[null,null,null,null,null,null,null,null,223,null,"FDCS6477361",null,null,null,"FSSM5717379"]
[null,null,null,null,null,null,null,null,224,null,"FEPS4686797",null,null,null,"FTEH8185182"]
[null,null,null,null,null,null,null,null,225,null,"FFPU5756514",null,null,null,"FUBC7749656"]
[null,null,null,null,null,null,null,null,226,null,"FFUF5718433",null,null,null,"FUNE6845252"]
[null,null,null,null,null,null,null,null,227,null,"FGET5490453",null,null,null,"FVAV3658372"]
[null,null,null,null,null,null,null,null,228,null,"FGFT9958633",null,null,null,"FVSG7519250"]
[null,null,null,null,null,null,null,null,229,null,"FGHK7636916",null,null,null,"FVSR5370466"]
[null,null,null,null,null,null,null,null,230,null,"FGXO4453743",null,null,null,"FWOM6289395"]
[null,null,null,null,null,null,null,null,231,null,"FHOA7079414",null,null,null,"FXNK8178607"]
[null,null,null,null,null,null,null,null,232,null,"FIDC7940842",null,null,null,"FZVD3831698"]
[null,null,null,null,null,null,null,null,233,null,"FIEJ8724855",null,null,null,"FZWX8005573"]
[null,null,null,null,null,null,null,null,234,null,"FISN7839733",null,null,null,"GBBE3755201"]
[null,null,null,null,null,null,null,null,235,null,"FIZJ1970739",null,null,null,"GBIG4900215"]
[null,null,null,null,null,null,null,null,236,null,"FJMA7132524",null,null,null,"GBQZ7507622"]
[null,null,null,null,null,null,null,null,237,null,"FKAN4143314",null,null,null,"GDHM4004007"]
[null,null,null,null,null,null,null,null,238,null,"FKNP3612632",null,null,null,"GDIC7237181"]
[null,null,null,null,null,null,null,null,239,null,"FMJS8512946",null,null,null,"GEAU9133637"]
[null,null,null,null,null,null,null,null,240,null,"FMLV9499925",null,null,null,"GEHI1892278"]
[null,null,null,null,null,null,null,null,241,null,"FNNS2867656",null,null,null,"GEIF7614477"]
[null,null,null,null,null,null,null,null,242,null,"FNSE1160529",null,null,null,"GFUC9205238"]
[null,null,null,null,null,null,null,null,243,null,"FOOB2212209",null,null,null,"GFUF7320325"]
[null,null,null,null,null,null,null,null,244,null,"FOYI2286240",null,null,null,"GHLC5374249"]
[null,null,null,null,null,null,null,null,245,null,"FPIU1222944",null,null,null,"GHOH3907117"]
[null,null,null,null,null,null,null,null,246,null,"FPVF2825688",null,null,null,"GIED7633515"]
[null,null,null,null,null,null,null,null,247,null,"FQNL5723667",null,null,null,"GIHY3834464"]
[null,null,null,null,null,null,null,null,248,null,"FQRS3103090",null,null,null,"GJQW7406659"]
[null,null,null,null,null,null,null,null,249,null,"FSBC8540262",null,null,null,"GKJP7986290"]
[null,null,null,null,null,null,null,null,250,null,"FSBY1117177",null,null,null,"GKSD9245826"]
[null,null,null,null,null,null,null,null,251,null,"FSFC6946329",null,null,null,"GLQP1701655"]
[null,null,null,null,null,null,null,null,252,null,"FSSB8268173",null,null,null,"GLSH5173191"]
[null,null,null,null,null,null,null,null,253,null,"FSSM5717379",null,null,null,"GMDQ2251279"]
[null,null,null,null,null,null,null,null,254,null,"FTHL6837271",null,null,null,"GMLJ9213747"]
[null,null,null,null,null,null,null,null,255,null,"FUBC7749656",null,null,null,"GMOG4904230"]
[null,null,null,null,null,null,null,null,256,null,"FUNE6845252",null,null,null,"GNGO7387044"]
[null,null,null,null,null,null,null,null,257,null,"FUOS5236861",null,null,null,"GNSR6504611"]
[null,null,null,null,null,null,null,null,258,null,"FUVA9185716",null,null,null,"GOAV2177444"]
[null,null,null,null,null,null,null,null,259,null,"FVSG7519250",null,null,null,"GOYS3698566"]
[null,null,null,null,null,null,null,null,260,null,"FVSR5370466",null,null,null,"GPFL8135197"]
[null,null,null,null,null,null,null,null,261,null,"FWEE2407199",null,null,null,"GPKD3881939"]
[null,null,null,null,null,null,null,null,262,null,"FWOM6289395",null,null,null,"GPTY5185351"]
[null,null,null,null,null,null,null,null,263,null,"FXTQ7794719",null,null,null,"GQLZ9035644"]
[null,null,null,null,null,null,null,null,264,null,"FYCC1929765",null,null,null,"GQZA9426661"]
[null,null,null,null,null,null,null,null,265,null,"FZQB5196355",null,null,null,"GRCX3168537"]
[null,null,null,null,null,null,null,null,266,null,"FZVD3831698",null,null,null,"GRIX2028838"]
[null,null,null,null,null,null,null,null,267,null,"FZVL9187409",null,null,null,"GRWQ3817329"]
[null,null,null,null,null,null,null,null,268,null,"FZWX8005573",null,null,null,"GSJP9394412"]
[null,null,null,null,null,null,null,null,269,null,"GBIG4900215",null,null,null,"GSXD3908313"]
[null,null,null,null,null,null,null,null,270,null,"GBKN6393979",null,null,null,"GTBC6807671"]
[null,null,null,null,null,null,null,null,271,null,"GBQZ7507622",null,null,null,"GTVW6032636"]
[null,null,null,null,null,null,null,null,272,null,"GBSF8436652",null,null,null,"GUNP5431661"]
[null,null,null,null,null,null,null,null,273,null,"GCEZ8078721",null,null,null,"GVBX2296408"]
[null,null,null,null,null,null,null,null,274,null,"GDHM4004007",null,null,null,"GVKV6329708"]
[null,null,null,null,null,null,null,null,275,null,"GDIC7237181",null,null,null,"GWLS6824670"]
[null,null,null,null,null,null,null,null,276,null,"GEAU9133637",null,null,null,"GWNL3850638"]
[null,null,null,null,null,null,null,null,277,null,"GEHI1892278",null,null,null,"GWUZ1800314"]
[null,null,null,null,null,null,null,null,278,null,"GEIF7614477",null,null,null,"GXED5880397"]
[null,null,null,null,null,null,null,null,279,null,"GFUC9205238",null,null,null,"GXNN8092136"]
[null,null,null,null,null,null,null,null,280,null,"GFUF7320325",null,null,null,"GYBC2476215"]
[null,null,null,null,null,null,null,null,281,null,"GGZV3460339",null,null,null,"HAMP1173696"]
[null,null,null,null,null,null,null,null,282,null,"GIHY3834464",null,null,null,"HBZK1618501"]
[null,null,null,null,null,null,null,null,283,null,"GJQW7406659",null,null,null,"HDMA5422451"]
[null,null,null,null,null,null,null,null,284,null,"GKOX4621284",null,null,null,"HEYR3575132"]
[null,null,null,null,null,null,null,null,285,null,"GKSD9245826",null,null,null,"HFIM2848507"]
[null,null,null,null,null,null,null,null,286,null,"GKYT4199859",null,null,null,"HFQW6700198"]
[null,null,null,null,null,null,null,null,287,null,"GLQP1701655",null,null,null,"HHFN8750663"]
[null,null,null,null,null,null,null,null,288,null,"GLSH5173191",null,null,null,"HHXZ2975115"]
[null,null,null,null,null,null,null,null,289,null,"GMGD6791790",null,null,null,"HIKJ8216108"]
[null,null,null,null,null,null,null,null,290,null,"GMLJ9213747",null,null,null,"HJNO3156191"]
[null,null,null,null,null,null,null,null,291,null,"GMOG4904230",null,null,null,"HMBY4173261"]
[null,null,null,null,null,null,null,null,292,null,"GNGO7387044",null,null,null,"HNAK9719178"]
[null,null,null,null,null,null,null,null,293,null,"GNSR6504611",null,null,null,"HNDW5943764"]
[null,null,null,null,null,null,null,null,294,null,"GOSU2171388",null,null,null,"HNMR2210505"]
[null,null,null,null,null,null,null,null,295,null,"GOYS3698566",null,null,null,"HOKP2570805"]
[null,null,null,null,null,null,null,null,296,null,"GPTY5185351",null,null,null,"HOSS7896610"]
[null,null,null,null,null,null,null,null,297,null,"GQLZ9035644",null,null,null,"HOZA5623825"]
[null,null,null,null,null,null,null,null,298,null,"GQZA9426661",null,null,null,"HQCQ5575253"]
[null,null,null,null,null,null,null,null,299,null,"GRCX3168537",null,null,null,"HQDT6524409"]
[null,null,null,null,null,null,null,null,300,null,"GRIX2028838",null,null,null,"HQEW8806894"]
[null,null,null,null,null,null,null,null,301,null,"GRWQ3817329",null,null,null,"HQXZ7263259"]
[null,null,null,null,null,null,null,null,302,null,"GSJP9394412",null,null,null,"HRNS1408619"]
[null,null,null,null,null,null,null,null,303,null,"GSXD3908313",null,null,null,"HRTD2109141"]
[null,null,null,null,null,null,null,null,304,null,"GTBC6807671",null,null,null,"HSSS2589086"]
[null,null,null,null,null,null,null,null,305,null,"GTVW6032636",null,null,null,"HSVV1554240"]
[null,null,null,null,null,null,null,null,306,null,"GUNP5431661",null,null,null,"HTEY3534464"]
[null,null,null,null,null,null,null,null,307,null,"GUSA3976127",null,null,null,"HUWZ3478476"]
[null,null,null,null,null,null,null,null,308,null,"GVBX2296408",null,null,null,"HVPY2045804"]
[null,null,null,null,null,null,null,null,309,null,"GVKV6329708",null,null,null,"HWXI8031127"]
[null,null,null,null,null,null,null,null,310,null,"GWLS6824670",null,null,null,"HXHU7667183"]
[null,null,null,null,null,null,null,null,311,null,"GWUZ1800314",null,null,null,"HXRZ1737051"]
[null,null,null,null,null,null,null,null,312,null,"GXNN8092136",null,null,null,"HYKF5934042"]
[null,null,null,null,null,null,null,null,313,null,"GYGJ1517945",null,null,null,"HYPK3671322"]
[null,null,null,null,null,null,null,null,314,null,"GYKF2875459",null,null,null,"HYTX4247880"]
[null,null,null,null,null,null,null,null,315,null,"HAMP1173696",null,null,null,"HYUG7520417"]
[null,null,null,null,null,null,null,null,316,null,"HATX4348353",null,null,null,"HZLY2419222"]
[null,null,null,null,null,null,null,null,317,null,"HBDP9003039",null,null,null,"HZWR7476454"]
[null,null,null,null,null,null,null,null,318,null,"HDMA5422451",null,null,null,"IAAO3352531"]
[null,null,null,null,null,null,null,null,319,null,"HEGY4478753",null,null,null,"IDMQ2987654"]
[null,null,null,null,null,null,null,null,320,null,"HETF4806651",null,null,null,"IDYO9286362"]
[null,null,null,null,null,null,null,null,321,null,"HEVX2517816",null,null,null,"IFCH3738205"]
[null,null,null,null,null,null,null,null,322,null,"HEYR3575132",null,null,null,"IFJZ1416009"]
[null,null,null,null,null,null,null,null,323,null,"HGMT8963475",null,null,null,"IGXD1247972"]
[null,null,null,null,null,null,null,null,324,null,"HHBU7923037",null,null,null,"IHOE9306954"]
[null,null,null,null,null,null,null,null,325,null,"HHFZ2417166",null,null,null,"IIAE9934193"]
[null,null,null,null,null,null,null,null,326,null,"HHNI7263479",null,null,null,"IIII1928004"]
[null,null,null,null,null,null,null,null,327,null,"HIAV8428373",null,null,null,"IJDN3513533"]
[null,null,null,null,null,null,null,null,328,null,"HIKJ8216108",null,null,null,"IJHV5504316"]
[null,null,null,null,null,null,null,null,329,null,"HJJR3734234",null,null,null,"ILGI1497651"]
[null,null,null,null,null,null,null,null,330,null,"HJWS6565395",null,null,null,"INKO7221748"]
[null,null,null,null,null,null,null,null,331,null,"HLJS5111093",null,null,null,"INPD8071011"]
[null,null,null,null,null,null,null,null,332,null,"HMBY4173261",null,null,null,"IOTM1843033"]
[null,null,null,null,null,null,null,null,333,null,"HNAK9719178",null,null,null,"IPAI4222161"]
[null,null,null,null,null,null,null,null,334,null,"HNDW5943764",null,null,null,"IPCV1126403"]
[null,null,null,null,null,null,null,null,335,null,"HNMR2210505",null,null,null,"IPKG1207617"]
[null,null,null,null,null,null,null,null,336,null,"HPVX4464669",null,null,null,"IQFA3266278"]
[null,null,null,null,null,null,null,null,337,null,"HQDT6524409",null,null,null,"IRXH6961215"]
[null,null,null,null,null,null,null,null,338,null,"HQEW8806894",null,null,null,"ISKX1149420"]
[null,null,null,null,null,null,null,null,339,null,"HRNS1408619",null,null,null,"ISON8918792"]
[null,null,null,null,null,null,null,null,340,null,"HRTD2109141",null,null,null,"ISSU2751706"]
[null,null,null,null,null,null,null,null,341,null,"HSDT3464358",null,null,null,"ITAK7324116"]
[null,null,null,null,null,null,null,null,342,null,"HSSS2589086",null,null,null,"ITIY2942489"]
[null,null,null,null,null,null,null,null,343,null,"HTEY3534464",null,null,null,"ITWI4632330"]
[null,null,null,null,null,null,null,null,344,null,"HUVZ9462960",null,null,null,"ITYO7174149"]
[null,null,null,null,null,null,null,null,345,null,"HVPY2045804",null,null,null,"IVNT3863301"]
[null,null,null,null,null,null,null,null,346,null,"HVPZ8162931",null,null,null,"IXBP1453179"]
[null,null,null,null,null,null,null,null,347,null,"HWXI8031127",null,null,null,"IXCN6052561"]
[null,null,null,null,null,null,null,null,348,null,"HXHU7667183",null,null,null,"IXJW1593459"]
[null,null,null,null,null,null,null,null,349,null,"HYKF5934042",null,null,null,"IXNA5810433"]
[null,null,null,null,null,null,null,null,350,null,"HYPK3671322",null,null,null,"IYEM2531430"]
[null,null,null,null,null,null,null,null,351,null,"HYTX4247880",null,null,null,"IYPR3550487"]
[null,null,null,null,null,null,null,null,352,null,"HYUG7520417",null,null,null,"IYRR9392177"]
[null,null,null,null,null,null,null,null,353,null,"HZLY2419222",null,null,null,"IZDH2506029"]
[null,null,null,null,null,null,null,null,354,null,"HZWR7476454",null,null,null,"IZVX7686734"]
[null,null,null,null,null,null,null,null,355,null,"HZYG8196636",null,null,null,"JANF4997194"]
[null,null,null,null,null,null,null,null,356,null,"IAAO3352531",null,null,null,"JAQY7564600"]
[null,null,null,null,null,null,null,null,357,null,"IASG1335350",null,null,null,"JBSF4412299"]
[null,null,null,null,null,null,null,null,358,null,"IBJW3230690",null,null,null,"JCIT7167620"]
[null,null,null,null,null,null,null,null,359,null,"IDMQ2987654",null,null,null,"JCJK7624620"]
[null,null,null,null,null,null,null,null,360,null,"IDYO9286362",null,null,null,"JCKF1911137"]
[null,null,null,null,null,null,null,null,361,null,"IFJZ1416009",null,null,null,"JEAM1885694"]
[null,null,null,null,null,null,null,null,362,null,"IHBL6158758",null,null,null,"JFHN2640954"]
[null,null,null,null,null,null,null,null,363,null,"IHWE5760491",null,null,null,"JFRG9811135"]
[null,null,null,null,null,null,null,null,364,null,"IKJV1138396",null,null,null,"JGOM3057877"]
[null,null,null,null,null,null,null,null,365,null,"IKWG7743283",null,null,null,"JHWR7759083"]
[null,null,null,null,null,null,null,null,366,null,"ILGI1497651",null,null,null,"JICT4378708"]
[null,null,null,null,null,null,null,null,367,null,"ILYR7420095",null,null,null,"JIJN3025517"]
[null,null,null,null,null,null,null,null,368,null,"IMKV2335447",null,null,null,"JIKO8201245"]
[null,null,null,null,null,null,null,null,369,null,"INPD8071011",null,null,null,"JITD5541992"]
[null,null,null,null,null,null,null,null,370,null,"IORC9461140",null,null,null,"JJIC1435920"]
[null,null,null,null,null,null,null,null,371,null,"IOXE9039415",null,null,null,"JJXB9984547"]
[null,null,null,null,null,null,null,null,372,null,"IPAI4222161",null,null,null,"JKSY1460155"]
[null,null,null,null,null,null,null,null,373,null,"IPOS2184069",null,null,null,"JMVZ3374893"]
[null,null,null,null,null,null,null,null,374,null,"IRCC9094997",null,null,null,"JNLO8105381"]
[null,null,null,null,null,null,null,null,375,null,"IRLA7781611",null,null,null,"JOJW9086304"]
[null,null,null,null,null,null,null,null,376,null,"IRXH6961215",null,null,null,"JPMP5307230"]
[null,null,null,null,null,null,null,null,377,null,"ISKX1149420",null,null,null,"JPMV6432274"]
[null,null,null,null,null,null,null,null,378,null,"ISON8918792",null,null,null,"JQBK8870465"]
[null,null,null,null,null,null,null,null,379,null,"ITAK7324116",null,null,null,"JQHL2017809"]
[null,null,null,null,null,null,null,null,380,null,"ITIY2942489",null,null,null,"JRRQ3618091"]
[null,null,null,null,null,null,null,null,381,null,"ITWI4632330",null,null,null,"JSSP9217200"]
[null,null,null,null,null,null,null,null,382,null,"ITZI5422449",null,null,null,"JTSK2992581"]
[null,null,null,null,null,null,null,null,383,null,"IVNT3863301",null,null,null,"JUTV8123821"]
[null,null,null,null,null,null,null,null,384,null,"IWRT6866322",null,null,null,"JWBO5496466"]
[null,null,null,null,null,null,null,null,385,null,"IXCN6052561",null,null,null,"JWGR8515254"]
[null,null,null,null,null,null,null,null,386,null,"IXJW1593459",null,null,null,"JXCW4242928"]
[null,null,null,null,null,null,null,null,387,null,"IXNA5810433",null,null,null,"JXEP4571522"]
[null,null,null,null,null,null,null,null,388,null,"IYEM2531430",null,null,null,"JXUC4396800"]
[null,null,null,null,null,null,null,null,389,null,"IYJH5899459",null,null,null,"JYIO2597597"]
[null,null,null,null,null,null,null,null,390,null,"IYPR3550487",null,null,null,"JYXH8558850"]
[null,null,null,null,null,null,null,null,391,null,"IZVX7686734",null,null,null,"JZNF5022653"]
[null,null,null,null,null,null,null,null,392,null,"JANF4997194",null,null,null,"KAHY6883990"]
[null,null,null,null,null,null,null,null,393,null,"JAQF4008270",null,null,null,"KCBW6884989"]
[null,null,null,null,null,null,null,null,394,null,"JAQY7564600",null,null,null,"KCPP7669414"]
[null,null,null,null,null,null,null,null,395,null,"JCCV2793874",null,null,null,"KDEZ3649287"]
[null,null,null,null,null,null,null,null,396,null,"JCKF1911137",null,null,null,"KDKX6532573"]
[null,null,null,null,null,null,null,null,397,null,"JEAM1885694",null,null,null,"KDOL4424028"]
[null,null,null,null,null,null,null,null,398,null,"JFHN2640954",null,null,null,"KDTM6529824"]
[null,null,null,null,null,null,null,null,399,null,"JFQM7157647",null,null,null,"KETY7649100"]
[null,null,null,null,null,null,null,null,400,null,"JGOM3057877",null,null,null,"KGCC5889876"]
[null,null,null,null,null,null,null,null,401,null,"JHWR7759083",null,null,null,"KHIA3209258"]
[null,null,null,null,null,null,null,null,402,null,"JICT4378708",null,null,null,"KIAV5238161"]
[null,null,null,null,null,null,null,null,403,null,"JIJN3025517",null,null,null,"KIDI7310139"]
[null,null,null,null,null,null,null,null,404,null,"JJXB9984547",null,null,null,"KIWE6090933"]
[null,null,null,null,null,null,null,null,405,null,"JKSY1460155",null,null,null,"KJTA5153793"]
[null,null,null,null,null,null,null,null,406,null,"JKWP9757615",null,null,null,"KJUB5709146"]
[null,null,null,null,null,null,null,null,407,null,"JLZH6400170",null,null,null,"KJWB2704964"]
[null,null,null,null,null,null,null,null,408,null,"JMVZ3374893",null,null,null,"KKCY2382154"]
[null,null,null,null,null,null,null,null,409,null,"JNND5688753",null,null,null,"KKQC3735344"]
[null,null,null,null,null,null,null,null,410,null,"JNPM9826793",null,null,null,"KKYW2492169"]
[null,null,null,null,null,null,null,null,411,null,"JOJW9086304",null,null,null,"KLKG5430504"]
[null,null,null,null,null,null,null,null,412,null,"JPMP5307230",null,null,null,"KLMQ3743766"]
[null,null,null,null,null,null,null,null,413,null,"JPMV6432274",null,null,null,"KMYP6672078"]
[null,null,null,null,null,null,null,null,414,null,"JPQF7499919",null,null,null,"KNCB1612716"]
[null,null,null,null,null,null,null,null,415,null,"JRRQ3618091",null,null,null,"KNNR8370914"]
[null,null,null,null,null,null,null,null,416,null,"JSSP9217200",null,null,null,"KNQN6088095"]
[null,null,null,null,null,null,null,null,417,null,"JTSK2992581",null,null,null,"KOBY3236522"]
[null,null,null,null,null,null,null,null,418,null,"JTTA4284906",null,null,null,"KQKZ2923929"]
[null,null,null,null,null,null,null,null,419,null,"JUCD2995129",null,null,null,"KQQZ4812022"]
[null,null,null,null,null,null,null,null,420,null,"JWGR8515254",null,null,null,"KRFE6470216"]
[null,null,null,null,null,null,null,null,421,null,"JWTE3691712",null,null,null,"KRFS6530385"]
[null,null,null,null,null,null,null,null,422,null,"JXAW9597295",null,null,null,"KSAL3009721"]
[null,null,null,null,null,null,null,null,423,null,"JXCW4242928",null,null,null,"KSOC9432170"]
[null,null,null,null,null,null,null,null,424,null,"JXEP4571522",null,null,null,"KTSK8618551"]
[null,null,null,null,null,null,null,null,425,null,"JXUC4396800",null,null,null,"KUPN1279647"]
[null,null,null,null,null,null,null,null,426,null,"JYIO2597597",null,null,null,"KUZO1605469"]
[null,null,null,null,null,null,null,null,427,null,"JZNF5022653",null,null,null,"KVPQ4279079"]
[null,null,null,null,null,null,null,null,428,null,"KAHY6883990",null,null,null,"KWZT8615765"]
[null,null,null,null,null,null,null,null,429,null,"KANT1574644",null,null,null,"KYJS1707718"]
[null,null,null,null,null,null,null,null,430,null,"KAZP6182816",null,null,null,"KZAS2951520"]
[null,null,null,null,null,null,null,null,431,null,"KCBW6884989",null,null,null,"KZUX9311677"]
[null,null,null,null,null,null,null,null,432,null,"KCPP7669414",null,null,null,"LAGV5427450"]
[null,null,null,null,null,null,null,null,433,null,"KDEZ3649287",null,null,null,"LALA5829134"]
[null,null,null,null,null,null,null,null,434,null,"KDOL4424028",null,null,null,"LAVJ8951374"]
[null,null,null,null,null,null,null,null,435,null,"KDTM6529824",null,null,null,"LBYG7406158"]
[null,null,null,null,null,null,null,null,436,null,"KDTN3765502",null,null,null,"LCAK6289055"]
[null,null,null,null,null,null,null,null,437,null,"KETY7649100",null,null,null,"LDFQ5748308"]
[null,null,null,null,null,null,null,null,438,null,"KFAU2982919",null,null,null,"LDIM9717599"]
[null,null,null,null,null,null,null,null,439,null,"KGCC5889876",null,null,null,"LEFX4933473"]
[null,null,null,null,null,null,null,null,440,null,"KGGV2763017",null,null,null,"LESH3678670"]
[null,null,null,null,null,null,null,null,441,null,"KGWG8852975",null,null,null,"LGDB9276262"]
[null,null,null,null,null,null,null,null,442,null,"KHIA3209258",null,null,null,"LGJW4228183"]
[null,null,null,null,null,null,null,null,443,null,"KIAV5238161",null,null,null,"LJIT7694374"]
[null,null,null,null,null,null,null,null,444,null,"KIDI7310139",null,null,null,"LMGA8125241"]
[null,null,null,null,null,null,null,null,445,null,"KIWE6090933",null,null,null,"LMMY1583122"]
[null,null,null,null,null,null,null,null,446,null,"KJTA5153793",null,null,null,"LNCD8507571"]
[null,null,null,null,null,null,null,null,447,null,"KJUB5709146",null,null,null,"LNHF3095510"]
[null,null,null,null,null,null,null,null,448,null,"KJWB2704964",null,null,null,"LOCU7638978"]
[null,null,null,null,null,null,null,null,449,null,"KKCY2382154",null,null,null,"LPGA7847711"]
[null,null,null,null,null,null,null,null,450,null,"KLCW3275866",null,null,null,"LQBD2706029"]
[null,null,null,null,null,null,null,null,451,null,"KLMQ3743766",null,null,null,"LQSC9443976"]
[null,null,null,null,null,null,null,null,452,null,"KNCB1612716",null,null,null,"LQYG6327947"]
[null,null,null,null,null,null,null,null,453,null,"KNNR8370914",null,null,null,"LSIJ7958090"]
[null,null,null,null,null,null,null,null,454,null,"KNQN6088095",null,null,null,"LSMV7762318"]
[null,null,null,null,null,null,null,null,455,null,"KOBY3236522",null,null,null,"LTXU6407447"]
[null,null,null,null,null,null,null,null,456,null,"KPER2448290",null,null,null,"LUCZ8605731"]
[null,null,null,null,null,null,null,null,457,null,"KQKZ2923929",null,null,null,"LUET5764228"]
[null,null,null,null,null,null,null,null,458,null,"KRFE6470216",null,null,null,"LUNT7096372"]
[null,null,null,null,null,null,null,null,459,null,"KSOC9432170",null,null,null,"LVYC4288349"]
[null,null,null,null,null,null,null,null,460,null,"KTLY2195944",null,null,null,"LWZW9654358"]
[null,null,null,null,null,null,null,null,461,null,"KTSK8618551",null,null,null,"LXHW9482976"]
[null,null,null,null,null,null,null,null,462,null,"KTSN3238511",null,null,null,"LZCI9540234"]
[null,null,null,null,null,null,null,null,463,null,"KUPN1279647",null,null,null,"LZOM1501396"]
[null,null,null,null,null,null,null,null,464,null,"KUZO1605469",null,null,null,"MASK3875109"]
[null,null,null,null,null,null,null,null,465,null,"KWZT8615765",null,null,null,"MBZF5667216"]
[null,null,null,null,null,null,null,null,466,null,"KYJS1707718",null,null,null,"MCGK6969333"]
[null,null,null,null,null,null,null,null,467,null,"KZAS2951520",null,null,null,"MDZS7983198"]
[null,null,null,null,null,null,null,null,468,null,"KZUN9798134",null,null,null,"MEDQ9792734"]
[null,null,null,null,null,null,null,null,469,null,"LALA5829134",null,null,null,"MFJS3276725"]
[null,null,null,null,null,null,null,null,470,null,"LAVJ8951374",null,null,null,"MFNB8840779"]
[null,null,null,null,null,null,null,null,471,null,"LAZG7121903",null,null,null,"MFRY2866922"]
[null,null,null,null,null,null,null,null,472,null,"LBYG7406158",null,null,null,"MFZD9388501"]
[null,null,null,null,null,null,null,null,473,null,"LCAK6289055",null,null,null,"MHEP1402044"]
[null,null,null,null,null,null,null,null,474,null,"LDFQ5748308",null,null,null,"MHIB2354991"]
[null,null,null,null,null,null,null,null,475,null,"LEFX4933473",null,null,null,"MHWU9160421"]
[null,null,null,null,null,null,null,null,476,null,"LEGL2099444",null,null,null,"MIFK2355845"]
[null,null,null,null,null,null,null,null,477,null,"LEGS5798900",null,null,null,"MIYJ7196709"]
[null,null,null,null,null,null,null,null,478,null,"LESH3678670",null,null,null,"MIYT6491640"]
[null,null,null,null,null,null,null,null,479,null,"LEWV8559850",null,null,null,"MJGW7493767"]
[null,null,null,null,null,null,null,null,480,null,"LGJW4228183",null,null,null,"MKXN5602389"]
[null,null,null,null,null,null,null,null,481,null,"LIGO1261065",null,null,null,"MLMX7790978"]
[null,null,null,null,null,null,null,null,482,null,"LJIT7694374",null,null,null,"MMUH9216047"]
[null,null,null,null,null,null,null,null,483,null,"LMMY1583122",null,null,null,"MMUK7017247"]
[null,null,null,null,null,null,null,null,484,null,"LNCD8507571",null,null,null,"MPDB6011255"]
[null,null,null,null,null,null,null,null,485,null,"LNHF3095510",null,null,null,"MPRP2068964"]
[null,null,null,null,null,null,null,null,486,null,"LNSJ7410257",null,null,null,"MQPP7224179"]
[null,null,null,null,null,null,null,null,487,null,"LOCU7638978",null,null,null,"MRSC3485044"]
[null,null,null,null,null,null,null,null,488,null,"LPLW4569033",null,null,null,"MSLA6487022"]
[null,null,null,null,null,null,null,null,489,null,"LPUG6656005",null,null,null,"MSUL9242654"]
[null,null,null,null,null,null,null,null,490,null,"LQEZ5265217",null,null,null,"MTHZ4979779"]
[null,null,null,null,null,null,null,null,491,null,"LQSC9443976",null,null,null,"MTYK8445252"]
[null,null,null,null,null,null,null,null,492,null,"LQYG6327947",null,null,null,"MUIU1227296"]
[null,null,null,null,null,null,null,null,493,null,"LSMV7762318",null,null,null,"MUMD7360469"]
[null,null,null,null,null,null,null,null,494,null,"LTXU6407447",null,null,null,"MVSZ5751271"]
[null,null,null,null,null,null,null,null,495,null,"LUCZ8605731",null,null,null,"MVVL7448051"]
[null,null,null,null,null,null,null,null,496,null,"LUET5764228",null,null,null,"MWJN6579142"]
[null,null,null,null,null,null,null,null,497,null,"LUNT7096372",null,null,null,"MWNI5809604"]
[null,null,null,null,null,null,null,null,498,null,"LVYC4288349",null,null,null,"MXJU2245513"]
[null,null,null,null,null,null,null,null,499,null,"LWZW9654358",null,null,null,"MXUJ8057066"]
[null,null,null,null,null,null,null,null,500,null,"LXHW9482976",null,null,null,"MYBW7960800"]
[null,null,null,null,null,null,null,null,501,null,"LYNC2611677",null,null,null,"MYXS4431378"]
[null,null,null,null,null,null,null,null,502,null,"LZOM1501396",null,null,null,"MYZC2847930"]
[null,null,null,null,null,null,null,null,503,null,"MAPP7902791",null,null,null,"NADY4993189"]
[null,null,null,null,null,null,null,null,504,null,"MBZF5667216",null,null,null,"NANI2032089"]
[null,null,null,null,null,null,null,null,505,null,"MCGK6969333",null,null,null,"NAVO5358819"]
[null,null,null,null,null,null,null,null,506,null,"MDZS7983198",null,null,null,"NBTE4186482"]
[null,null,null,null,null,null,null,null,507,null,"MERY5174275",null,null,null,"NBVN4185093"]
[null,null,null,null,null,null,null,null,508,null,"MFJS3276725",null,null,null,"NCQO4738327"]
[null,null,null,null,null,null,null,null,509,null,"MFZD9388501",null,null,null,"NECV2520316"]
[null,null,null,null,null,null,null,null,510,null,"MGLK8733251",null,null,null,"NEQT5282487"]
[null,null,null,null,null,null,null,null,511,null,"MGVI5428823",null,null,null,"NFTI4279776"]
[null,null,null,null,null,null,null,null,512,null,"MIFK2355845",null,null,null,"NGFP3182615"]
[null,null,null,null,null,null,null,null,513,null,"MIYT6491640",null,null,null,"NGQN1944548"]
[null,null,null,null,null,null,null,null,514,null,"MJGW7493767",null,null,null,"NGVI2985352"]
[null,null,null,null,null,null,null,null,515,null,"MKQI1849848",null,null,null,"NHEL2719096"]
[null,null,null,null,null,null,null,null,516,null,"MLBI4333580",null,null,null,"NHHW6920837"]
[null,null,null,null,null,null,null,null,517,null,"MLHA6504341",null,null,null,"NJHG2100974"]
[null,null,null,null,null,null,null,null,518,null,"MLMX7790978",null,null,null,"NJMA7864186"]
[null,null,null,null,null,null,null,null,519,null,"MMUH9216047",null,null,null,"NJMG6335221"]
[null,null,null,null,null,null,null,null,520,null,"MMUK7017247",null,null,null,"NKBU4682007"]
[null,null,null,null,null,null,null,null,521,null,"MPDB6011255",null,null,null,"NKEJ6877850"]
[null,null,null,null,null,null,null,null,522,null,"MPOG5241268",null,null,null,"NKPS3964381"]
[null,null,null,null,null,null,null,null,523,null,"MPPC5847084",null,null,null,"NLAY7792963"]
[null,null,null,null,null,null,null,null,524,null,"MPRP2068964",null,null,null,"NLLL4555292"]
[null,null,null,null,null,null,null,null,525,null,"MQPP7224179",null,null,null,"NLNP5995440"]
[null,null,null,null,null,null,null,null,526,null,"MSUL9242654",null,null,null,"NLQW2712576"]
[null,null,null,null,null,null,null,null,527,null,"MTHZ4979779",null,null,null,"NLYQ9628990"]
[null,null,null,null,null,null,null,null,528,null,"MUMD7360469",null,null,null,"NNUD7976773"]
[null,null,null,null,null,null,null,null,529,null,"MVLR4914850",null,null,null,"NNUT7901280"]
[null,null,null,null,null,null,null,null,530,null,"MVSZ5751271",null,null,null,"NOIR5699205"]
[null,null,null,null,null,null,null,null,531,null,"MVVL7448051",null,null,null,"NOXZ6827787"]
[null,null,null,null,null,null,null,null,532,null,"MWJN6579142",null,null,null,"NPBK2813725"]
[null,null,null,null,null,null,null,null,533,null,"MWNI5809604",null,null,null,"NPDP5676297"]
[null,null,null,null,null,null,null,null,534,null,"MYXS4431378",null,null,null,"NPOI8157143"]
[null,null,null,null,null,null,null,null,535,null,"MYZC2847930",null,null,null,"NPZQ1910516"]
[null,null,null,null,null,null,null,null,536,null,"NADY4993189",null,null,null,"NQDG2719250"]
[null,null,null,null,null,null,null,null,537,null,"NANI2032089",null,null,null,"NQMA5986529"]
[null,null,null,null,null,null,null,null,538,null,"NAVO5358819",null,null,null,"NQTO3269885"]
[null,null,null,null,null,null,null,null,539,null,"NBTE4186482",null,null,null,"NSMO9066411"]
[null,null,null,null,null,null,null,null,540,null,"NCQO4738327",null,null,null,"NSYI8881321"]
[null,null,null,null,null,null,null,null,541,null,"NDRP7130313",null,null,null,"NURK7459322"]
[null,null,null,null,null,null,null,null,542,null,"NEQT5282487",null,null,null,"NVFK5402860"]
[null,null,null,null,null,null,null,null,543,null,"NFTI4279776",null,null,null,"NVQE3118949"]
[null,null,null,null,null,null,null,null,544,null,"NGFP3182615",null,null,null,"NWER9026157"]
[null,null,null,null,null,null,null,null,545,null,"NGQN1944548",null,null,null,"NWOL6664433"]
[null,null,null,null,null,null,null,null,546,null,"NGVI2985352",null,null,null,"NXFW4719242"]
[null,null,null,null,null,null,null,null,547,null,"NHEJ7953465",null,null,null,"NZDN5261487"]
[null,null,null,null,null,null,null,null,548,null,"NHEL2719096",null,null,null,"NZXM6522999"]
[null,null,null,null,null,null,null,null,549,null,"NHHW6920837",null,null,null,"OAAN5442854"]
[null,null,null,null,null,null,null,null,550,null,"NHKQ3810469",null,null,null,"OABS7727977"]
[null,null,null,null,null,null,null,null,551,null,"NIGI5108572",null,null,null,"OAJA3522304"]
[null,null,null,null,null,null,null,null,552,null,"NJMA7864186",null,null,null,"OASZ9962637"]
[null,null,null,null,null,null,null,null,553,null,"NJMG6335221",null,null,null,"OBZK7376698"]
[null,null,null,null,null,null,null,null,554,null,"NJQH7005288",null,null,null,"OCGI1343428"]
[null,null,null,null,null,null,null,null,555,null,"NKEJ6877850",null,null,null,"OCRW9656702"]
[null,null,null,null,null,null,null,null,556,null,"NKPS3964381",null,null,null,"OEDH4953233"]
[null,null,null,null,null,null,null,null,557,null,"NLAY7792963",null,null,null,"OEDJ4520322"]
[null,null,null,null,null,null,null,null,558,null,"NLNP5995440",null,null,null,"OFKL7282275"]
[null,null,null,null,null,null,null,null,559,null,"NLQW2712576",null,null,null,"OGOD9714791"]
[null,null,null,null,null,null,null,null,560,null,"NNUT7901280",null,null,null,"OGQI2925065"]
[null,null,null,null,null,null,null,null,561,null,"NOIR5699205",null,null,null,"OHNW1204626"]
[null,null,null,null,null,null,null,null,562,null,"NOXZ6827787",null,null,null,"OIQF2436394"]
[null,null,null,null,null,null,null,null,563,null,"NPBK2813725",null,null,null,"OJBR4855722"]
[null,null,null,null,null,null,null,null,564,null,"NPDP5676297",null,null,null,"OJDJ9177878"]
[null,null,null,null,null,null,null,null,565,null,"NPZQ1910516",null,null,null,"OKDX3522263"]
[null,null,null,null,null,null,null,null,566,null,"NQDG2719250",null,null,null,"OKQC6379237"]
[null,null,null,null,null,null,null,null,567,null,"NQUI9591777",null,null,null,"OLGC3643415"]
[null,null,null,null,null,null,null,null,568,null,"NRAM3739734",null,null,null,"OLJT8683513"]
[null,null,null,null,null,null,null,null,569,null,"NSMO9066411",null,null,null,"OMDA6982752"]
[null,null,null,null,null,null,null,null,570,null,"NSYI8881321",null,null,null,"OMUK6336088"]
[null,null,null,null,null,null,null,null,571,null,"NTNW5749931",null,null,null,"OMVI5978621"]
[null,null,null,null,null,null,null,null,572,null,"NURK7459322",null,null,null,"ONGP3607911"]
[null,null,null,null,null,null,null,null,573,null,"NVFB5329898",null,null,null,"ONYL1615181"]
[null,null,null,null,null,null,null,null,574,null,"NWCM8034033",null,null,null,"OOCW7807449"]
[null,null,null,null,null,null,null,null,575,null,"NWER9026157",null,null,null,"OOLY8522921"]
[null,null,null,null,null,null,null,null,576,null,"NWIX3129678",null,null,null,"OQOI4393978"]
[null,null,null,null,null,null,null,null,577,null,"NWOL6664433",null,null,null,"OQTZ9293349"]
[null,null,null,null,null,null,null,null,578,null,"NXFW4719242",null,null,null,"ORHP9658012"]
[null,null,null,null,null,null,null,null,579,null,"NYAT5739728",null,null,null,"OSUX3806490"]
[null,null,null,null,null,null,null,null,580,null,"NYXK5748632",null,null,null,"OSWY1362661"]
[null,null,null,null,null,null,null,null,581,null,"NZDN5261487",null,null,null,"OTVR2984603"]
[null,null,null,null,null,null,null,null,582,null,"NZIO2927365",null,null,null,"OUIR6689891"]
[null,null,null,null,null,null,null,null,583,null,"NZXM6522999",null,null,null,"OUMM3867010"]
[null,null,null,null,null,null,null,null,584,null,"OAAN5442854",null,null,null,"OVAX7341528"]
[null,null,null,null,null,null,null,null,585,null,"OABS7727977",null,null,null,"OVIP4862005"]
[null,null,null,null,null,null,null,null,586,null,"OAJA3522304",null,null,null,"OWJN5675879"]
[null,null,null,null,null,null,null,null,587,null,"OASZ9962637",null,null,null,"OWMV8188464"]
[null,null,null,null,null,null,null,null,588,null,"OBDB5378693",null,null,null,"OXUB2603017"]
[null,null,null,null,null,null,null,null,589,null,"OCRW9656702",null,null,null,"OYJE4085829"]
[null,null,null,null,null,null,null,null,590,null,"OEDH4953233",null,null,null,"OZKU9517131"]
[null,null,null,null,null,null,null,null,591,null,"OEDJ4520322",null,null,null,"PAPB8303341"]
[null,null,null,null,null,null,null,null,592,null,"OFKL7282275",null,null,null,"PCFC9254910"]
[null,null,null,null,null,null,null,null,593,null,"OFPC6688242",null,null,null,"PDOH6200882"]
[null,null,null,null,null,null,null,null,594,null,"OGNX6497406",null,null,null,"PEID2998579"]
[null,null,null,null,null,null,null,null,595,null,"OGOD9714791",null,null,null,"PFHA9055819"]
[null,null,null,null,null,null,null,null,596,null,"OGQI2925065",null,null,null,"PFKZ9851229"]
[null,null,null,null,null,null,null,null,597,null,"OGWS1290321",null,null,null,"PFLS7609236"]
[null,null,null,null,null,null,null,null,598,null,"OHHR8632465",null,null,null,"PFNA4758702"]
[null,null,null,null,null,null,null,null,599,null,"OIPZ8585607",null,null,null,"PGDK8765592"]
[null,null,null,null,null,null,null,null,600,null,"OJDJ9177878",null,null,null,"PHBK5471624"]
[null,null,null,null,null,null,null,null,601,null,"OKQC6379237",null,null,null,"PHOI7871806"]
[null,null,null,null,null,null,null,null,602,null,"OLGC3643415",null,null,null,"PIIQ8582309"]
[null,null,null,null,null,null,null,null,603,null,"OLJT8683513",null,null,null,"PIUL8387216"]
[null,null,null,null,null,null,null,null,604,null,"OLTX9898600",null,null,null,"PJBD9489906"]
[null,null,null,null,null,null,null,null,605,null,"OMDA6982752",null,null,null,"PJKO7645830"]
[null,null,null,null,null,null,null,null,606,null,"OMUK6336088",null,null,null,"PJWM3749174"]
[null,null,null,null,null,null,null,null,607,null,"OMVI5978621",null,null,null,"PKUB8763181"]
[null,null,null,null,null,null,null,null,608,null,"ONGP3607911",null,null,null,"PLNJ9728418"]
[null,null,null,null,null,null,null,null,609,null,"OODN5543254",null,null,null,"PLOL2755867"]
[null,null,null,null,null,null,null,null,610,null,"OOLY8522921",null,null,null,"PMHY7269323"]
[null,null,null,null,null,null,null,null,611,null,"OOYP7980222",null,null,null,"PMLP2623922"]
[null,null,null,null,null,null,null,null,612,null,"OPJV4954918",null,null,null,"PMWW8332512"]
[null,null,null,null,null,null,null,null,613,null,"OPNU7273747",null,null,null,"PNEZ2542468"]
[null,null,null,null,null,null,null,null,614,null,"OQOI4393978",null,null,null,"PNGL2789644"]
[null,null,null,null,null,null,null,null,615,null,"OQUW9722202",null,null,null,"PNJZ8953651"]
[null,null,null,null,null,null,null,null,616,null,"OSUX3806490",null,null,null,"PNMQ3427572"]
[null,null,null,null,null,null,null,null,617,null,"OSWY1362661",null,null,null,"PNPW6353815"]
[null,null,null,null,null,null,null,null,618,null,"OTGR7143245",null,null,null,"POOU2924212"]
[null,null,null,null,null,null,null,null,619,null,"OTVR2984603",null,null,null,"POSI8033328"]
[null,null,null,null,null,null,null,null,620,null,"OUMM3867010",null,null,null,"POTP5946574"]
[null,null,null,null,null,null,null,null,621,null,"OUYM3898118",null,null,null,"POWD9633413"]
[null,null,null,null,null,null,null,null,622,null,"OVAX7341528",null,null,null,"POYN9581549"]
[null,null,null,null,null,null,null,null,623,null,"OVIP4862005",null,null,null,"PPFY3241892"]
[null,null,null,null,null,null,null,null,624,null,"OWDT5249579",null,null,null,"PPII7158906"]
[null,null,null,null,null,null,null,null,625,null,"OWJN5675879",null,null,null,"PPMU3062586"]
[null,null,null,null,null,null,null,null,626,null,"OWMV8188464",null,null,null,"PPZW4040690"]
[null,null,null,null,null,null,null,null,627,null,"OWPR7831480",null,null,null,"PRRU9463831"]
[null,null,null,null,null,null,null,null,628,null,"OYJE4085829",null,null,null,"PSSM5871066"]
[null,null,null,null,null,null,null,null,629,null,"OZQT9461283",null,null,null,"PSXL6391583"]
[null,null,null,null,null,null,null,null,630,null,"PBHO7123898",null,null,null,"PTXW4344557"]
[null,null,null,null,null,null,null,null,631,null,"PCAJ8489297",null,null,null,"PVFL7527896"]
[null,null,null,null,null,null,null,null,632,null,"PCDY2254994",null,null,null,"PWCV8584535"]
[null,null,null,null,null,null,null,null,633,null,"PCFC9254910",null,null,null,"PWEA7419229"]
[null,null,null,null,null,null,null,null,634,null,"PCMG2053190",null,null,null,"PWRL1998187"]
[null,null,null,null,null,null,null,null,635,null,"PDOH6200882",null,null,null,"PWWI2745711"]
[null,null,null,null,null,null,null,null,636,null,"PDZV4772135",null,null,null,"PYDW5097212"]
[null,null,null,null,null,null,null,null,637,null,"PEHF1224781",null,null,null,"PYLS5736101"]
[null,null,null,null,null,null,null,null,638,null,"PFHA9055819",null,null,null,"PYNF7284497"]
[null,null,null,null,null,null,null,null,639,null,"PFLS7609236",null,null,null,"PYUY4018847"]
[null,null,null,null,null,null,null,null,640,null,"PGDK8765592",null,null,null,"PZNC6775786"]
[null,null,null,null,null,null,null,null,641,null,"PHDM4369052",null,null,null,"PZSU8885674"]
[null,null,null,null,null,null,null,null,642,null,"PHOI7871806",null,null,null,"PZZT8532525"]
[null,null,null,null,null,null,null,null,643,null,"PIUL8387216",null,null,null,"QAJD1982475"]
[null,null,null,null,null,null,null,null,644,null,"PJVU5152272",null,null,null,"QBDW2575751"]
[null,null,null,null,null,null,null,null,645,null,"PJWM3749174",null,null,null,"QCAW8260064"]
[null,null,null,null,null,null,null,null,646,null,"PKUB8763181",null,null,null,"QCLP1846940"]
[null,null,null,null,null,null,null,null,647,null,"PLNJ9728418",null,null,null,"QDFD3611372"]
[null,null,null,null,null,null,null,null,648,null,"PLOL2755867",null,null,null,"QDLL2155773"]
[null,null,null,null,null,null,null,null,649,null,"PMHY7269323",null,null,null,"QFIZ6589988"]
[null,null,null,null,null,null,null,null,650,null,"PMLP2623922",null,null,null,"QFJD8638744"]
[null,null,null,null,null,null,null,null,651,null,"PMWW8332512",null,null,null,"QFJH7741487"]
[null,null,null,null,null,null,null,null,652,null,"PNEZ2542468",null,null,null,"QGBI1626910"]
[null,null,null,null,null,null,null,null,653,null,"PNGL2789644",null,null,null,"QJLK8574095"]
[null,null,null,null,null,null,null,null,654,null,"PNHA9506906",null,null,null,"QJOA6086726"]
[null,null,null,null,null,null,null,null,655,null,"PNPW6353815",null,null,null,"QJSJ7181530"]
[null,null,null,null,null,null,null,null,656,null,"POJQ9144025",null,null,null,"QKKL2895098"]
[null,null,null,null,null,null,null,null,657,null,"POOU2924212",null,null,null,"QLMW7299809"]
[null,null,null,null,null,null,null,null,658,null,"POSI8033328",null,null,null,"QLPD1667028"]
[null,null,null,null,null,null,null,null,659,null,"POTP5946574",null,null,null,"QMRH9377129"]
[null,null,null,null,null,null,null,null,660,null,"POWD9633413",null,null,null,"QOAC3803132"]
[null,null,null,null,null,null,null,null,661,null,"POYN9581549",null,null,null,"QOAI8534918"]
[null,null,null,null,null,null,null,null,662,null,"PPII7158906",null,null,null,"QPVE9184213"]
[null,null,null,null,null,null,null,null,663,null,"PRRU9463831",null,null,null,"QQAR1712324"]
[null,null,null,null,null,null,null,null,664,null,"PRVC3122987",null,null,null,"QQCM4853770"]
[null,null,null,null,null,null,null,null,665,null,"PSAJ4214774",null,null,null,"QQKF3191064"]
[null,null,null,null,null,null,null,null,666,null,"PSSM5871066",null,null,null,"QQKK3874422"]
[null,null,null,null,null,null,null,null,667,null,"PSXL6391583",null,null,null,"QQNE5005650"]
[null,null,null,null,null,null,null,null,668,null,"PUFK3906700",null,null,null,"QQWL9675043"]
[null,null,null,null,null,null,null,null,669,null,"PVFL7527896",null,null,null,"QSOS1187525"]
[null,null,null,null,null,null,null,null,670,null,"PWCV8584535",null,null,null,"QTGH8145183"]
[null,null,null,null,null,null,null,null,671,null,"PWEA7419229",null,null,null,"QTRT9129733"]
[null,null,null,null,null,null,null,null,672,null,"PWRL1998187",null,null,null,"QUOE8934165"]
[null,null,null,null,null,null,null,null,673,null,"PXIP1137962",null,null,null,"QVBH6158884"]
[null,null,null,null,null,null,null,null,674,null,"PYLS5736101",null,null,null,"QVOU1385602"]
[null,null,null,null,null,null,null,null,675,null,"PYUY4018847",null,null,null,"QVPU2573132"]
[null,null,null,null,null,null,null,null,676,null,"PZOZ3011810",null,null,null,"QWBT5108081"]
[null,null,null,null,null,null,null,null,677,null,"PZXD1802931",null,null,null,"QWHD8839741"]
[null,null,null,null,null,null,null,null,678,null,"QAJD1982475",null,null,null,"QWNE6663223"]
[null,null,null,null,null,null,null,null,679,null,"QAUA3858828",null,null,null,"QXVN9201388"]
[null,null,null,null,null,null,null,null,680,null,"QBDW2575751",null,null,null,"QYRR7944887"]
[null,null,null,null,null,null,null,null,681,null,"QCAW8260064",null,null,null,"RCBZ3640318"]
[null,null,null,null,null,null,null,null,682,null,"QDFD3611372",null,null,null,"RCJO1317655"]
[null,null,null,null,null,null,null,null,683,null,"QDLL2155773",null,null,null,"RCLT3998381"]
[null,null,null,null,null,null,null,null,684,null,"QFIZ6589988",null,null,null,"RCMZ5155746"]
[null,null,null,null,null,null,null,null,685,null,"QFJD8638744",null,null,null,"RCTN4931939"]
[null,null,null,null,null,null,null,null,686,null,"QGBI1626910",null,null,null,"RDNO6444925"]
[null,null,null,null,null,null,null,null,687,null,"QGPW9235361",null,null,null,"REKQ7766309"]
[null,null,null,null,null,null,null,null,688,null,"QJPG4986843",null,null,null,"RFAJ6599088"]
[null,null,null,null,null,null,null,null,689,null,"QJSJ7181530",null,null,null,"RFFO6067564"]
[null,null,null,null,null,null,null,null,690,null,"QKKL2895098",null,null,null,"RFXP5558463"]
[null,null,null,null,null,null,null,null,691,null,"QLMW7299809",null,null,null,"RGSP5588165"]
[null,null,null,null,null,null,null,null,692,null,"QNFS7681382",null,null,null,"RIAL7891751"]
[null,null,null,null,null,null,null,null,693,null,"QOAI8534918",null,null,null,"RIJV1463693"]
[null,null,null,null,null,null,null,null,694,null,"QOVA5465475",null,null,null,"RIZN2060490"]
[null,null,null,null,null,null,null,null,695,null,"QPFL9279081",null,null,null,"RJUO3112703"]
[null,null,null,null,null,null,null,null,696,null,"QQAR1712324",null,null,null,"RKPO7698862"]
[null,null,null,null,null,null,null,null,697,null,"QQKK3874422",null,null,null,"RMUF8040664"]
[null,null,null,null,null,null,null,null,698,null,"QQNE5005650",null,null,null,"RNJH7897237"]
[null,null,null,null,null,null,null,null,699,null,"QQWL9675043",null,null,null,"ROXL5481503"]
[null,null,null,null,null,null,null,null,700,null,"QSOS1187525",null,null,null,"RPEV4510371"]
[null,null,null,null,null,null,null,null,701,null,"QTAZ3804665",null,null,null,"RPGN5828024"]
[null,null,null,null,null,null,null,null,702,null,"QTGH8145183",null,null,null,"RQDC2040696"]
[null,null,null,null,null,null,null,null,703,null,"QTRT9129733",null,null,null,"RQJM7738570"]
[null,null,null,null,null,null,null,null,704,null,"QUJS4981038",null,null,null,"RRCO9761186"]
[null,null,null,null,null,null,null,null,705,null,"QUOE8934165",null,null,null,"RRDI3119148"]
[null,null,null,null,null,null,null,null,706,null,"QVCT8627079",null,null,null,"RSFX8146038"]
[null,null,null,null,null,null,null,null,707,null,"QVOU1385602",null,null,null,"RSWK5982894"]
[null,null,null,null,null,null,null,null,708,null,"QVPU2573132",null,null,null,"RUDM7137902"]
[null,null,null,null,null,null,null,null,709,null,"QWBT5108081",null,null,null,"RUGC1137072"]
[null,null,null,null,null,null,null,null,710,null,"QXVN9201388",null,null,null,"RUWR5157005"]
[null,null,null,null,null,null,null,null,711,null,"QXZK1494391",null,null,null,"RVHX1158443"]
[null,null,null,null,null,null,null,null,712,null,"QYRR7944887",null,null,null,"RXDY3790674"]
[null,null,null,null,null,null,null,null,713,null,"RCBZ3640318",null,null,null,"RYWG4991136"]
[null,null,null,null,null,null,null,null,714,null,"RCHI4404435",null,null,null,"RZQD7040920"]
[null,null,null,null,null,null,null,null,715,null,"RCJO1317655",null,null,null,"SAKB2939078"]
[null,null,null,null,null,null,null,null,716,null,"RCLT3998381",null,null,null,"SATH9233732"]
[null,null,null,null,null,null,null,null,717,null,"RCTN4931939",null,null,null,"SBDM5958036"]
[null,null,null,null,null,null,null,null,718,null,"RDNO6444925",null,null,null,"SBEK9431587"]
[null,null,null,null,null,null,null,null,719,null,"REKQ7766309",null,null,null,"SCWA4317514"]
[null,null,null,null,null,null,null,null,720,null,"RFAJ6599088",null,null,null,"SDHN2815497"]
[null,null,null,null,null,null,null,null,721,null,"RFFO6067564",null,null,null,"SDIG4056980"]
[null,null,null,null,null,null,null,null,722,null,"RFIY3958199",null,null,null,"SDRL8680001"]
[null,null,null,null,null,null,null,null,723,null,"RGSP5588165",null,null,null,"SECN8612253"]
[null,null,null,null,null,null,null,null,724,null,"RGYI8681644",null,null,null,"SESJ9975908"]
[null,null,null,null,null,null,null,null,725,null,"RHGJ4693855",null,null,null,"SGIE9925218"]
[null,null,null,null,null,null,null,null,726,null,"RIAL7891751",null,null,null,"SGKN5516652"]
[null,null,null,null,null,null,null,null,727,null,"RIID9163194",null,null,null,"SHIY1154956"]
[null,null,null,null,null,null,null,null,728,null,"RIJV1463693",null,null,null,"SIEF2961438"]
[null,null,null,null,null,null,null,null,729,null,"RIMM1900445",null,null,null,"SINH4739253"]
[null,null,null,null,null,null,null,null,730,null,"RIZN2060490",null,null,null,"SJAT9339313"]
[null,null,null,null,null,null,null,null,731,null,"RJUO3112703",null,null,null,"SJNO2276437"]
[null,null,null,null,null,null,null,null,732,null,"RKEK4327345",null,null,null,"SJXI6919815"]
[null,null,null,null,null,null,null,null,733,null,"RKKL9844807",null,null,null,"SLXW3660965"]
[null,null,null,null,null,null,null,null,734,null,"RKKU5025576",null,null,null,"SLYN3959350"]
[null,null,null,null,null,null,null,null,735,null,"RMUF8040664",null,null,null,"SMYY1343708"]
[null,null,null,null,null,null,null,null,736,null,"RNJH7897237",null,null,null,"SMZA5637102"]
[null,null,null,null,null,null,null,null,737,null,"ROTV2648237",null,null,null,"SNLQ9749566"]
[null,null,null,null,null,null,null,null,738,null,"ROXL5481503",null,null,null,"SNUN1488495"]
[null,null,null,null,null,null,null,null,739,null,"RPGN5828024",null,null,null,"SQOC6272040"]
[null,null,null,null,null,null,null,null,740,null,"RPKA1325664",null,null,null,"SRDH6848367"]
[null,null,null,null,null,null,null,null,741,null,"RQDC2040696",null,null,null,"SRQT5379622"]
[null,null,null,null,null,null,null,null,742,null,"RQJM7738570",null,null,null,"SRXZ5017774"]
[null,null,null,null,null,null,null,null,743,null,"RRCO9761186",null,null,null,"SSIJ7884800"]
[null,null,null,null,null,null,null,null,744,null,"RRDI3119148",null,null,null,"STJC9442435"]
[null,null,null,null,null,null,null,null,745,null,"RSFX8146038",null,null,null,"STNO4473368"]
[null,null,null,null,null,null,null,null,746,null,"RSTM7290374",null,null,null,"STQW3865144"]
[null,null,null,null,null,null,null,null,747,null,"RSXL5607096",null,null,null,"SUBZ8909399"]
[null,null,null,null,null,null,null,null,748,null,"RTSY8036036",null,null,null,"SUBZ9055959"]
[null,null,null,null,null,null,null,null,749,null,"RUGC1137072",null,null,null,"SUOQ5354592"]
[null,null,null,null,null,null,null,null,750,null,"RUWR5157005",null,null,null,"SVDI4269487"]
[null,null,null,null,null,null,null,null,751,null,"RVHX1158443",null,null,null,"SVMN8185508"]
[null,null,null,null,null,null,null,null,752,null,"RWST5617075",null,null,null,"SWJM4469231"]
[null,null,null,null,null,null,null,null,753,null,"RXDY3790674",null,null,null,"SXJR9553297"]
[null,null,null,null,null,null,null,null,754,null,"RYHW8642618",null,null,null,"SXLQ7890697"]
[null,null,null,null,null,null,null,null,755,null,"RYKI4645344",null,null,null,"SXNY6281191"]
[null,null,null,null,null,null,null,null,756,null,"RYWG4991136",null,null,null,"SYLT9776572"]
[null,null,null,null,null,null,null,null,757,null,"RZMI3486594",null,null,null,"SZBG5633780"]
[null,null,null,null,null,null,null,null,758,null,"RZQD7040920",null,null,null,"SZTQ1841092"]
[null,null,null,null,null,null,null,null,759,null,"SARR6613279",null,null,null,"TAAL4313128"]
[null,null,null,null,null,null,null,null,760,null,"SATH9233732",null,null,null,"TADZ5400230"]
[null,null,null,null,null,null,null,null,761,null,"SBDM5958036",null,null,null,"TAYH7080804"]
[null,null,null,null,null,null,null,null,762,null,"SBEK9431587",null,null,null,"TCAK5037473"]
[null,null,null,null,null,null,null,null,763,null,"SCWA4317514",null,null,null,"TFEO8015302"]
[null,null,null,null,null,null,null,null,764,null,"SDHN2815497",null,null,null,"TFHP3816489"]
[null,null,null,null,null,null,null,null,765,null,"SDIG4056980",null,null,null,"TGJW5545908"]
[null,null,null,null,null,null,null,null,766,null,"SECN8612253",null,null,null,"THGR8308109"]
[null,null,null,null,null,null,null,null,767,null,"SFHF1578154",null,null,null,"TIRT2515746"]
[null,null,null,null,null,null,null,null,768,null,"SGKN5516652",null,null,null,"TIWQ6445384"]
[null,null,null,null,null,null,null,null,769,null,"SGZI8335076",null,null,null,"TJOR9750830"]
[null,null,null,null,null,null,null,null,770,null,"SIBL9103219",null,null,null,"TJOT2568581"]
[null,null,null,null,null,null,null,null,771,null,"SIEF2961438",null,null,null,"TJQG8966108"]
[null,null,null,null,null,null,null,null,772,null,"SIEK6620693",null,null,null,"TMSZ8935063"]
[null,null,null,null,null,null,null,null,773,null,"SINH4739253",null,null,null,"TNQC5528725"]
[null,null,null,null,null,null,null,null,774,null,"SJAT9339313",null,null,null,"TOCD3655241"]
[null,null,null,null,null,null,null,null,775,null,"SJNO2276437",null,null,null,"TOKA8417782"]
[null,null,null,null,null,null,null,null,776,null,"SJVM3247699",null,null,null,"TOSP4802041"]
[null,null,null,null,null,null,null,null,777,null,"SJXI6919815",null,null,null,"TOVK1120006"]
[null,null,null,null,null,null,null,null,778,null,"SLGE1819151",null,null,null,"TRAU7104194"]
[null,null,null,null,null,null,null,null,779,null,"SLYN3959350",null,null,null,"TRME3878125"]
[null,null,null,null,null,null,null,null,780,null,"SMKL3932042",null,null,null,"TRZH1123954"]
[null,null,null,null,null,null,null,null,781,null,"SMUV6286954",null,null,null,"TSIW9807218"]
[null,null,null,null,null,null,null,null,782,null,"SMYY1343708",null,null,null,"TSMY2148815"]
[null,null,null,null,null,null,null,null,783,null,"SMZA5637102",null,null,null,"TSQZ1528188"]
[null,null,null,null,null,null,null,null,784,null,"SNUN1488495",null,null,null,"TSST7350561"]
[null,null,null,null,null,null,null,null,785,null,"SOII5354173",null,null,null,"TSVG2885084"]
[null,null,null,null,null,null,null,null,786,null,"SQOC6272040",null,null,null,"TTLT5706169"]
[null,null,null,null,null,null,null,null,787,null,"SRDH6848367",null,null,null,"TTYZ1962011"]
[null,null,null,null,null,null,null,null,788,null,"SRXZ5017774",null,null,null,"TVPE8797143"]
[null,null,null,null,null,null,null,null,789,null,"SSIJ7884800",null,null,null,"TWPF7357170"]
[null,null,null,null,null,null,null,null,790,null,"STJC9442435",null,null,null,"TWXT9667228"]
[null,null,null,null,null,null,null,null,791,null,"STQW3865144",null,null,null,"TXNQ1755110"]
[null,null,null,null,null,null,null,null,792,null,"STWX6835986",null,null,null,"TYKK2063777"]
[null,null,null,null,null,null,null,null,793,null,"SUBZ9055959",null,null,null,"TYOF4384055"]
[null,null,null,null,null,null,null,null,794,null,"SUOQ5354592",null,null,null,"TZAF6093596"]
[null,null,null,null,null,null,null,null,795,null,"SVDI4269487",null,null,null,"UARC1960707"]
[null,null,null,null,null,null,null,null,796,null,"SVMN8185508",null,null,null,"UARE5037702"]
[null,null,null,null,null,null,null,null,797,null,"SWJM4469231",null,null,null,"UBGP7018765"]
[null,null,null,null,null,null,null,null,798,null,"SXJR9553297",null,null,null,"UCSI5783190"]
[null,null,null,null,null,null,null,null,799,null,"SYLT9776572",null,null,null,"UCTU6392016"]
[null,null,null,null,null,null,null,null,800,null,"SYTC1168794",null,null,null,"UCXR5283226"]
[null,null,null,null,null,null,null,null,801,null,"SZTQ1841092",null,null,null,"UDPK4069100"]
[null,null,null,null,null,null,null,null,802,null,"TAAL4313128",null,null,null,"UDSJ4620559"]
[null,null,null,null,null,null,null,null,803,null,"TADZ5400230",null,null,null,"UEMN9547359"]
[null,null,null,null,null,null,null,null,804,null,"TAYH7080804",null,null,null,"UERL5371571"]
[null,null,null,null,null,null,null,null,805,null,"TDQM1808536",null,null,null,"UFCA6683967"]
[null,null,null,null,null,null,null,null,806,null,"TEDT5688959",null,null,null,"UFEK7220372"]
[null,null,null,null,null,null,null,null,807,null,"TFEO8015302",null,null,null,"UFGE9042266"]
[null,null,null,null,null,null,null,null,808,null,"TFHP3816489",null,null,null,"UFHE1124373"]
[null,null,null,null,null,null,null,null,809,null,"TGJW5545908",null,null,null,"UFLO2416322"]
[null,null,null,null,null,null,null,null,810,null,"TGKL3652672",null,null,null,"UGUH6106685"]
[null,null,null,null,null,null,null,null,811,null,"TGQQ8598435",null,null,null,"UIMG2184492"]
[null,null,null,null,null,null,null,null,812,null,"THGR8308109",null,null,null,"UJFK1863813"]
[null,null,null,null,null,null,null,null,813,null,"THKZ3307444",null,null,null,"UKCL7701699"]
[null,null,null,null,null,null,null,null,814,null,"TIRF9942101",null,null,null,"UKEH8614389"]
[null,null,null,null,null,null,null,null,815,null,"TIWQ6445384",null,null,null,"UKQH2103372"]
[null,null,null,null,null,null,null,null,816,null,"TJOR9750830",null,null,null,"UKQM9459660"]
[null,null,null,null,null,null,null,null,817,null,"TJQG8966108",null,null,null,"ULFT2787745"]
[null,null,null,null,null,null,null,null,818,null,"TJXJ8971967",null,null,null,"ULQN2049245"]
[null,null,null,null,null,null,null,null,819,null,"TMSZ8935063",null,null,null,"ULXL7590480"]
[null,null,null,null,null,null,null,null,820,null,"TNQC5528725",null,null,null,"UMPG5123986"]
[null,null,null,null,null,null,null,null,821,null,"TOCD3655241",null,null,null,"UNAO7589478"]
[null,null,null,null,null,null,null,null,822,null,"TOCN5888966",null,null,null,"UNEB9341205"]
[null,null,null,null,null,null,null,null,823,null,"TOVK1120006",null,null,null,"UOBE5412138"]
[null,null,null,null,null,null,null,null,824,null,"TOWS7888938",null,null,null,"UODZ5651281"]
[null,null,null,null,null,null,null,null,825,null,"TRAU7104194",null,null,null,"UOOB3108028"]
[null,null,null,null,null,null,null,null,826,null,"TRME3878125",null,null,null,"UQKT1154151"]
[null,null,null,null,null,null,null,null,827,null,"TRND7797545",null,null,null,"UQPN4942723"]
[null,null,null,null,null,null,null,null,828,null,"TRXZ7318520",null,null,null,"UTAX9273561"]
[null,null,null,null,null,null,null,null,829,null,"TRZH1123954",null,null,null,"UTFK2798708"]
[null,null,null,null,null,null,null,null,830,null,"TSST7350561",null,null,null,"UTKU5163300"]
[null,null,null,null,null,null,null,null,831,null,"TSVG2885084",null,null,null,"UUJU7741162"]
[null,null,null,null,null,null,null,null,832,null,"TTLT5706169",null,null,null,"UUUU2367398"]
[null,null,null,null,null,null,null,null,833,null,"TTYZ1962011",null,null,null,"UVEV8397841"]
[null,null,null,null,null,null,null,null,834,null,"TVIU2462647",null,null,null,"UVWJ7923800"]
[null,null,null,null,null,null,null,null,835,null,"TVPE8797143",null,null,null,"UWHS7853578"]
[null,null,null,null,null,null,null,null,836,null,"TWPF7357170",null,null,null,"UWTG3433797"]
[null,null,null,null,null,null,null,null,837,null,"TWWA8775572",null,null,null,"UXWD5536603"]
[null,null,null,null,null,null,null,null,838,null,"TXNQ1755110",null,null,null,"UYMY4602319"]
[null,null,null,null,null,null,null,null,839,null,"TYOF4384055",null,null,null,"UZQH6029709"]
[null,null,null,null,null,null,null,null,840,null,"TZAF6093596",null,null,null,"VAKJ9574802"]
[null,null,null,null,null,null,null,null,841,null,"UARC1960707",null,null,null,"VANB2996890"]
[null,null,null,null,null,null,null,null,842,null,"UARE5037702",null,null,null,"VAOJ1210610"]
[null,null,null,null,null,null,null,null,843,null,"UBGP7018765",null,null,null,"VEAD4693831"]
[null,null,null,null,null,null,null,null,844,null,"UCSI5783190",null,null,null,"VEBL6074923"]
[null,null,null,null,null,null,null,null,845,null,"UCTU6392016",null,null,null,"VEND5931743"]
[null,null,null,null,null,null,null,null,846,null,"UCXR5283226",null,null,null,"VFZC3746504"]
[null,null,null,null,null,null,null,null,847,null,"UDJL2377883",null,null,null,"VGII6642752"]
[null,null,null,null,null,null,null,null,848,null,"UDSJ4620559",null,null,null,"VGJZ7596547"]
[null,null,null,null,null,null,null,null,849,null,"UERL5371571",null,null,null,"VGKN8712506"]
[null,null,null,null,null,null,null,null,850,null,"UETU8580295",null,null,null,"VGNO8213665"]
[null,null,null,null,null,null,null,null,851,null,"UFCA6683967",null,null,null,"VGXT5754912"]
[null,null,null,null,null,null,null,null,852,null,"UFGE9042266",null,null,null,"VHBB2969973"]
[null,null,null,null,null,null,null,null,853,null,"UFHE1124373",null,null,null,"VIIX8663722"]
[null,null,null,null,null,null,null,null,854,null,"UFLO2416322",null,null,null,"VIVZ5840305"]
[null,null,null,null,null,null,null,null,855,null,"UGUH6106685",null,null,null,"VIXF5413650"]
[null,null,null,null,null,null,null,null,856,null,"UIMG2184492",null,null,null,"VJEV5040583"]
[null,null,null,null,null,null,null,null,857,null,"UIUL2891434",null,null,null,"VJVE9040429"]
[null,null,null,null,null,null,null,null,858,null,"UJFK1863813",null,null,null,"VLQA9764519"]
[null,null,null,null,null,null,null,null,859,null,"UKCL7701699",null,null,null,"VLUW9974379"]
[null,null,null,null,null,null,null,null,860,null,"UKEH8614389",null,null,null,"VNEB9718933"]
[null,null,null,null,null,null,null,null,861,null,"UKPB8416474",null,null,null,"VOYC9351050"]
[null,null,null,null,null,null,null,null,862,null,"UKQH2103372",null,null,null,"VPMG2428584"]
[null,null,null,null,null,null,null,null,863,null,"ULAW9396451",null,null,null,"VPNH9261605"]
[null,null,null,null,null,null,null,null,864,null,"ULFT2787745",null,null,null,"VQVO4172917"]
[null,null,null,null,null,null,null,null,865,null,"ULQN2049245",null,null,null,"VSUF7079314"]
[null,null,null,null,null,null,null,null,866,null,"UMPG5123986",null,null,null,"VSWV6157153"]
[null,null,null,null,null,null,null,null,867,null,"UNAO7589478",null,null,null,"VTJJ5847800"]
[null,null,null,null,null,null,null,null,868,null,"UNEB9341205",null,null,null,"VTQU7743258"]
[null,null,null,null,null,null,null,null,869,null,"UNEZ1764610",null,null,null,"VUKC5481612"]
[null,null,null,null,null,null,null,null,870,null,"UOBE5412138",null,null,null,"VURY9649555"]
[null,null,null,null,null,null,null,null,871,null,"UOOB3108028",null,null,null,"VVGI6629898"]
[null,null,null,null,null,null,null,null,872,null,"UQKT1154151",null,null,null,"VVMT7434569"]
[null,null,null,null,null,null,null,null,873,null,"UQPN4942723",null,null,null,"VVXN8725232"]
[null,null,null,null,null,null,null,null,874,null,"URIL8195678",null,null,null,"VWJM8703852"]
[null,null,null,null,null,null,null,null,875,null,"UTAX9273561",null,null,null,"VXLE8035759"]
[null,null,null,null,null,null,null,null,876,null,"UTFK2798708",null,null,null,"VXMS3247203"]
[null,null,null,null,null,null,null,null,877,null,"UTKU5163300",null,null,null,"VXNQ6748264"]
[null,null,null,null,null,null,null,null,878,null,"UTOS3995416",null,null,null,"VXOC6384233"]
[null,null,null,null,null,null,null,null,879,null,"UTSY7278647",null,null,null,"VYQM3580643"]
[null,null,null,null,null,null,null,null,880,null,"UTXV8412657",null,null,null,"WADO6641666"]
[null,null,null,null,null,null,null,null,881,null,"UUUU2367398",null,null,null,"WATY7892039"]
[null,null,null,null,null,null,null,null,882,null,"UVWJ7923800",null,null,null,"WAYR5253222"]
[null,null,null,null,null,null,null,null,883,null,"UWTG3433797",null,null,null,"WBJD7913120"]
[null,null,null,null,null,null,null,null,884,null,"UXWD5536603",null,null,null,"WBZK6977079"]
[null,null,null,null,null,null,null,null,885,null,"UYMY4602319",null,null,null,"WCMX6502929"]
[null,null,null,null,null,null,null,null,886,null,"UYUG3679123",null,null,null,"WDGQ5999922"]
[null,null,null,null,null,null,null,null,887,null,"UYZR8551666",null,null,null,"WDZO9486853"]
[null,null,null,null,null,null,null,null,888,null,"UZQH6029709",null,null,null,"WFPM6332745"]
[null,null,null,null,null,null,null,null,889,null,"VAKJ9574802",null,null,null,"WFPX7752121"]
[null,null,null,null,null,null,null,null,890,null,"VANB2996890",null,null,null,"WGJD8699878"]
[null,null,null,null,null,null,null,null,891,null,"VAOJ1210610",null,null,null,"WGKK1892791"]
[null,null,null,null,null,null,null,null,892,null,"VCSY3447610",null,null,null,"WHFJ6749543"]
[null,null,null,null,null,null,null,null,893,null,"VEAD4693831",null,null,null,"WJNJ9307439"]
[null,null,null,null,null,null,null,null,894,null,"VEAX7432571",null,null,null,"WJPL7451668"]
[null,null,null,null,null,null,null,null,895,null,"VEBL6074923",null,null,null,"WJXD9276322"]
[null,null,null,null,null,null,null,null,896,null,"VEND5931743",null,null,null,"WKBA4112728"]
[null,null,null,null,null,null,null,null,897,null,"VFPJ6551065",null,null,null,"WKNL8067727"]
[null,null,null,null,null,null,null,null,898,null,"VFZC3746504",null,null,null,"WLHM4151526"]
[null,null,null,null,null,null,null,null,899,null,"VGJZ7596547",null,null,null,"WMHD9361389"]
[null,null,null,null,null,null,null,null,900,null,"VGKN8712506",null,null,null,"WMSD9341352"]
[null,null,null,null,null,null,null,null,901,null,"VGNO8213665",null,null,null,"WMUK9356348"]
[null,null,null,null,null,null,null,null,902,null,"VGXT5754912",null,null,null,"WNID2626309"]
[null,null,null,null,null,null,null,null,903,null,"VHBB2969973",null,null,null,"WNIY3891658"]
[null,null,null,null,null,null,null,null,904,null,"VIIX8663722",null,null,null,"WNJV7566661"]
[null,null,null,null,null,null,null,null,905,null,"VIUH7043407",null,null,null,"WPCQ2721843"]
[null,null,null,null,null,null,null,null,906,null,"VIVZ5840305",null,null,null,"WPIW7984479"]
[null,null,null,null,null,null,null,null,907,null,"VIXF5413650",null,null,null,"WQNJ6162277"]
[null,null,null,null,null,null,null,null,908,null,"VJVE9040429",null,null,null,"WRBN4856906"]
[null,null,null,null,null,null,null,null,909,null,"VLQA9764519",null,null,null,"WSTL4351852"]
[null,null,null,null,null,null,null,null,910,null,"VNEB9718933",null,null,null,"WSTM5993087"]
[null,null,null,null,null,null,null,null,911,null,"VNRN3769522",null,null,null,"WTHH6336614"]
[null,null,null,null,null,null,null,null,912,null,"VOLA7119545",null,null,null,"WUXU3394847"]
[null,null,null,null,null,null,null,null,913,null,"VPMG2428584",null,null,null,"WVFT7868635"]
[null,null,null,null,null,null,null,null,914,null,"VPNH9261605",null,null,null,"WVNW9120403"]
[null,null,null,null,null,null,null,null,915,null,"VPWX1379357",null,null,null,"WVVX4898373"]
[null,null,null,null,null,null,null,null,916,null,"VQVO4172917",null,null,null,"WWNY6217827"]
[null,null,null,null,null,null,null,null,917,null,"VSUF7079314",null,null,null,"WWXC9253616"]
[null,null,null,null,null,null,null,null,918,null,"VTSS7274576",null,null,null,"WWYX2290101"]
[null,null,null,null,null,null,null,null,919,null,"VUEC7287529",null,null,null,"WYOE5880714"]
[null,null,null,null,null,null,null,null,920,null,"VUKC5481612",null,null,null,"WZAM3266787"]
[null,null,null,null,null,null,null,null,921,null,"VURY9649555",null,null,null,"WZNK3734694"]
[null,null,null,null,null,null,null,null,922,null,"VVAF7080547",null,null,null,"WZRQ4481148"]
[null,null,null,null,null,null,null,null,923,null,"VVGI6629898",null,null,null,"XABR7070362"]
[null,null,null,null,null,null,null,null,924,null,"VVMT7434569",null,null,null,"XBAO1978021"]
[null,null,null,null,null,null,null,null,925,null,"VVXN8725232",null,null,null,"XBCX6361234"]
[null,null,null,null,null,null,null,null,926,null,"VWJZ4022396",null,null,null,"XBMG3657145"]
[null,null,null,null,null,null,null,null,927,null,"VXLE8035759",null,null,null,"XCYT6796559"]
[null,null,null,null,null,null,null,null,928,null,"VXNQ6748264",null,null,null,"XDGM9417606"]
[null,null,null,null,null,null,null,null,929,null,"VZYB1880642",null,null,null,"XECO5958260"]
[null,null,null,null,null,null,null,null,930,null,"WADO6641666",null,null,null,"XEGS8314580"]
[null,null,null,null,null,null,null,null,931,null,"WAYR5253222",null,null,null,"XGJP5279489"]
[null,null,null,null,null,null,null,null,932,null,"WBJD7913120",null,null,null,"XJDI4132854"]
[null,null,null,null,null,null,null,null,933,null,"WCMX6502929",null,null,null,"XKFH1346549"]
[null,null,null,null,null,null,null,null,934,null,"WDGQ5999922",null,null,null,"XKQT1575452"]
[null,null,null,null,null,null,null,null,935,null,"WDPB4408474",null,null,null,"XLFO5708822"]
[null,null,null,null,null,null,null,null,936,null,"WDZO9486853",null,null,null,"XLIG8563831"]
[null,null,null,null,null,null,null,null,937,null,"WFPM6332745",null,null,null,"XLMD8033555"]
[null,null,null,null,null,null,null,null,938,null,"WFPX7752121",null,null,null,"XLPT5386061"]
[null,null,null,null,null,null,null,null,939,null,"WGKK1892791",null,null,null,"XNBF5647654"]
[null,null,null,null,null,null,null,null,940,null,"WHFJ6749543",null,null,null,"XNDU6126041"]
[null,null,null,null,null,null,null,null,941,null,"WIXQ8078281",null,null,null,"XPSY9216353"]
[null,null,null,null,null,null,null,null,942,null,"WJXD9276322",null,null,null,"XRJZ5363653"]
[null,null,null,null,null,null,null,null,943,null,"WKBA4112728",null,null,null,"XRLX6747713"]
[null,null,null,null,null,null,null,null,944,null,"WKNL8067727",null,null,null,"XRNC3641056"]
[null,null,null,null,null,null,null,null,945,null,"WLHM4151526",null,null,null,"XRPL8428108"]
[null,null,null,null,null,null,null,null,946,null,"WMHD9361389",null,null,null,"XRXJ9895307"]
[null,null,null,null,null,null,null,null,947,null,"WMLP2885310",null,null,null,"XSGN5611244"]
[null,null,null,null,null,null,null,null,948,null,"WMUK9356348",null,null,null,"XXMJ6790878"]
[null,null,null,null,null,null,null,null,949,null,"WNID2626309",null,null,null,"XZRK9369209"]
[null,null,null,null,null,null,null,null,950,null,"WNIY3891658"]
[null,null,null,null,null,null,null,null,951,null,"WPAV6578850"]
[null,null,null,null,null,null,null,null,952,null,"WPCQ2721843"]
[null,null,null,null,null,null,null,null,953,null,"WPIW7984479"]
[null,null,null,null,null,null,null,null,954,null,"WQNJ6162277"]
[null,null,null,null,null,null,null,null,955,null,"WRBN4856906"]
[null,null,null,null,null,null,null,null,956,null,"WRNL9155970"]
[null,null,null,null,null,null,null,null,957,null,"WSTL4351852"]
[null,null,null,null,null,null,null,null,958,null,"WSTM5993087"]
[null,null,null,null,null,null,null,null,959,null,"WTHH6336614"]
[null,null,null,null,null,null,null,null,960,null,"WVFT7868635"]
[null,null,null,null,null,null,null,null,961,null,"WVLP1651084"]
[null,null,null,null,null,null,null,null,962,null,"WVNW9120403"]
[null,null,null,null,null,null,null,null,963,null,"WVUO4524321"]
[null,null,null,null,null,null,null,null,964,null,"WVVX4898373"]
[null,null,null,null,null,null,null,null,965,null,"WWNZ1433832"]
[null,null,null,null,null,null,null,null,966,null,"WWYX2290101"]
[null,null,null,null,null,null,null,null,967,null,"WXPW3452216"]
[null,null,null,null,null,null,null,null,968,null,"WZNK3734694"]
[null,null,null,null,null,null,null,null,969,null,"WZRQ4481148"]
[null,null,null,null,null,null,null,null,970,null,"XABR7070362"]
[null,null,null,null,null,null,null,null,971,null,"XACB3486164"]
[null,null,null,null,null,null,null,null,972,null,"XCYT6796559"]
[null,null,null,null,null,null,null,null,973,null,"XDBC1861157"]
[null,null,null,null,null,null,null,null,974,null,"XDGM9417606"]
[null,null,null,null,null,null,null,null,975,null,"XDVK9081348"]
[null,null,null,null,null,null,null,null,976,null,"XECO5958260"]
[null,null,null,null,null,null,null,null,977,null,"XEGS8314580"]
[null,null,null,null,null,null,null,null,978,null,"XFRJ9548244"]
[null,null,null,null,null,null,null,null,979,null,"XGJP5279489"]
[null,null,null,null,null,null,null,null,980,null,"XKQT1575452"]
[null,null,null,null,null,null,null,null,981,null,"XLFO5708822"]
[null,null,null,null,null,null,null,null,982,null,"XLIG8563831"]
[null,null,null,null,null,null,null,null,983,null,"XLMD8033555"]
[null,null,null,null,null,null,null,null,984,null,"XLPT5386061"]
[null,null,null,null,null,null,null,null,985,null,"XMPV7236754"]
[null,null,null,null,null,null,null,null,986,null,"XNBF5647654"]
[null,null,null,null,null,null,null,null,987,null,"XNDU6126041"]
[null,null,null,null,null,null,null,null,988,null,"XOEY8310067"]
[null,null,null,null,null,null,null,null,989,null,"XPSY9216353"]
[null,null,null,null,null,null,null,null,990,null,"XRJZ5363653"]
[null,null,null,null,null,null,null,null,991,null,"XRLX6747713"]
[null,null,null,null,null,null,null,null,992,null,"XRNC3641056"]
[null,null,null,null,null,null,null,null,993,null,"XRPL8428108"]
[null,null,null,null,null,null,null,null,994,null,"XSGN5611244"]
[null,null,null,null,null,null,null,null,995,null,"XSOS6342560"]
[null,null,null,null,null,null,null,null,996,null,"XUGZ5281266"]
[null,null,null,null,null,null,null,null,997,null,"XVKI6436158"]
[null,null,null,null,null,null,null,null,998,null,"XXMJ6790878"]
[null,null,null,null,null,null,null,null,999,null,"XZNQ2595075"]
[null,null,null,null,null,null,null,null,1000,null,"XZRK9369209"]

{"sheet":"19 Containerlisten (A)_","index":49,"n_rows":13,"n_cols":8,"rows_kept":13,"cut":false,"hidden":true,"merged":[]}
[null,2,2,2,1,1,1,0]
[1,"19 Container lists (E)_",null,null,null,{"$f":"B2","v":"19 Container lists (E)_"}]
[2,"19 Containerlisten (A)_"]
[0]
[null,1,"In Vorbereitung auf diese Aufgabe sollten Sie sich \"Wert in Liste\" und \"Wert nicht in Liste\" angesehen haben. Dann stoppen Sie bitte das Video und lesen Sie sich erst einmal die Mail mit dem Hilferuf eines Studenten durch.\n\nJetzt benutzen Sie bitte das Wissen aus \"Wert in Liste\" und \"Wert nicht in Liste\", um die Spalten der Tabelle zu füllen. Ein Screenshot der Lösung befindet sich rechts daneben.",null,1,"In preparation for this task, you should have looked at \"Value in list\" and \"Value not in list\". Then please stop the video and first read the mail with the call for help from a student.\n\nNow please use the knowledge from \"Value in list\" and \"Value not in list\" to fill the columns of the table. A screenshot of the solution can be found to the right."]
[null,{"$f":"IF(C6<>\"\",B5+1,\"\")","v":""},null,null,{"$f":"IF(F6<>\"\",E5+1,\"\")","v":""}]
[null,{"$f":"IF(C7<>\"\",B6+1,\"\")","v":""},null,null,{"$f":"IF(F7<>\"\",E6+1,\"\")","v":""}]
[null,"",null,null,""]
[null,"",null,null,""]
[null,"",null,null,""]
[null,"",null,null,""]
[null,"",null,null,""]
[null,"",null,null,""]

{"sheet":"20 Intervallsuche","index":50,"n_rows":1340,"n_cols":28,"rows_kept":1340,"cut":false,"hidden":false,"merged":[[1,1,1,4],[2,1,2,4],[8,6,8,10],[9,6,9,10],[10,6,10,10],[11,6,11,10],[13,6,13,10],[14,6,14,10],[17,6,17,10],[18,6,18,10],[26,6,26,10],[28,6,28,10],[29,6,29,10],[33,6,33,8],[21,6,21,10],[22,6,22,10],[23,6,23,10],[24,6,24,10],[25,6,25,10]]}
[null,null,null,null,null,null,null,null,null,null,null,0]
[1,"20 Intervall search",null,null,null,"Back to Start"]
[2,"20 Intervallsuche",null,null,null,"Startseite"]
[null,null,null,null,null,null,null,null,null,null,null,null,null,null,"(falsch!)"]
[null,null,"Datum","PLZ","Gewicht",null,null,null,"AUFGABE: Finden Sie das Intervall mit den meisten Werten!",null,null,"Gewicht","lfd. Nr.","Intervallbeginn","lfd. Nr. Beginn",null,"Gewicht","Wdh.?","Gewicht2","lfd. Nr.",null,"Maximum?","Anzahl im Intervall ",null,"Intervallbeginn","Intervallende","lfd. Nr. Beginn","lfd. Nr. Ende"]
[null,null,"2007-05-01",9715,28,null,null,null,"Länge des Intervalls:",30,null,1,1,1,{"$f":"VLOOKUP(N6,$L$6:$M$1340,2,TRUE)","v":7},null,1,0,{"$f":"Q6+R6*0.01","v":1},1,null,{"$f":"IF(W6=MAX($W$6:$W$1340),1,0)","v":0},{"$f":"AB6-AA6+1","v":202},null,1,{"$f":"Y6+$J$6","v":31},{"$f":"VLOOKUP(Y6,$S$6:$T$1340,2,TRUE)","v":1},{"$f":"VLOOKUP(Z6,$Q$6:$T$1340,4,TRUE)","v":202}]
[null,null,"2007-05-01",10960,28,null,null,null,null,null,null,1,2,2,{"$f":"VLOOKUP(N7,$L$6:$M$1340,2,TRUE)","v":14},null,1,{"$f":"IF(Q7=Q6,1,0)","v":1},{"$f":"Q7+R7*0.01","v":1.01},2,null,0,{"$f":"AB7-AA7+1","v":200},null,2,{"$f":"Y7+$J$6","v":32},{"$f":"VLOOKUP(Y7,$S$6:$T$1340,2,TRUE)","v":8},{"$f":"VLOOKUP(Z7,$Q$6:$T$1340,4,TRUE)","v":207}]
[null,null,"2007-05-01",13399,13,null,"Idee:",null,null,null,null,1,3,3,24,null,1,{"$f":"IF(Q8=Q7,1,0)","v":1},1.01,3,null,0,197,null,3,33,15,211]
[null,null,"2007-05-01",16393,10,null,"aufsteigende Sortierung der Daten (Spalte L)",null,null,null,null,1,4,4,34,null,1,1,1.01,4,null,0,202,null,4,34,25,226]
[null,null,"2007-05-01",21682,28,null,"lfd. Nr. rechts daneben (Spalte M)",null,null,null,null,1,5,5,42,null,1,1,1.01,5,null,0,199,null,5,35,35,233]
[null,null,"2007-05-01",24116,41,null,"Intervallbeginn rechts daneben (Spalte N)",null,null,null,null,1,6,6,48,null,1,1,1.01,6,null,0,198,null,6,36,43,240]
[null,null,"2007-05-01",24121,19,null,"mit SVERWEIS lfd. Nr. des Intervallbeginns suchen (Spalte O)",null,null,null,null,1,7,7,55,null,1,1,1.01,7,null,0,194,null,7,37,49,242]
[null,null,"2007-05-01",32412,9,null,null,null,null,null,null,2,8,8,61,null,2,0,2,8,null,0,194,null,8,38,56,249]
[null,null,"2007-05-01",32331,31,null,"dann könnte man ebenfalls mit SVERWEIS lfd. Nr. des Intervallendes suchen",null,null,null,null,2,9,9,69,null,2,1,2.0099999999999998,9,null,0,195,null,9,39,62,256]
[null,null,"2007-05-01",43959,40,null,"Differenz dazwischen ist gleich der Anzahl der Werte im Intervall",null,null,null,null,2,10,10,77,null,2,1,2.0099999999999998,10,null,0,194,null,10,40,70,263]
[null,null,"2007-05-01",58335,6,null,null,null,null,null,null,2,11,11,83,null,2,1,2.0099999999999998,11,null,0,192,null,11,41,78,269]
[null,null,"2007-05-01",55568,3,null,"ABER - Problem :",null,null,null,null,2,12,12,90,null,2,1,2.0099999999999998,12,null,0,196,null,12,42,84,279]
[null,null,"2007-05-01",74572,8,null,"Der SVERWEIS findet bei mehreren gleichen Werten",null,null,null,null,2,13,13,94,null,2,1,2.0099999999999998,13,null,0,196,null,13,43,91,286]
[null,null,"2007-05-01",83703,29,null,"in der Liste jeweils den letzten!",null,null,null,null,2,14,14,98,null,2,1,2.0099999999999998,14,null,0,195,null,14,44,95,289]
[null,null,"2007-05-01",1068,56,null,null,null,null,null,null,3,15,15,104,null,3,0,3,15,null,0,200,null,15,45,99,298]
[null,null,"2007-05-01",11897,53,null,"Lösung:",null,null,null,null,3,16,16,107,null,3,1,3.01,16,null,0,197,null,16,46,105,301]
[null,null,"2007-05-01",16739,63,null,"Wiederholung = 0 bzw. 1 rechts neben die Daten (Spalte R)",null,null,null,null,3,17,17,112,null,3,1,3.01,17,null,0,203,null,17,47,108,310]
[null,null,"2007-05-01",20453,90,null,"bei Wiederholung einen kleinen Wert zu den Daten hinzuaddieren (Spalte S)",null,null,null,null,3,18,18,119,null,3,1,3.01,18,null,0,206,null,18,48,113,318]
[null,null,"2007-05-01",38855,73,null,"IntervallBEGINN (Spalte Y) in den korrigierten Daten (Spalte S)  suchen lassen",null,null,null,null,3,19,19,130,null,3,1,3.01,19,null,0,206,null,19,49,120,325]
[null,null,"2007-05-01",47878,97,null,"jetzt findet der SVERWEIS den ersten Wert!! (Spalte AA)",null,null,null,null,3,20,20,136,null,3,1,3.01,20,null,0,207,null,20,50,131,337]
[null,null,"2007-05-01",56777,79,null,"IntervallENDE (Spalte AB) in den Originaldaten (Spalte Q) suchen lassen",null,null,null,null,3,21,21,140,null,3,1,3.01,21,null,0,212,null,21,51,137,348]
[null,null,"2007-05-01",87024,89,null,"hier wird der letzte Wert gefunden (Spalte AB)",null,null,null,null,3,22,22,149,null,3,1,3.01,22,null,0,222,null,22,52,141,362]
[null,null,"2007-05-01",5672,190,null,null,null,null,null,null,3,23,23,156,null,3,1,3.01,23,null,0,221,null,23,53,150,370]
[null,null,"2007-05-01",1304,116,null,"Anzahl der Werte im Intervall (Spalte W)",null,null,null,null,3,24,24,159,null,3,1,3.01,24,null,0,219,null,24,54,157,375]
[null,null,"2007-05-01",4105,168,null,"Maximum finden (Spalte V)",null,null,null,null,4,25,25,167,null,4,0,4,25,null,0,223,null,25,55,160,382]
[null,null,"2007-05-01",1880,183,null,null,null,null,null,null,4,26,26,175,null,4,1,4.01,26,null,0,225,null,26,56,168,392]
[null,null,"2007-05-01",4808,200,null,"Ergebnis:",null,null,null,null,4,27,27,183,null,4,1,4.01,27,null,0,226,null,27,57,176,401]
[null,null,"2007-05-01",13411,142,null,null,null,null,null,null,4,28,28,189,null,4,1,4.01,28,null,0,225,null,28,58,184,408]
[null,null,"2007-05-01",24542,147,null,"Die meisten Werte befinden sich im Intervall zwischen",null,null,null,null,4,29,29,195,null,4,1,4.01,29,null,0,222,null,29,59,190,411]
[0,null,"2007-05-01",44698,105,null,{"$f":"VLOOKUP(1,V6:Y1340,4,FALSE)","v":50},"und",{"$f":"G35+J6","v":80},null,null,4,30,30,198,null,4,1,4.01,30,null,0,226,null,30,60,196,421]
[null,null,"2007-05-01",54367,111,null,null,null,null,null,null,4,31,31,202,null,4,1,4.01,31,null,0,234,null,31,61,199,432]
[null,null,"2007-05-01",58891,111,null,null,null,null,null,null,4,32,32,207,null,4,1,4.01,32,null,0,236,null,32,62,203,438]
[null,null,"2007-05-01",57890,133,null,null,null,null,null,null,4,33,33,211,null,4,1,4.01,33,null,0,237,null,33,63,208,444]
[null,null,"2007-05-01",67734,159,null,null,null,null,null,null,4,34,34,226,null,4,1,4.01,34,null,0,245,null,34,64,212,456]
[null,null,"2007-05-01",60752,118,null,null,null,null,null,null,5,35,35,233,null,5,0,5,35,null,0,241,null,35,65,227,467]
[null,null,"2007-05-01",83742,157,null,null,null,null,null,null,5,36,36,240,null,5,1,5.01,36,null,0,250,null,36,66,234,483]
[null,null,"2007-05-01",7413,211,null,null,null,null,null,null,5,37,37,242,null,5,1,5.01,37,null,0,250,null,37,67,241,490]
[null,null,"2007-05-01",8713,421,null,null,null,null,null,null,5,38,38,249,null,5,1,5.01,38,null,0,253,null,38,68,243,495]
[null,null,"2007-05-01",2114,482,null,null,null,null,null,null,5,39,39,256,null,5,1,5.01,39,null,0,251,null,39,69,250,500]
[null,null,"2007-05-01",15821,419,null,null,null,null,null,null,5,40,40,263,null,5,1,5.01,40,null,0,254,null,40,70,257,510]
[null,null,"2007-05-01",12611,259,null,null,null,null,null,null,5,41,41,269,null,5,1,5.01,41,null,0,255,null,41,71,264,518]
[null,null,"2007-05-01",22393,427,null,null,null,null,null,null,5,42,42,279,null,5,1,5.01,42,null,0,258,null,42,72,270,527]
[null,null,"2007-05-01",20834,290,null,null,null,null,null,null,6,43,43,286,null,6,0,6,43,null,0,256,null,43,73,280,535]
[null,null,"2007-05-01",40181,292,null,null,null,null,null,null,6,44,44,289,null,6,1,6.01,44,null,0,258,null,44,74,287,544]
[null,null,"2007-05-01",45541,478,null,null,null,null,null,null,6,45,45,298,null,6,1,6.01,45,null,0,264,null,45,75,290,553]
[null,null,"2007-05-01",61074,281,null,null,null,null,null,null,6,46,46,301,null,6,1,6.01,46,null,0,264,null,46,76,299,562]
[null,null,"2007-05-02",3372,26,null,null,null,null,null,null,6,47,47,310,null,6,1,6.01,47,null,0,267,null,47,77,302,568]
[null,null,"2007-05-02",15869,40,null,null,null,null,null,null,6,48,48,318,null,6,1,6.01,48,null,0,265,null,48,78,311,575]
[null,null,"2007-05-02",22587,42,null,null,null,null,null,null,7,49,49,325,null,7,0,7,49,null,0,265,null,49,79,319,583]
[null,null,"2007-05-02",34190,42,null,null,null,null,null,null,7,50,50,337,null,7,1,7.01,50,null,1,274,null,50,80,326,599]
[null,null,"2007-05-02",34374,31,null,null,null,null,null,null,7,51,51,348,null,7,1,7.01,51,null,0,272,null,51,81,338,609]
[null,null,"2007-05-02",48000,4,null,null,null,null,null,null,7,52,52,362,null,7,1,7.01,52,null,0,267,null,52,82,349,615]
[null,null,"2007-05-02",59531,7,null,null,null,null,null,null,7,53,53,370,null,7,1,7.01,53,null,0,268,null,53,83,363,630]
[null,null,"2007-05-02",54969,42,null,null,null,null,null,null,7,54,54,375,null,7,1,7.01,54,null,0,264,null,54,84,371,634]
[null,null,"2007-05-02",6102,92,null,null,null,null,null,null,7,55,55,382,null,7,1,7.01,55,null,0,269,null,55,85,376,644]
[null,null,"2007-05-02",2006,88,null,null,null,null,null,null,8,56,56,392,null,8,0,8,56,null,0,272,null,56,86,383,654]
[null,null,"2007-05-02",11215,85,null,null,null,null,null,null,8,57,57,401,null,8,1,8.01,57,null,0,269,null,57,87,393,661]
[null,null,"2007-05-02",14828,63,null,null,null,null,null,null,8,58,58,408,null,8,1,8.01,58,null,0,267,null,58,88,402,668]
[null,null,"2007-05-02",13306,52,null,null,null,null,null,null,8,59,59,411,null,8,1,8.01,59,null,0,268,null,59,89,409,676]
[null,null,"2007-05-02",11022,50,null,null,null,null,null,null,8,60,60,421,null,8,1,8.01,60,null,0,273,null,60,90,412,684]
[null,null,"2007-05-02",29565,55,null,null,null,null,null,null,8,61,61,432,null,8,1,8.01,61,null,0,270,null,61,91,422,691]
[null,null,"2007-05-02",23319,89,null,null,null,null,null,null,9,62,62,438,null,9,0,9,62,null,0,268,null,62,92,433,700]
[null,null,"2007-05-02",25474,66,null,null,null,null,null,null,9,63,63,444,null,9,1,9.01,63,null,0,270,null,63,93,439,708]
[null,null,"2007-05-02",22077,66,null,null,null,null,null,null,9,64,64,456,null,9,1,9.01,64,null,0,271,null,64,94,445,715]
[null,null,"2007-05-02",32793,67,null,null,null,null,null,null,9,65,65,467,null,9,1,9.01,65,null,{"$f":"IF(W70=MAX($W$6:$W$1340),1,0)","v":0},269,null,65,95,457,725]
[null,null,"2007-05-02",58758,73,null,null,null,null,null,null,9,66,66,{"$f":"VLOOKUP(N71,$L$6:$M$1340,2,TRUE)","v":483},null,9,1,{"$f":"Q71+R71*0.01","v":9.01},66,null,0,{"$f":"AB71-AA71+1","v":265},null,66,{"$f":"Y71+$J$6","v":96},{"$f":"VLOOKUP(Y71,$S$6:$T$1340,2,TRUE)","v":468},{"$f":"VLOOKUP(Z71,$Q$6:$T$1340,4,TRUE)","v":732}]
[null,null,"2007-05-02",78133,67,null,null,null,null,null,null,9,67,67,490,null,9,{"$f":"IF(Q72=Q71,1,0)","v":1},9.01,67,null,0,253,null,67,97,484,736]
[null,null,"2007-05-02",82382,65,null,null,null,null,null,null,9,68,68,495,null,9,1,9.01,68,null,0,252,null,68,98,491,742]
[null,null,"2007-05-02",6273,151,null,null,null,null,null,null,9,69,69,500,null,9,1,9.01,69,null,0,255,null,69,99,496,750]
[null,null,"2007-05-02",806,106,null,null,null,null,null,null,10,70,70,510,null,10,0,10,70,null,0,261,null,70,100,501,761]
[null,null,"2007-05-02",7387,154,null,null,null,null,null,null,10,71,71,518,null,10,1,10.01,71,null,0,258,null,71,101,511,768]
[null,null,"2007-05-02",17894,179,null,null,null,null,null,null,10,72,72,527,null,10,1,10.01,72,null,0,254,null,72,102,519,772]
[null,null,"2007-05-02",10005,109,null,null,null,null,null,null,10,73,73,535,null,10,1,10.01,73,null,0,247,null,73,103,528,774]
[null,null,"2007-05-02",23535,171,null,null,null,null,null,null,10,74,74,544,null,10,1,10.01,74,null,0,241,null,74,104,536,776]
[null,null,"2007-05-02",23044,127,null,null,null,null,null,null,10,75,75,553,null,10,1,10.01,75,null,0,239,null,75,105,545,783]
[null,null,"2007-05-02",27025,131,null,null,null,null,null,null,10,76,76,562,null,10,1,10.01,76,null,0,236,null,76,106,554,789]
[null,null,"2007-05-02",38456,169,null,null,null,null,null,null,10,77,77,568,null,10,1,10.01,77,null,0,230,null,77,107,563,792]
[null,null,"2007-05-02",39953,155,null,null,null,null,null,null,11,78,78,575,null,11,0,11,78,null,0,229,null,78,108,569,797]
[null,null,"2007-05-02",51963,101,null,null,null,null,null,null,11,79,79,583,null,11,1,11.01,79,null,0,225,null,79,109,576,800]
[null,null,"2007-05-02",67329,126,null,null,null,null,null,null,11,80,80,599,null,11,1,11.01,80,null,0,218,null,80,110,584,801]
[null,null,"2007-05-02",3923,290,null,null,null,null,null,null,11,81,81,609,null,11,1,11.01,81,null,0,207,null,81,111,600,806]
[null,null,"2007-05-02",14355,437,null,null,null,null,null,null,11,82,82,615,null,11,1,11.01,82,null,0,201,null,82,112,610,810]
[null,null,"2007-05-02",14259,489,null,null,null,null,null,null,11,83,83,630,null,11,1,11.01,83,null,0,196,null,83,113,616,811]
[null,null,"2007-05-02",28906,421,null,null,null,null,null,null,12,84,84,634,null,12,0,12,84,null,0,183,null,84,114,631,813]
[null,null,"2007-05-02",53927,402,null,null,null,null,null,null,12,85,85,644,null,12,1,12.01,85,null,0,181,null,85,115,635,815]
[null,null,"2007-05-03",2353,26,null,null,null,null,null,null,12,86,86,654,null,12,1,12.01,86,null,0,173,null,86,116,645,817]
[null,null,"2007-05-03",48,20,null,null,null,null,null,null,12,87,87,661,null,12,1,12.01,87,null,0,166,null,87,117,655,820]
[null,null,"2007-05-03",3876,38,null,null,null,null,null,null,12,88,88,668,null,12,1,12.01,88,null,0,163,null,88,118,662,824]
[null,null,"2007-05-03",18149,5,null,null,null,null,null,null,12,89,89,676,null,12,1,12.01,89,null,0,158,null,89,119,669,826]
[null,null,"2007-05-03",21219,28,null,null,null,null,null,null,12,90,90,684,null,12,1,12.01,90,null,0,157,null,90,120,677,833]
[null,null,"2007-05-03",27620,49,null,null,null,null,null,null,13,91,91,691,null,13,0,13,91,null,0,155,null,91,121,685,839]
[null,null,"2007-05-03",49110,31,null,null,null,null,null,null,13,92,92,700,null,13,1,13.01,92,null,0,150,null,92,122,692,841]
[null,null,"2007-05-03",44525,34,null,null,null,null,null,null,13,93,93,708,null,13,1,13.01,93,null,0,144,null,93,123,701,844]
[null,null,"2007-05-03",42290,34,null,null,null,null,null,null,13,94,94,715,null,13,1,13.01,94,null,0,138,null,94,124,709,846]
[null,null,"2007-05-03",60064,19,null,null,null,null,null,null,14,95,95,725,null,14,0,14,95,null,0,135,null,95,125,716,850]
[null,null,"2007-05-03",68709,34,null,null,null,null,null,null,14,96,96,732,null,14,1,14.01,96,null,0,130,null,96,126,726,855]
[null,null,"2007-05-03",62253,20,null,null,null,null,null,null,14,97,97,736,null,14,1,14.01,97,null,0,126,null,97,127,733,858]
[null,null,"2007-05-03",73546,38,null,null,null,null,null,null,14,98,98,742,null,14,1,14.01,98,null,0,129,null,98,128,737,865]
[null,null,"2007-05-03",81119,41,null,null,null,null,null,null,15,99,99,750,null,15,0,15,99,null,0,128,null,99,129,743,870]
[null,null,"2007-05-03",862,52,null,null,null,null,null,null,15,100,100,761,null,15,1,15.01,100,null,0,123,null,100,130,751,873]
[null,null,"2007-05-03",7517,95,null,null,null,null,null,null,15,101,101,768,null,15,1,15.01,101,null,0,118,null,101,131,762,879]
[null,null,"2007-05-03",6176,100,null,null,null,null,null,null,15,102,102,772,null,15,1,15.01,102,null,0,113,null,102,132,769,881]
[null,null,"2007-05-03",8269,64,null,null,null,null,null,null,15,103,103,774,null,15,1,15.01,103,null,0,113,null,103,133,773,885]
[null,null,"2007-05-03",17747,74,null,null,null,null,null,null,15,104,104,776,null,15,1,15.01,104,null,0,111,null,104,134,775,885]
[null,null,"2007-05-03",12919,52,null,null,null,null,null,null,16,105,105,783,null,16,0,16,105,null,0,114,null,105,135,777,890]
[null,null,"2007-05-03",10582,80,null,null,null,null,null,null,16,106,106,789,null,16,1,16.010000000000002,106,null,0,111,null,106,136,784,894]
[null,null,"2007-05-03",14784,59,null,null,null,null,null,null,16,107,107,792,null,16,1,16.010000000000002,107,null,0,107,null,107,137,790,896]
[null,null,"2007-05-03",18528,98,null,null,null,null,null,null,17,108,108,797,null,17,0,17,108,null,0,109,null,108,138,793,901]
[null,null,"2007-05-03",26479,62,null,null,null,null,null,null,17,109,109,800,null,17,1,17.010000000000002,109,null,0,110,null,109,139,798,907]
[null,null,"2007-05-03",29176,65,null,null,null,null,null,null,17,110,110,801,null,17,1,17.010000000000002,110,null,0,113,null,110,140,801,913]
[null,null,"2007-05-03",38515,68,null,null,null,null,null,null,17,111,111,806,null,17,1,17.010000000000002,111,null,0,115,null,111,141,802,916]
[null,null,"2007-05-03",35423,85,null,null,null,null,null,null,17,112,112,810,null,17,1,17.010000000000002,112,null,0,114,null,112,142,807,920]
[null,null,"2007-05-03",43024,89,null,null,null,null,null,null,18,113,113,811,null,18,0,18,113,null,0,114,null,113,143,811,924]
[null,null,"2007-05-03",49904,66,null,null,null,null,null,null,18,114,114,813,null,18,1,18.010000000000002,114,null,0,117,null,114,144,812,928]
[null,null,"2007-05-03",62647,99,null,null,null,null,null,null,18,115,115,815,null,18,1,18.010000000000002,115,null,0,116,null,115,145,814,929]
[null,null,"2007-05-03",60749,93,null,null,null,null,null,null,18,116,116,817,null,18,1,18.010000000000002,116,null,0,118,null,116,146,816,933]
[null,null,"2007-05-03",79107,60,null,null,null,null,null,null,18,117,117,820,null,18,1,18.010000000000002,117,null,0,125,null,117,147,818,942]
[null,null,"2007-05-03",4663,121,null,null,null,null,null,null,18,118,118,824,null,18,1,18.010000000000002,118,null,0,124,null,118,148,821,944]
[null,null,"2007-05-03",2053,114,null,null,null,null,null,null,18,119,119,826,null,18,1,18.010000000000002,119,null,0,122,null,119,149,825,946]
[null,null,"2007-05-03",13965,103,null,null,null,null,null,null,19,120,120,833,null,19,0,19,120,null,0,126,null,120,150,827,952]
[null,null,"2007-05-03",15616,138,null,null,null,null,null,null,19,121,121,839,null,19,1,19.010000000000002,121,null,0,121,null,121,151,834,954]
[null,null,"2007-05-03",17341,120,null,null,null,null,null,null,19,122,122,841,null,19,1,19.010000000000002,122,null,0,119,null,122,152,840,958]
[null,null,"2007-05-03",11823,139,null,null,null,null,null,null,19,123,123,844,null,19,1,19.010000000000002,123,null,0,119,null,123,153,842,960]
[null,null,"2007-05-03",17612,160,null,null,null,null,null,null,19,124,124,846,null,19,1,19.010000000000002,124,null,0,119,null,124,154,845,963]
[null,null,"2007-05-03",21532,154,null,null,null,null,null,null,19,125,125,850,null,19,1,19.010000000000002,125,null,0,121,null,125,155,847,967]
[null,null,"2007-05-03",20059,192,null,null,null,null,null,null,19,126,126,855,null,19,1,19.010000000000002,126,null,0,119,null,126,156,851,969]
[null,null,"2007-05-03",38200,140,null,null,null,null,null,null,19,127,127,858,null,19,1,19.010000000000002,127,null,0,120,null,127,157,856,975]
[null,null,"2007-05-03",35997,107,null,null,null,null,null,null,19,128,128,865,null,19,1,19.010000000000002,128,null,0,118,null,128,158,859,976]
[null,null,"2007-05-03",42672,177,null,null,null,null,null,null,19,129,129,870,null,19,1,19.010000000000002,129,null,{"$f":"IF(W134=MAX($W$6:$W$1340),1,0)","v":0},118,null,129,159,866,983]
[null,null,"2007-05-03",3042,202,null,null,null,null,null,null,19,130,130,{"$f":"VLOOKUP(N135,$L$6:$M$1340,2,TRUE)","v":873},null,19,1,{"$f":"Q135+R135*0.01","v":19.010000000000002},130,null,0,{"$f":"AB135-AA135+1","v":117},null,130,{"$f":"Y135+$J$6","v":160},{"$f":"VLOOKUP(Y135,$S$6:$T$1340,2,TRUE)","v":871},{"$f":"VLOOKUP(Z135,$Q$6:$T$1340,4,TRUE)","v":987}]
[null,null,"2007-05-03",5254,201,null,null,null,null,null,null,20,131,131,879,null,20,{"$f":"IF(Q136=Q135,1,0)","v":0},20,131,null,0,120,null,131,161,874,993]
[null,null,"2007-05-03",1115,204,null,null,null,null,null,null,20,132,132,881,null,20,1,20.010000000000002,132,null,0,117,null,132,162,880,996]
[null,null,"2007-05-03",16627,400,null,null,null,null,null,null,20,133,133,885,null,20,1,20.010000000000002,133,null,0,117,null,133,163,882,998]
[null,null,"2007-05-03",17772,383,null,null,null,null,null,null,20,134,134,885,null,20,1,20.010000000000002,134,null,0,115,null,134,164,885,999]
[null,null,"2007-05-03",15195,488,null,null,null,null,null,null,20,135,135,890,null,20,1,20.010000000000002,135,null,0,117,null,135,165,886,1002]
[null,null,"2007-05-03",40079,428,null,null,null,null,null,null,20,136,136,894,null,20,1,20.010000000000002,136,null,0,112,null,136,166,891,1002]
[null,null,"2007-05-03",44875,477,null,null,null,null,null,null,21,137,137,896,null,21,0,21,137,null,0,111,null,137,167,895,1005]
[null,null,"2007-05-04",1281,41,null,null,null,null,null,null,21,138,138,901,null,21,1,21.01,138,null,0,113,null,138,168,897,1009]
[null,null,"2007-05-04",12060,43,null,null,null,null,null,null,21,139,139,907,null,21,1,21.01,139,null,0,115,null,139,169,902,1016]
[null,null,"2007-05-04",12685,6,null,null,null,null,null,null,21,140,140,913,null,21,1,21.01,140,null,0,111,null,140,170,908,1018]
[null,null,"2007-05-04",12164,49,null,null,null,null,null,null,22,141,141,916,null,22,0,22,141,null,0,109,null,141,171,914,1022]
[null,null,"2007-05-04",25964,43,null,null,null,null,null,null,22,142,142,920,null,22,1,22.01,142,null,0,109,null,142,172,917,1025]
[null,null,"2007-05-04",21925,24,null,null,null,null,null,null,22,143,143,924,null,22,1,22.01,143,null,0,109,null,143,173,921,1029]
[null,null,"2007-05-04",25046,16,null,null,null,null,null,null,22,144,144,928,null,22,1,22.01,144,null,0,108,null,144,174,925,1032]
[null,null,"2007-05-04",49041,45,null,null,null,null,null,null,22,145,145,929,null,22,1,22.01,145,null,0,110,null,145,175,929,1038]
[null,null,"2007-05-04",62277,27,null,null,null,null,null,null,22,146,146,933,null,22,1,22.01,146,null,0,114,null,146,176,930,1043]
[null,null,"2007-05-04",83356,42,null,null,null,null,null,null,22,147,147,942,null,22,1,22.01,147,null,0,115,null,147,177,934,1048]
[null,null,"2007-05-04",96325,36,null,null,null,null,null,null,22,148,148,944,null,22,1,22.01,148,null,0,108,null,148,178,943,1050]
[null,null,"2007-05-04",3711,60,null,null,null,null,null,null,22,149,149,946,null,22,1,22.01,149,null,0,111,null,149,179,945,1055]
[null,null,"2007-05-04",526,58,null,null,null,null,null,null,23,150,150,952,null,23,0,23,150,null,0,113,null,150,180,947,1059]
[null,null,"2007-05-04",9993,71,null,null,null,null,null,null,23,151,151,954,null,23,1,23.01,151,null,0,109,null,151,181,953,1061]
[null,null,"2007-05-04",9729,85,null,null,null,null,null,null,23,152,152,958,null,23,1,23.01,152,null,0,109,null,152,182,955,1063]
[null,null,"2007-05-04",6171,86,null,null,null,null,null,null,23,153,153,960,null,23,1,23.01,153,null,0,110,null,153,183,959,1068]
[null,null,"2007-05-04",18658,90,null,null,null,null,null,null,23,154,154,963,null,23,1,23.01,154,null,0,114,null,154,184,961,1074]
[null,null,"2007-05-04",24413,93,null,null,null,null,null,null,23,155,155,967,null,23,1,23.01,155,null,0,114,null,155,185,964,1077]
[null,null,"2007-05-04",39583,79,null,null,null,null,null,null,23,156,156,969,null,23,1,23.01,156,null,0,114,null,156,186,968,1081]
[null,null,"2007-05-04",32728,64,null,null,null,null,null,null,24,157,157,975,null,24,0,24,157,null,0,114,null,157,187,970,1083]
[null,null,"2007-05-04",39771,57,null,null,null,null,null,null,24,158,158,976,null,24,1,24.01,158,null,0,110,null,158,188,976,1085]
[null,null,"2007-05-04",35593,53,null,null,null,null,null,null,24,159,159,983,null,24,1,24.01,159,null,0,109,null,159,189,977,1085]
[null,null,"2007-05-04",69830,69,null,null,null,null,null,null,25,160,160,987,null,25,0,25,160,null,0,106,null,160,190,984,1089]
[null,null,"2007-05-04",65106,60,null,null,null,null,null,null,25,161,161,993,null,25,1,25.01,161,null,0,102,null,161,191,988,1089]
[null,null,"2007-05-04",62244,63,null,null,null,null,null,null,25,162,162,996,null,25,1,25.01,162,null,0,99,null,162,192,994,1092]
[null,null,"2007-05-04",69965,88,null,null,null,null,null,null,25,163,163,998,null,25,1,25.01,163,null,0,102,null,163,193,997,1098]
[null,null,"2007-05-04",8590,127,null,null,null,null,null,null,25,164,164,999,null,25,1,25.01,164,null,0,101,null,164,194,999,1099]
[null,null,"2007-05-04",10440,155,null,null,null,null,null,null,25,165,165,1002,null,25,1,25.01,165,null,0,104,null,165,195,1000,1103]
[null,null,"2007-05-04",14661,183,null,null,null,null,null,null,25,166,166,1002,null,25,1,25.01,166,null,0,105,null,166,196,1002,1106]
[null,null,"2007-05-04",16859,131,null,null,null,null,null,null,25,167,167,1005,null,25,1,25.01,167,null,0,106,null,167,197,1003,1108]
[null,null,"2007-05-04",19475,133,null,null,null,null,null,null,26,168,168,1009,null,26,0,26,168,null,0,106,null,168,198,1006,1111]
[null,null,"2007-05-04",22580,106,null,null,null,null,null,null,26,169,169,1016,null,26,1,26.01,169,null,0,105,null,169,199,1010,1114]
[null,null,"2007-05-04",29118,174,null,null,null,null,null,null,26,170,170,1018,null,26,1,26.01,170,null,0,103,null,170,200,1017,1119]
[null,null,"2007-05-04",22910,181,null,null,null,null,null,null,26,171,171,1022,null,26,1,26.01,171,null,0,102,null,171,201,1019,1120]
[null,null,"2007-05-04",27816,147,null,null,null,null,null,null,26,172,172,1025,null,26,1,26.01,172,null,0,99,null,172,202,1023,1121]
[null,null,"2007-05-04",30737,185,null,null,null,null,null,null,26,173,173,1029,null,26,1,26.01,173,null,0,96,null,173,203,1026,1121]
[null,null,"2007-05-04",39398,106,null,null,null,null,null,null,26,174,174,1032,null,26,1,26.01,174,null,0,93,null,174,204,1030,1122]
[null,null,"2007-05-04",31722,100,null,null,null,null,null,null,26,175,175,1038,null,26,1,26.01,175,null,0,91,null,175,205,1033,1123]
[null,null,"2007-05-04",40886,104,null,null,null,null,null,null,27,176,176,1043,null,27,0,27,176,null,0,85,null,176,206,1039,1123]
[null,null,"2007-05-04",45873,193,null,null,null,null,null,null,27,177,177,1048,null,27,1,27.01,177,null,0,80,null,177,207,1044,1123]
[null,null,"2007-05-04",51749,140,null,null,null,null,null,null,27,178,178,1050,null,27,1,27.01,178,null,0,77,null,178,208,1049,1125]
[null,null,"2007-05-04",67195,172,null,null,null,null,null,null,27,179,179,1055,null,27,1,27.01,179,null,0,76,null,179,209,1051,1126]
[null,null,"2007-05-04",66540,184,null,null,null,null,null,null,27,180,180,1059,null,27,1,27.01,180,null,0,71,null,180,210,1056,1126]
[null,null,"2007-05-04",80131,190,null,null,null,null,null,null,27,181,181,1061,null,27,1,27.01,181,null,0,70,null,181,211,1060,1129]
[null,null,"2007-05-04",84616,192,null,null,null,null,null,null,27,182,182,1063,null,27,1,27.01,182,null,0,68,null,182,212,1062,1129]
[null,null,"2007-05-04",5541,488,null,null,null,null,null,null,27,183,183,1068,null,27,1,27.01,183,null,0,67,null,183,213,1064,1130]
[null,null,"2007-05-04",9834,473,null,null,null,null,null,null,28,184,184,1074,null,28,0,28,184,null,0,62,null,184,214,1069,1130]
[null,null,"2007-05-04",17974,428,null,null,null,null,null,null,28,185,185,1077,null,28,1,28.01,185,null,0,56,null,185,215,1075,1130]
[null,null,"2007-05-04",14602,315,null,null,null,null,null,null,28,186,186,1081,null,28,1,28.01,186,null,0,54,null,186,216,1078,1131]
[null,null,"2007-05-04",13667,441,null,null,null,null,null,null,28,187,187,1083,null,28,1,28.01,187,null,0,50,null,187,217,1082,1131]
[null,null,"2007-05-04",29499,398,null,null,null,null,null,null,28,188,188,1085,null,28,1,28.01,188,null,0,51,null,188,218,1084,1134]
[null,null,"2007-05-04",26651,408,null,null,null,null,null,null,28,189,189,1085,null,28,1,28.01,189,null,0,52,null,189,219,1085,1136]
[null,null,"2007-05-04",21176,497,null,null,null,null,null,null,29,190,190,1089,null,29,0,29,190,null,0,51,null,190,220,1086,1136]
[null,null,"2007-05-04",38365,258,null,null,null,null,null,null,29,191,191,1089,null,29,1,29.01,191,null,0,49,null,191,221,1089,1137]
[null,null,"2007-05-04",48340,216,null,null,null,null,null,null,29,192,192,1092,null,29,1,29.01,192,null,0,48,null,192,222,1090,1137]
[null,null,"2007-05-05",7657,42,null,null,null,null,null,null,29,193,193,1098,null,29,1,29.01,193,null,{"$f":"IF(W198=MAX($W$6:$W$1340),1,0)","v":0},45,null,193,223,1093,1137]
[null,null,"2007-05-05",18841,48,null,null,null,null,null,null,29,194,194,{"$f":"VLOOKUP(N199,$L$6:$M$1340,2,TRUE)","v":1099},null,29,1,{"$f":"Q199+R199*0.01","v":29.01},194,null,0,{"$f":"AB199-AA199+1","v":40},null,194,{"$f":"Y199+$J$6","v":224},{"$f":"VLOOKUP(Y199,$S$6:$T$1340,2,TRUE)","v":1099},{"$f":"VLOOKUP(Z199,$Q$6:$T$1340,4,TRUE)","v":1138}]
[null,null,"2007-05-05",14110,12,null,null,null,null,null,null,29,195,195,1103,null,29,{"$f":"IF(Q200=Q199,1,0)","v":1},29.01,195,null,0,40,null,195,225,1100,1139]
[null,null,"2007-05-05",21057,43,null,null,null,null,null,null,30,196,196,1106,null,30,0,30,196,null,0,37,null,196,226,1104,1140]
[null,null,"2007-05-05",26926,17,null,null,null,null,null,null,30,197,197,1108,null,30,1,30.01,197,null,0,36,null,197,227,1107,1142]
[null,null,"2007-05-05",24935,3,null,null,null,null,null,null,30,198,198,1111,null,30,1,30.01,198,null,0,35,null,198,228,1109,1143]
[null,null,"2007-05-05",36848,3,null,null,null,null,null,null,31,199,199,1114,null,31,0,31,199,null,0,33,null,199,229,1112,1144]
[null,null,"2007-05-05",34232,47,null,null,null,null,null,null,31,200,200,1119,null,31,1,31.01,200,null,0,30,null,200,230,1115,1144]
[null,null,"2007-05-05",46537,19,null,null,null,null,null,null,31,201,201,1120,null,31,1,31.01,201,null,0,26,null,201,231,1120,1145]
[null,null,"2007-05-05",72647,1,null,null,null,null,null,null,31,202,202,1121,null,31,1,31.01,202,null,0,25,null,202,232,1121,1145]
[null,null,"2007-05-05",1336,80,null,null,null,null,null,null,32,203,203,1121,null,32,0,32,203,null,0,26,null,203,233,1121,1146]
[null,null,"2007-05-05",32,57,null,null,null,null,null,null,32,204,204,1122,null,32,1,32.01,204,null,0,27,null,204,234,1122,1148]
[null,null,"2007-05-05",10027,54,null,null,null,null,null,null,32,205,205,1123,null,32,1,32.01,205,null,0,26,null,205,235,1123,1148]
[null,null,"2007-05-05",19728,87,null,null,null,null,null,null,32,206,206,1123,null,32,1,32.01,206,null,0,27,null,206,236,1123,1149]
[null,null,"2007-05-05",28235,56,null,null,null,null,null,null,32,207,207,1123,null,32,1,32.01,207,null,0,28,null,207,237,1123,1150]
[null,null,"2007-05-05",29644,78,null,null,null,null,null,null,33,208,208,1125,null,33,0,33,208,null,0,27,null,208,238,1124,1150]
[null,null,"2007-05-05",42517,58,null,null,null,null,null,null,33,209,209,1126,null,33,1,33.01,209,null,0,26,null,209,239,1126,1151]
[null,null,"2007-05-05",43620,58,null,null,null,null,null,null,33,210,210,1126,null,33,1,33.01,210,null,0,26,null,210,240,1126,1151]
[null,null,"2007-05-05",52962,67,null,null,null,null,null,null,33,211,211,1129,null,33,1,33.01,211,null,0,26,null,211,241,1127,1152]
[null,null,"2007-05-05",4427,141,null,null,null,null,null,null,34,212,212,1129,null,34,0,34,212,null,0,24,null,212,242,1129,1152]
[null,null,"2007-05-05",25273,162,null,null,null,null,null,null,34,213,213,1130,null,34,1,34.01,213,null,0,23,null,213,243,1130,1152]
[null,null,"2007-05-05",28362,117,null,null,null,null,null,null,34,214,214,1130,null,34,1,34.01,214,null,0,23,null,214,244,1130,1152]
[null,null,"2007-05-05",22091,131,null,null,null,null,null,null,34,215,215,1130,null,34,1,34.01,215,null,0,24,null,215,245,1130,1153]
[null,null,"2007-05-05",57733,198,null,null,null,null,null,null,34,216,216,1131,null,34,1,34.01,216,null,0,23,null,216,246,1131,1153]
[null,null,"2007-05-05",4502,256,null,null,null,null,null,null,34,217,217,1131,null,34,1,34.01,217,null,0,23,null,217,247,1131,1153]
[null,null,"2007-05-05",13178,208,null,null,null,null,null,null,34,218,218,1134,null,34,1,34.01,218,null,0,22,null,218,248,1132,1153]
[null,null,"2007-05-05",18418,495,null,null,null,null,null,null,34,219,219,1136,null,34,1,34.01,219,null,0,19,null,219,249,1135,1153]
[null,null,"2007-05-05",45437,331,null,null,null,null,null,null,34,220,220,1136,null,34,1,34.01,220,null,0,18,null,220,250,1136,1153]
[null,null,"2007-05-06",6294,29,null,null,null,null,null,null,34,221,221,1137,null,34,1,34.01,221,null,0,17,null,221,251,1137,1153]
[null,null,"2007-05-06",4937,9,null,null,null,null,null,null,34,222,222,1137,null,34,1,34.01,222,null,0,18,null,222,252,1137,1154]
[null,null,"2007-05-06",12227,23,null,null,null,null,null,null,34,223,223,1137,null,34,1,34.01,223,null,0,19,null,223,253,1137,1155]
[null,null,"2007-05-06",16986,2,null,null,null,null,null,null,34,224,224,1138,null,34,1,34.01,224,null,0,18,null,224,254,1138,1155]
[null,null,"2007-05-06",15947,27,null,null,null,null,null,null,34,225,225,1139,null,34,1,34.01,225,null,0,17,null,225,255,1139,1155]
[null,null,"2007-05-06",19245,35,null,null,null,null,null,null,34,226,226,1140,null,34,1,34.01,226,null,0,17,null,226,256,1140,1156]
[null,null,"2007-05-06",22187,1,null,null,null,null,null,null,35,227,227,1142,null,35,0,35,227,null,0,16,null,227,257,1141,1156]
[null,null,"2007-05-06",26240,38,null,null,null,null,null,null,35,228,228,1143,null,35,1,35.01,228,null,0,16,null,228,258,1143,1158]
[null,null,"2007-05-06",28619,10,null,null,null,null,null,null,35,229,229,1144,null,35,1,35.01,229,null,0,17,null,229,259,1144,1160]
[null,null,"2007-05-06",22714,23,null,null,null,null,null,null,35,230,230,1144,null,35,1,35.01,230,null,0,17,null,230,260,1144,1160]
[null,null,"2007-05-06",39353,1,null,null,null,null,null,null,35,231,231,1145,null,35,1,35.01,231,null,0,16,null,231,261,1145,1160]
[null,null,"2007-05-06",50283,25,null,null,null,null,null,null,35,232,232,1145,null,35,1,35.01,232,null,0,16,null,232,262,1145,1160]
[null,null,"2007-05-06",93057,35,null,null,null,null,null,null,35,233,233,1146,null,35,1,35.01,233,null,0,15,null,233,263,1146,1160]
[null,null,"2007-05-06",7886,72,null,null,null,null,null,null,36,234,234,1148,null,36,0,36,234,null,0,15,null,234,264,1147,1161]
[null,null,"2007-05-06",18856,74,null,null,null,null,null,null,36,235,235,1148,null,36,1,36.01,235,null,0,14,null,235,265,1148,1161]
[null,null,"2007-05-06",10213,61,null,null,null,null,null,null,36,236,236,1149,null,36,1,36.01,236,null,0,14,null,236,266,1149,1162]
[null,null,"2007-05-06",13896,82,null,null,null,null,null,null,36,237,237,1150,null,36,1,36.01,237,null,0,15,null,237,267,1150,1164]
[null,null,"2007-05-06",26910,70,null,null,null,null,null,null,36,238,238,1150,null,36,1,36.01,238,null,0,15,null,238,268,1150,1164]
[null,null,"2007-05-06",27725,61,null,null,null,null,null,null,36,239,239,1151,null,36,1,36.01,239,null,0,14,null,239,269,1151,1164]
[null,null,"2007-05-06",20071,80,null,null,null,null,null,null,36,240,240,1151,null,36,1,36.01,240,null,0,15,null,240,270,1151,1165]
[null,null,"2007-05-06",23522,64,null,null,null,null,null,null,37,241,241,1152,null,37,0,37,241,null,0,14,null,241,271,1152,1165]
[null,null,"2007-05-06",28509,55,null,null,null,null,null,null,37,242,242,1152,null,37,1,37.01,242,null,0,14,null,242,272,1152,1165]
[null,null,"2007-05-06",26532,97,null,null,null,null,null,null,38,243,243,1152,null,38,0,38,243,null,0,14,null,243,273,1152,1165]
[null,null,"2007-05-06",36842,86,null,null,null,null,null,null,38,244,244,1152,null,38,1,38.01,244,null,0,14,null,244,274,1152,1165]
[null,null,"2007-05-06",47079,100,null,null,null,null,null,null,38,245,245,1153,null,38,1,38.01,245,null,0,14,null,245,275,1153,1166]
[null,null,"2007-05-06",54538,80,null,null,null,null,null,null,38,246,246,1153,null,38,1,38.01,246,null,0,14,null,246,276,1153,1166]
[null,null,"2007-05-06",74767,50,null,null,null,null,null,null,38,247,247,1153,null,38,1,38.01,247,null,0,14,null,247,277,1153,1166]
[null,null,"2007-05-06",78701,83,null,null,null,null,null,null,38,248,248,1153,null,38,1,38.01,248,null,0,15,null,248,278,1153,1167]
[null,null,"2007-05-06",1122,182,null,null,null,null,null,null,38,249,249,1153,null,38,1,38.01,249,null,0,17,null,249,279,1153,1169]
[null,null,"2007-05-06",11256,175,null,null,null,null,null,null,39,250,250,1153,null,39,0,39,250,null,0,18,null,250,280,1153,1170]
[null,null,"2007-05-06",17731,169,null,null,null,null,null,null,39,251,251,1153,null,39,1,39.01,251,null,0,19,null,251,281,1153,1171]
[null,null,"2007-05-06",12750,184,null,null,null,null,null,null,39,252,252,1154,null,39,1,39.01,252,null,0,19,null,252,282,1154,1172]
[null,null,"2007-05-06",13622,140,null,null,null,null,null,null,39,253,253,1155,null,39,1,39.01,253,null,0,18,null,253,283,1155,1172]
[null,null,"2007-05-06",14263,167,null,null,null,null,null,null,39,254,254,1155,null,39,1,39.01,254,null,0,18,null,254,284,1155,1172]
[null,null,"2007-05-06",13799,186,null,null,null,null,null,null,39,255,255,1155,null,39,1,39.01,255,null,0,19,null,255,285,1155,1173]
[null,null,"2007-05-06",20672,161,null,null,null,null,null,null,39,256,256,1156,null,39,1,39.01,256,null,0,19,null,256,286,1156,1174]
[null,null,"2007-05-06",31445,106,null,null,null,null,null,null,40,257,257,1156,null,40,0,40,257,null,{"$f":"IF(W262=MAX($W$6:$W$1340),1,0)","v":0},20,null,257,287,1156,1175]
[null,null,"2007-05-06",48157,159,null,null,null,null,null,null,40,258,258,{"$f":"VLOOKUP(N263,$L$6:$M$1340,2,TRUE)","v":1158},null,40,1,{"$f":"Q263+R263*0.01","v":40.01},258,null,0,{"$f":"AB263-AA263+1","v":20},null,258,{"$f":"Y263+$J$6","v":288},{"$f":"VLOOKUP(Y263,$S$6:$T$1340,2,TRUE)","v":1157},{"$f":"VLOOKUP(Z263,$Q$6:$T$1340,4,TRUE)","v":1176}]
[null,null,"2007-05-06",68891,106,null,null,null,null,null,null,40,259,259,1160,null,40,{"$f":"IF(Q264=Q263,1,0)","v":1},40.01,259,null,0,19,null,259,289,1159,1177]
[null,null,"2007-05-06",6063,420,null,null,null,null,null,null,40,260,260,1160,null,40,1,40.01,260,null,0,21,null,260,290,1160,1180]
[null,null,"2007-05-06",12672,376,null,null,null,null,null,null,40,261,261,1160,null,40,1,40.01,261,null,0,22,null,261,291,1160,1181]
[null,null,"2007-05-06",14378,494,null,null,null,null,null,null,40,262,262,1160,null,40,1,40.01,262,null,0,23,null,262,292,1160,1182]
[null,null,"2007-05-06",19454,309,null,null,null,null,null,null,40,263,263,1160,null,40,1,40.01,263,null,0,23,null,263,293,1160,1182]
[null,null,"2007-05-06",24452,287,null,null,null,null,null,null,41,264,264,1161,null,41,0,41,264,null,0,22,null,264,294,1161,1182]
[null,null,"2007-05-06",26195,295,null,null,null,null,null,null,41,265,265,1161,null,41,1,41.01,265,null,0,24,null,265,295,1161,1184]
[null,null,"2007-05-06",60607,231,null,null,null,null,null,null,41,266,266,1162,null,41,1,41.01,266,null,0,24,null,266,296,1162,1185]
[null,null,"2007-05-07",7771,40,null,null,null,null,null,null,41,267,267,1164,null,41,1,41.01,267,null,0,23,null,267,297,1163,1185]
[null,null,"2007-05-07",1394,36,null,null,null,null,null,null,41,268,268,1164,null,41,1,41.01,268,null,0,22,null,268,298,1164,1185]
[null,null,"2007-05-07",352,6,null,null,null,null,null,null,41,269,269,1164,null,41,1,41.01,269,null,0,22,null,269,299,1164,1185]
[null,null,"2007-05-07",19466,3,null,null,null,null,null,null,42,270,270,1165,null,42,0,42,270,null,0,22,null,270,300,1165,1186]
[null,null,"2007-05-07",26607,49,null,null,null,null,null,null,42,271,271,1165,null,42,1,42.01,271,null,0,23,null,271,301,1165,1187]
[null,null,"2007-05-07",23374,45,null,null,null,null,null,null,42,272,272,1165,null,42,1,42.01,272,null,0,24,null,272,302,1165,1188]
[null,null,"2007-05-07",22902,14,null,null,null,null,null,null,42,273,273,1165,null,42,1,42.01,273,null,0,24,null,273,303,1165,1188]
[null,null,"2007-05-07",26674,49,null,null,null,null,null,null,42,274,274,1165,null,42,1,42.01,274,null,0,24,null,274,304,1165,1188]
[null,null,"2007-05-07",45586,33,null,null,null,null,null,null,42,275,275,1166,null,42,1,42.01,275,null,0,24,null,275,305,1166,1189]
[null,null,"2007-05-07",60908,26,null,null,null,null,null,null,42,276,276,1166,null,42,1,42.01,276,null,0,24,null,276,306,1166,1189]
[null,null,"2007-05-07",433,57,null,null,null,null,null,null,42,277,277,1166,null,42,1,42.01,277,null,0,26,null,277,307,1166,1191]
[null,null,"2007-05-07",19559,90,null,null,null,null,null,null,42,278,278,1167,null,42,1,42.01,278,null,0,27,null,278,308,1167,1193]
[null,null,"2007-05-07",10637,80,null,null,null,null,null,null,42,279,279,1169,null,42,1,42.01,279,null,0,27,null,279,309,1168,1194]
[null,null,"2007-05-07",14125,91,null,null,null,null,null,null,43,280,280,1170,null,43,0,43,280,null,0,25,null,280,310,1170,1194]
[null,null,"2007-05-07",13368,92,null,null,null,null,null,null,43,281,281,1171,null,43,1,43.01,281,null,0,25,null,281,311,1171,1195]
[null,null,"2007-05-07",10443,65,null,null,null,null,null,null,43,282,282,1172,null,43,1,43.01,282,null,0,24,null,282,312,1172,1195]
[null,null,"2007-05-07",27481,75,null,null,null,null,null,null,43,283,283,1172,null,43,1,43.01,283,null,0,24,null,283,313,1172,1195]
[null,null,"2007-05-07",25838,51,null,null,null,null,null,null,43,284,284,1172,null,43,1,43.01,284,null,0,25,null,284,314,1172,1196]
[null,null,"2007-05-07",20179,75,null,null,null,null,null,null,43,285,285,1173,null,43,1,43.01,285,null,0,27,null,285,315,1173,1199]
[null,null,"2007-05-07",26303,66,null,null,null,null,null,null,43,286,286,1174,null,43,1,43.01,286,null,0,26,null,286,316,1174,1199]
[null,null,"2007-05-07",34203,80,null,null,null,null,null,null,44,287,287,1175,null,44,0,44,287,null,0,27,null,287,317,1175,1201]
[null,null,"2007-05-07",46274,52,null,null,null,null,null,null,44,288,288,1176,null,44,1,44.01,288,null,0,26,null,288,318,1176,1201]
[null,null,"2007-05-07",6726,163,null,null,null,null,null,null,44,289,289,1177,null,44,1,44.01,289,null,0,27,null,289,319,1177,1203]
[null,null,"2007-05-07",9863,136,null,null,null,null,null,null,45,290,290,1180,null,45,0,45,290,null,0,28,null,290,320,1178,1205]
[null,null,"2007-05-07",1125,152,null,null,null,null,null,null,45,291,291,1181,null,45,1,45.01,291,null,0,26,null,291,321,1181,1206]
[null,null,"2007-05-07",13731,129,null,null,null,null,null,null,45,292,292,1182,null,45,1,45.01,292,null,0,25,null,292,322,1182,1206]
[null,null,"2007-05-07",14395,188,null,null,null,null,null,null,45,293,293,1182,null,45,1,45.01,293,null,0,25,null,293,323,1182,1206]
[null,null,"2007-05-07",19450,175,null,null,null,null,null,null,45,294,294,1182,null,45,1,45.01,294,null,0,25,null,294,324,1182,1206]
[null,null,"2007-05-07",29952,152,null,null,null,null,null,null,45,295,295,1184,null,45,1,45.01,295,null,0,26,null,295,325,1183,1208]
[null,null,"2007-05-07",41882,190,null,null,null,null,null,null,45,296,296,1185,null,45,1,45.01,296,null,0,25,null,296,326,1185,1209]
[null,null,"2007-05-07",67579,105,null,null,null,null,null,null,45,297,297,1185,null,45,1,45.01,297,null,0,26,null,297,327,1185,1210]
[null,null,"2007-05-07",97488,120,null,null,null,null,null,null,45,298,298,1185,null,45,1,45.01,298,null,0,27,null,298,328,1185,1211]
[null,null,"2007-05-07",8389,333,null,null,null,null,null,null,46,299,299,1185,null,46,0,46,299,null,0,27,null,299,329,1185,1211]
[null,null,"2007-05-07",7619,259,null,null,null,null,null,null,46,300,300,1186,null,46,1,46.01,300,null,0,26,null,300,330,1186,1211]
[null,null,"2007-05-07",22763,236,null,null,null,null,null,null,46,301,301,1187,null,46,1,46.01,301,null,0,26,null,301,331,1187,1212]
[null,null,"2007-05-07",30802,319,null,null,null,null,null,null,47,302,302,1188,null,47,0,47,302,null,0,27,null,302,332,1188,1214]
[null,null,"2007-05-07",33703,377,null,null,null,null,null,null,47,303,303,1188,null,47,1,47.01,303,null,0,28,null,303,333,1188,1215]
[null,null,"2007-05-07",41783,334,null,null,null,null,null,null,47,304,304,1188,null,47,1,47.01,304,null,0,29,null,304,334,1188,1216]
[null,null,"2007-05-07",58905,295,null,null,null,null,null,null,47,305,305,1189,null,47,1,47.01,305,null,0,29,null,305,335,1189,1217]
[null,null,"2007-05-08",5275,23,null,null,null,null,null,null,47,306,306,1189,null,47,1,47.01,306,null,0,29,null,306,336,1189,1217]
[null,null,"2007-05-08",3643,22,null,null,null,null,null,null,47,307,307,1191,null,47,1,47.01,307,null,0,28,null,307,337,1190,1217]
[null,null,"2007-05-08",6729,3,null,null,null,null,null,null,47,308,308,1193,null,47,1,47.01,308,null,0,26,null,308,338,1192,1217]
[null,null,"2007-05-08",19595,26,null,null,null,null,null,null,47,309,309,1194,null,47,1,47.01,309,null,0,24,null,309,339,1194,1217]
[null,null,"2007-05-08",13324,43,null,null,null,null,null,null,47,310,310,1194,null,47,1,47.01,310,null,0,25,null,310,340,1194,1218]
[null,null,"2007-05-08",41364,2,null,null,null,null,null,null,48,311,311,1195,null,48,0,48,311,null,0,26,null,311,341,1195,1220]
[null,null,"2007-05-08",43974,42,null,null,null,null,null,null,48,312,312,1195,null,48,1,48.01,312,null,0,27,null,312,342,1195,1221]
[null,null,"2007-05-08",63788,45,null,null,null,null,null,null,48,313,313,1195,null,48,1,48.01,313,null,0,27,null,313,343,1195,1221]
[null,null,"2007-05-08",77240,35,null,null,null,null,null,null,48,314,314,1196,null,48,1,48.01,314,null,0,26,null,314,344,1196,1221]
[null,null,"2007-05-08",84359,44,null,null,null,null,null,null,48,315,315,1199,null,48,1,48.01,315,null,0,25,null,315,345,1197,1221]
[null,null,"2007-05-08",98082,8,null,null,null,null,null,null,48,316,316,1199,null,48,1,48.01,316,null,0,24,null,316,346,1199,1222]
[null,null,"2007-05-08",4837,52,null,null,null,null,null,null,48,317,317,1201,null,48,1,48.01,317,null,0,24,null,317,347,1200,1223]
[null,null,"2007-05-08",763,58,null,null,null,null,null,null,48,318,318,1201,null,48,1,48.01,318,null,0,23,null,318,348,1201,1223]
[null,null,"2007-05-08",9311,60,null,null,null,null,null,null,49,319,319,1203,null,49,0,49,319,null,0,23,null,319,349,1202,1224]
[null,null,"2007-05-08",16762,71,null,null,null,null,null,null,49,320,320,1205,null,49,1,49.01,320,null,0,21,null,320,350,1204,1224]
[null,null,"2007-05-08",13722,53,null,null,null,null,null,null,49,321,321,1206,null,49,1,49.01,321,null,{"$f":"IF(W326=MAX($W$6:$W$1340),1,0)","v":0},19,null,321,351,1206,1224]
[null,null,"2007-05-08",14981,89,null,null,null,null,null,null,49,322,322,{"$f":"VLOOKUP(N327,$L$6:$M$1340,2,TRUE)","v":1206},null,49,1,{"$f":"Q327+R327*0.01","v":49.01},322,null,0,{"$f":"AB327-AA327+1","v":20},null,322,{"$f":"Y327+$J$6","v":352},{"$f":"VLOOKUP(Y327,$S$6:$T$1340,2,TRUE)","v":1206},{"$f":"VLOOKUP(Z327,$Q$6:$T$1340,4,TRUE)","v":1225}]
[null,null,"2007-05-08",12993,68,null,null,null,null,null,null,49,323,323,1206,null,49,{"$f":"IF(Q328=Q327,1,0)","v":1},49.01,323,null,0,20,null,323,353,1206,1225]
[null,null,"2007-05-08",25989,84,null,null,null,null,null,null,49,324,324,1206,null,49,1,49.01,324,null,0,20,null,324,354,1206,1225]
[null,null,"2007-05-08",28133,62,null,null,null,null,null,null,49,325,325,1208,null,49,1,49.01,325,null,0,20,null,325,355,1207,1226]
[null,null,"2007-05-08",29257,74,null,null,null,null,null,null,50,326,326,1209,null,50,0,50,326,null,0,19,null,326,356,1209,1227]
[null,null,"2007-05-08",33448,95,null,null,null,null,null,null,50,327,327,1210,null,50,1,50.01,327,null,0,18,null,327,357,1210,1227]
[null,null,"2007-05-08",30319,77,null,null,null,null,null,null,50,328,328,1211,null,50,1,50.01,328,null,0,18,null,328,358,1211,1228]
[null,null,"2007-05-08",42376,70,null,null,null,null,null,null,50,329,329,1211,null,50,1,50.01,329,null,0,18,null,329,359,1211,1228]
[null,null,"2007-05-08",42173,97,null,null,null,null,null,null,50,330,330,1211,null,50,1,50.01,330,null,0,20,null,330,360,1211,1230]
[null,null,"2007-05-08",51520,74,null,null,null,null,null,null,50,331,331,1212,null,50,1,50.01,331,null,0,19,null,331,361,1212,1230]
[null,null,"2007-05-08",76654,94,null,null,null,null,null,null,50,332,332,1214,null,50,1,50.01,332,null,0,18,null,332,362,1213,1230]
[null,null,"2007-05-08",93224,89,null,null,null,null,null,null,50,333,333,1215,null,50,1,50.01,333,null,0,20,null,333,363,1215,1234]
[null,null,"2007-05-08",3137,196,null,null,null,null,null,null,50,334,334,1216,null,50,1,50.01,334,null,0,19,null,334,364,1216,1234]
[null,null,"2007-05-08",3843,136,null,null,null,null,null,null,50,335,335,1217,null,50,1,50.01,335,null,0,19,null,335,365,1217,1235]
[null,null,"2007-05-08",17985,197,null,null,null,null,null,null,50,336,336,1217,null,50,1,50.01,336,null,0,19,null,336,366,1217,1235]
[null,null,"2007-05-08",14730,147,null,null,null,null,null,null,50,337,337,1217,null,50,1,50.01,337,null,0,19,null,337,367,1217,1235]
[null,null,"2007-05-08",27992,150,null,null,null,null,null,null,51,338,338,1217,null,51,0,51,338,null,0,20,null,338,368,1217,1236]
[null,null,"2007-05-08",24976,165,null,null,null,null,null,null,51,339,339,1217,null,51,1,51.01,339,null,0,22,null,339,369,1217,1238]
[null,null,"2007-05-08",42289,172,null,null,null,null,null,null,51,340,340,1218,null,51,1,51.01,340,null,0,22,null,340,370,1218,1239]
[null,null,"2007-05-08",44075,196,null,null,null,null,null,null,51,341,341,1220,null,51,1,51.01,341,null,0,21,null,341,371,1219,1239]
[null,null,"2007-05-08",61802,183,null,null,null,null,null,null,51,342,342,1221,null,51,1,51.01,342,null,0,20,null,342,372,1221,1240]
[null,null,"2007-05-08",71993,150,null,null,null,null,null,null,51,343,343,1221,null,51,1,51.01,343,null,0,21,null,343,373,1221,1241]
[null,null,"2007-05-08",13033,300,null,null,null,null,null,null,51,344,344,1221,null,51,1,51.01,344,null,0,21,null,344,374,1221,1241]
[null,null,"2007-05-08",15659,445,null,null,null,null,null,null,51,345,345,1221,null,51,1,51.01,345,null,0,22,null,345,375,1221,1242]
[null,null,"2007-05-08",38778,234,null,null,null,null,null,null,51,346,346,1222,null,51,1,51.01,346,null,0,22,null,346,376,1222,1243]
[null,null,"2007-05-08",34971,370,null,null,null,null,null,null,51,347,347,1223,null,51,1,51.01,347,null,0,22,null,347,377,1223,1244]
[null,null,"2007-05-08",59255,403,null,null,null,null,null,null,51,348,348,1223,null,51,1,51.01,348,null,0,22,null,348,378,1223,1244]
[null,null,"2007-05-09",6207,49,null,null,null,null,null,null,52,349,349,1224,null,52,0,52,349,null,0,22,null,349,379,1224,1245]
[null,null,"2007-05-09",2670,1,null,null,null,null,null,null,52,350,350,1224,null,52,1,52.01,350,null,0,22,null,350,380,1224,1245]
[null,null,"2007-05-09",8284,40,null,null,null,null,null,null,52,351,351,1224,null,52,1,52.01,351,null,0,23,null,351,381,1224,1246]
[null,null,"2007-05-09",18899,14,null,null,null,null,null,null,52,352,352,1225,null,52,1,52.01,352,null,0,23,null,352,382,1225,1247]
[null,null,"2007-05-09",15200,7,null,null,null,null,null,null,52,353,353,1225,null,52,1,52.01,353,null,0,24,null,353,383,1225,1248]
[null,null,"2007-05-09",17155,46,null,null,null,null,null,null,52,354,354,1225,null,52,1,52.01,354,null,0,24,null,354,384,1225,1248]
[null,null,"2007-05-09",18891,13,null,null,null,null,null,null,52,355,355,1226,null,52,1,52.01,355,null,0,24,null,355,385,1226,1249]
[null,null,"2007-05-09",18210,24,null,null,null,null,null,null,52,356,356,1227,null,52,1,52.01,356,null,0,23,null,356,386,1227,1249]
[null,null,"2007-05-09",17059,6,null,null,null,null,null,null,52,357,357,1227,null,52,1,52.01,357,null,0,25,null,357,387,1227,1251]
[null,null,"2007-05-09",27858,26,null,null,null,null,null,null,52,358,358,1228,null,52,1,52.01,358,null,0,25,null,358,388,1228,1252]
[null,null,"2007-05-09",21742,48,null,null,null,null,null,null,52,359,359,1228,null,52,1,52.01,359,null,0,25,null,359,389,1228,1252]
[null,null,"2007-05-09",27137,12,null,null,null,null,null,null,52,360,360,1230,null,52,1,52.01,360,null,0,25,null,360,390,1229,1253]
[null,null,"2007-05-09",32084,10,null,null,null,null,null,null,52,361,361,1230,null,52,1,52.01,361,null,0,25,null,361,391,1230,1254]
[null,null,"2007-05-09",39290,3,null,null,null,null,null,null,52,362,362,1230,null,52,1,52.01,362,null,0,25,null,362,392,1230,1254]
[null,null,"2007-05-09",35804,49,null,null,null,null,null,null,53,363,363,1234,null,53,0,53,363,null,0,24,null,363,393,1231,1254]
[null,null,"2007-05-09",41373,19,null,null,null,null,null,null,53,364,364,1234,null,53,1,53.01,364,null,0,21,null,364,394,1234,1254]
[null,null,"2007-05-09",51677,7,null,null,null,null,null,null,53,365,365,1235,null,53,1,53.01,365,null,0,20,null,365,395,1235,1254]
[null,null,"2007-05-09",61308,26,null,null,null,null,null,null,53,366,366,1235,null,53,1,53.01,366,null,0,21,null,366,396,1235,1255]
[null,null,"2007-05-09",80762,42,null,null,null,null,null,null,53,367,367,1235,null,53,1,53.01,367,null,0,21,null,367,397,1235,1255]
[null,null,"2007-05-09",7845,86,null,null,null,null,null,null,53,368,368,1236,null,53,1,53.01,368,null,0,21,null,368,398,1236,1256]
[null,null,"2007-05-09",7619,56,null,null,null,null,null,null,53,369,369,1238,null,53,1,53.01,369,null,0,20,null,369,399,1237,1256]
[null,null,"2007-05-09",9434,72,null,null,null,null,null,null,53,370,370,1239,null,53,1,53.01,370,null,0,21,null,370,400,1239,1259]
[null,null,"2007-05-09",14024,57,null,null,null,null,null,null,54,371,371,1239,null,54,0,54,371,null,0,22,null,371,401,1239,1260]
[null,null,"2007-05-09",19339,75,null,null,null,null,null,null,54,372,372,1240,null,54,1,54.01,372,null,0,23,null,372,402,1240,1262]
[null,null,"2007-05-09",10799,60,null,null,null,null,null,null,54,373,373,1241,null,54,1,54.01,373,null,0,23,null,373,403,1241,1263]
[null,null,"2007-05-09",16922,67,null,null,null,null,null,null,54,374,374,1241,null,54,1,54.01,374,null,0,23,null,374,404,1241,1263]
[null,null,"2007-05-09",26983,78,null,null,null,null,null,null,54,375,375,1242,null,54,1,54.01,375,null,0,23,null,375,405,1242,1264]
[null,null,"2007-05-09",33887,53,null,null,null,null,null,null,55,376,376,1243,null,55,0,55,376,null,0,23,null,376,406,1243,1265]
[null,null,"2007-05-09",39780,79,null,null,null,null,null,null,55,377,377,1244,null,55,1,55.01,377,null,0,22,null,377,407,1244,1265]
[null,null,"2007-05-09",34382,64,null,null,null,null,null,null,55,378,378,1244,null,55,1,55.01,378,null,0,23,null,378,408,1244,1266]
[null,null,"2007-05-09",42324,66,null,null,null,null,null,null,55,379,379,1245,null,55,1,55.01,379,null,0,22,null,379,409,1245,1266]
[null,null,"2007-05-09",57671,87,null,null,null,null,null,null,55,380,380,1245,null,55,1,55.01,380,null,0,23,null,380,410,1245,1267]
[null,null,"2007-05-09",56418,50,null,null,null,null,null,null,55,381,381,1246,null,55,1,55.01,381,null,0,23,null,381,411,1246,1268]
[null,null,"2007-05-09",1289,101,null,null,null,null,null,null,55,382,382,1247,null,55,1,55.01,382,null,0,22,null,382,412,1247,1268]
[null,null,"2007-05-09",18170,122,null,null,null,null,null,null,56,383,383,1248,null,56,0,56,383,null,0,21,null,383,413,1248,1268]
[null,null,"2007-05-09",16382,135,null,null,null,null,null,null,56,384,384,1248,null,56,1,56.01,384,null,0,21,null,384,414,1248,1268]
[null,null,"2007-05-09",16517,156,null,null,null,null,null,null,56,385,385,1249,null,56,1,56.01,385,null,{"$f":"IF(W390=MAX($W$6:$W$1340),1,0)","v":0},20,null,385,415,1249,1268]
[null,null,"2007-05-09",15026,176,null,null,null,null,null,null,56,386,386,{"$f":"VLOOKUP(N391,$L$6:$M$1340,2,TRUE)","v":1249},null,56,1,{"$f":"Q391+R391*0.01","v":56.01},386,null,0,{"$f":"AB391-AA391+1","v":21},null,386,{"$f":"Y391+$J$6","v":416},{"$f":"VLOOKUP(Y391,$S$6:$T$1340,2,TRUE)","v":1249},{"$f":"VLOOKUP(Z391,$Q$6:$T$1340,4,TRUE)","v":1269}]
[null,null,"2007-05-09",19929,140,null,null,null,null,null,null,56,387,387,1251,null,56,{"$f":"IF(Q392=Q391,1,0)","v":1},56.01,387,null,0,20,null,387,417,1250,1269]
[null,null,"2007-05-09",28989,121,null,null,null,null,null,null,56,388,388,1252,null,56,1,56.01,388,null,0,19,null,388,418,1252,1270]
[null,null,"2007-05-09",27773,200,null,null,null,null,null,null,56,389,389,1252,null,56,1,56.01,389,null,0,20,null,389,419,1252,1271]
[null,null,"2007-05-09",35540,185,null,null,null,null,null,null,56,390,390,1253,null,56,1,56.01,390,null,0,21,null,390,420,1253,1273]
[null,null,"2007-05-09",35463,156,null,null,null,null,null,null,56,391,391,1254,null,56,1,56.01,391,null,0,23,null,391,421,1254,1276]
[null,null,"2007-05-09",48348,173,null,null,null,null,null,null,56,392,392,1254,null,56,1,56.01,392,null,0,23,null,392,422,1254,1276]
[null,null,"2007-05-09",788,410,null,null,null,null,null,null,57,393,393,1254,null,57,0,57,393,null,0,23,null,393,423,1254,1276]
[null,null,"2007-05-09",8955,372,null,null,null,null,null,null,57,394,394,1254,null,57,1,57.01,394,null,0,23,null,394,424,1254,1276]
[null,null,"2007-05-09",27119,253,null,null,null,null,null,null,57,395,395,1254,null,57,1,57.01,395,null,0,24,null,395,425,1254,1277]
[null,null,"2007-05-09",31428,488,null,null,null,null,null,null,57,396,396,1255,null,57,1,57.01,396,null,0,23,null,396,426,1255,1277]
[null,null,"2007-05-09",46300,388,null,null,null,null,null,null,57,397,397,1255,null,57,1,57.01,397,null,0,25,null,397,427,1255,1279]
[null,null,"2007-05-10",3631,18,null,null,null,null,null,null,57,398,398,1256,null,57,1,57.01,398,null,0,26,null,398,428,1256,1281]
[null,null,"2007-05-10",5544,45,null,null,null,null,null,null,57,399,399,1256,null,57,1,57.01,399,null,0,27,null,399,429,1256,1282]
[null,null,"2007-05-10",8410,22,null,null,null,null,null,null,57,400,400,1259,null,57,1,57.01,400,null,0,26,null,400,430,1257,1282]
[null,null,"2007-05-10",11230,11,null,null,null,null,null,null,57,401,401,1260,null,57,1,57.01,401,null,0,24,null,401,431,1260,1283]
[null,null,"2007-05-10",10845,17,null,null,null,null,null,null,58,402,402,1262,null,58,0,58,402,null,0,23,null,402,432,1261,1283]
[null,null,"2007-05-10",14695,45,null,null,null,null,null,null,58,403,403,1263,null,58,1,58.01,403,null,0,21,null,403,433,1263,1283]
[null,null,"2007-05-10",24428,35,null,null,null,null,null,null,58,404,404,1263,null,58,1,58.01,404,null,0,23,null,404,434,1263,1285]
[null,null,"2007-05-10",26891,6,null,null,null,null,null,null,58,405,405,1264,null,58,1,58.01,405,null,0,23,null,405,435,1264,1286]
[null,null,"2007-05-10",29443,19,null,null,null,null,null,null,58,406,406,1265,null,58,1,58.01,406,null,0,22,null,406,436,1265,1286]
[null,null,"2007-05-10",31857,22,null,null,null,null,null,null,58,407,407,1265,null,58,1,58.01,407,null,0,24,null,407,437,1265,1288]
[null,null,"2007-05-10",37279,15,null,null,null,null,null,null,58,408,408,1266,null,58,1,58.01,408,null,0,23,null,408,438,1266,1288]
[null,null,"2007-05-10",44768,30,null,null,null,null,null,null,59,409,409,1266,null,59,0,59,409,null,0,23,null,409,439,1266,1288]
[null,null,"2007-05-10",59659,21,null,null,null,null,null,null,59,410,410,1267,null,59,1,59.01,410,null,0,23,null,410,440,1267,1289]
[null,null,"2007-05-10",53683,35,null,null,null,null,null,null,59,411,411,1268,null,59,1,59.01,411,null,0,24,null,411,441,1268,1291]
[null,null,"2007-05-10",57188,17,null,null,null,null,null,null,60,412,412,1268,null,60,0,60,412,null,0,25,null,412,442,1268,1292]
[null,null,"2007-05-10",97776,25,null,null,null,null,null,null,60,413,413,1268,null,60,1,60.01,413,null,0,26,null,413,443,1268,1293]
[null,null,"2007-05-10",1248,57,null,null,null,null,null,null,60,414,414,1268,null,60,1,60.01,414,null,0,26,null,414,444,1268,1293]
[null,null,"2007-05-10",8297,95,null,null,null,null,null,null,60,415,415,1268,null,60,1,60.01,415,null,0,27,null,415,445,1268,1294]
[null,null,"2007-05-10",11734,100,null,null,null,null,null,null,60,416,416,1269,null,60,1,60.01,416,null,0,27,null,416,446,1269,1295]
[null,null,"2007-05-10",10826,60,null,null,null,null,null,null,60,417,417,1269,null,60,1,60.01,417,null,0,27,null,417,447,1269,1295]
[null,null,"2007-05-10",17313,96,null,null,null,null,null,null,60,418,418,1270,null,60,1,60.01,418,null,0,26,null,418,448,1270,1295]
[null,null,"2007-05-10",18943,78,null,null,null,null,null,null,60,419,419,1271,null,60,1,60.01,419,null,0,27,null,419,449,1271,1297]
[null,null,"2007-05-10",28918,96,null,null,null,null,null,null,60,420,420,1273,null,60,1,60.01,420,null,0,29,null,420,450,1272,1300]
[null,null,"2007-05-10",37834,99,null,null,null,null,null,null,60,421,421,1276,null,60,1,60.01,421,null,0,27,null,421,451,1274,1300]
[null,null,"2007-05-10",30385,61,null,null,null,null,null,null,61,422,422,1276,null,61,0,61,422,null,0,25,null,422,452,1276,1300]
[null,null,"2007-05-10",33512,94,null,null,null,null,null,null,61,423,423,1276,null,61,1,61.01,423,null,0,25,null,423,453,1276,1300]
[null,null,"2007-05-10",46835,70,null,null,null,null,null,null,61,424,424,1276,null,61,1,61.01,424,null,0,25,null,424,454,1276,1300]
[null,null,"2007-05-10",40803,51,null,null,null,null,null,null,61,425,425,1277,null,61,1,61.01,425,null,0,25,null,425,455,1277,1301]
[null,null,"2007-05-10",41847,86,null,null,null,null,null,null,61,426,426,1277,null,61,1,61.01,426,null,0,25,null,426,456,1277,1301]
[null,null,"2007-05-10",76186,94,null,null,null,null,null,null,61,427,427,1279,null,61,1,61.01,427,null,0,25,null,427,457,1278,1302]
[null,null,"2007-05-10",74277,71,null,null,null,null,null,null,61,428,428,1281,null,61,1,61.01,428,null,0,23,null,428,458,1280,1302]
[null,null,"2007-05-10",6662,143,null,null,null,null,null,null,61,429,429,1282,null,61,1,61.01,429,null,0,21,null,429,459,1282,1302]
[null,null,"2007-05-10",4425,187,null,null,null,null,null,null,61,430,430,1282,null,61,1,61.01,430,null,0,21,null,430,460,1282,1302]
[null,null,"2007-05-10",10721,101,null,null,null,null,null,null,61,431,431,1283,null,61,1,61.01,431,null,0,20,null,431,461,1283,1302]
[null,null,"2007-05-10",17473,190,null,null,null,null,null,null,61,432,432,1283,null,61,1,61.01,432,null,0,22,null,432,462,1283,1304]
[null,null,"2007-05-10",11769,127,null,null,null,null,null,null,62,433,433,1283,null,62,0,62,433,null,0,22,null,433,463,1283,1304]
[null,null,"2007-05-10",17690,100,null,null,null,null,null,null,62,434,434,1285,null,62,1,62.01,434,null,0,22,null,434,464,1284,1305]
[null,null,"2007-05-10",50083,167,null,null,null,null,null,null,62,435,435,1286,null,62,1,62.01,435,null,0,21,null,435,465,1286,1306]
[null,null,"2007-05-10",78499,132,null,null,null,null,null,null,62,436,436,1286,null,62,1,62.01,436,null,0,21,null,436,466,1286,1306]
[null,null,"2007-05-10",761,346,null,null,null,null,null,null,62,437,437,1288,null,62,1,62.01,437,null,0,20,null,437,467,1287,1306]
[null,null,"2007-05-10",5468,450,null,null,null,null,null,null,62,438,438,1288,null,62,1,62.01,438,null,0,19,null,438,468,1288,1306]
[null,null,"2007-05-10",18662,227,null,null,null,null,null,null,63,439,439,1288,null,63,0,63,439,null,0,19,null,439,469,1288,1306]
[null,null,"2007-05-10",17156,465,null,null,null,null,null,null,63,440,440,1289,null,63,1,63.01,440,null,0,19,null,440,470,1289,1307]
[null,null,"2007-05-10",15349,387,null,null,null,null,null,null,63,441,441,1291,null,63,1,63.01,441,null,0,20,null,441,471,1290,1309]
[null,null,"2007-05-10",12099,229,null,null,null,null,null,null,63,442,442,1292,null,63,1,63.01,442,null,0,19,null,442,472,1292,1310]
[null,null,"2007-05-10",29324,400,null,null,null,null,null,null,63,443,443,1293,null,63,1,63.01,443,null,0,19,null,443,473,1293,1311]
[null,null,"2007-05-10",35690,311,null,null,null,null,null,null,63,444,444,1293,null,63,1,63.01,444,null,0,19,null,444,474,1293,1311]
[null,null,"2007-05-10",57308,434,null,null,null,null,null,null,64,445,445,1294,null,64,0,64,445,null,0,18,null,445,475,1294,1311]
[null,null,"2007-05-11",16562,11,null,null,null,null,null,null,64,446,446,1295,null,64,1,64.010000000000005,446,null,0,18,null,446,476,1295,1312]
[null,null,"2007-05-11",11809,34,null,null,null,null,null,null,64,447,447,1295,null,64,1,64.010000000000005,447,null,0,20,null,447,477,1295,1314]
[null,null,"2007-05-11",10180,7,null,null,null,null,null,null,64,448,448,1295,null,64,1,64.010000000000005,448,null,0,22,null,448,478,1295,1316]
[null,null,"2007-05-11",21313,47,null,null,null,null,null,null,64,449,449,1297,null,64,1,64.010000000000005,449,null,{"$f":"IF(W454=MAX($W$6:$W$1340),1,0)","v":0},22,null,449,479,1296,1317]
[null,null,"2007-05-11",37128,13,null,null,null,null,null,null,64,450,450,{"$f":"VLOOKUP(N455,$L$6:$M$1340,2,TRUE)","v":1300},null,64,1,{"$f":"Q455+R455*0.01","v":64.010000000000005},450,null,0,{"$f":"AB455-AA455+1","v":20},null,450,{"$f":"Y455+$J$6","v":480},{"$f":"VLOOKUP(Y455,$S$6:$T$1340,2,TRUE)","v":1298},{"$f":"VLOOKUP(Z455,$Q$6:$T$1340,4,TRUE)","v":1317}]
[null,null,"2007-05-11",36900,34,null,null,null,null,null,null,64,451,451,1300,null,64,{"$f":"IF(Q456=Q455,1,0)","v":1},64.010000000000005,451,null,0,18,null,451,481,1300,1317]
[null,null,"2007-05-11",44123,17,null,null,null,null,null,null,64,452,452,1300,null,64,1,64.010000000000005,452,null,0,19,null,452,482,1300,1318]
[null,null,"2007-05-11",40283,29,null,null,null,null,null,null,64,453,453,1300,null,64,1,64.010000000000005,453,null,0,21,null,453,483,1300,1320]
[null,null,"2007-05-11",57736,37,null,null,null,null,null,null,64,454,454,1300,null,64,1,64.010000000000005,454,null,0,21,null,454,484,1300,1320]
[null,null,"2007-05-11",9739,62,null,null,null,null,null,null,64,455,455,1301,null,64,1,64.010000000000005,455,null,0,21,null,455,485,1301,1321]
[null,null,"2007-05-11",6171,75,null,null,null,null,null,null,64,456,456,1301,null,64,1,64.010000000000005,456,null,0,21,null,456,486,1301,1321]
[null,null,"2007-05-11",6974,93,null,null,null,null,null,null,65,457,457,1302,null,65,0,65,457,null,0,20,null,457,487,1302,1321]
[null,null,"2007-05-11",8955,63,null,null,null,null,null,null,65,458,458,1302,null,65,1,65.010000000000005,458,null,0,24,null,458,488,1302,1325]
[null,null,"2007-05-11",18621,83,null,null,null,null,null,null,65,459,459,1302,null,65,1,65.010000000000005,459,null,0,25,null,459,489,1302,1326]
[null,null,"2007-05-11",15372,82,null,null,null,null,null,null,65,460,460,1302,null,65,1,65.010000000000005,460,null,0,25,null,460,490,1302,1326]
[null,null,"2007-05-11",10290,68,null,null,null,null,null,null,65,461,461,1302,null,65,1,65.010000000000005,461,null,0,25,null,461,491,1302,1326]
[null,null,"2007-05-11",15031,66,null,null,null,null,null,null,65,462,462,1304,null,65,1,65.010000000000005,462,null,0,25,null,462,492,1303,1327]
[null,null,"2007-05-11",14207,56,null,null,null,null,null,null,65,463,463,1304,null,65,1,65.010000000000005,463,null,0,24,null,463,493,1304,1327]
[null,null,"2007-05-11",17739,50,null,null,null,null,null,null,65,464,464,1305,null,65,1,65.010000000000005,464,null,0,24,null,464,494,1305,1328]
[null,null,"2007-05-11",22825,59,null,null,null,null,null,null,65,465,465,1306,null,65,1,65.010000000000005,465,null,0,24,null,465,495,1306,1329]
[null,null,"2007-05-11",21258,64,null,null,null,null,null,null,65,466,466,1306,null,65,1,65.010000000000005,466,null,0,26,null,466,496,1306,1331]
[null,null,"2007-05-11",35356,61,null,null,null,null,null,null,65,467,467,1306,null,65,1,65.010000000000005,467,null,0,28,null,467,497,1306,1333]
[null,null,"2007-05-11",49982,52,null,null,null,null,null,null,66,468,468,1306,null,66,0,66,468,null,0,29,null,468,498,1306,1334]
[null,null,"2007-05-11",42771,69,null,null,null,null,null,null,66,469,469,1306,null,66,1,66.010000000000005,469,null,0,29,null,469,499,1306,1334]
[null,null,"2007-05-11",49209,61,null,null,null,null,null,null,66,470,470,1307,null,66,1,66.010000000000005,470,null,0,29,null,470,500,1307,1335]
[null,null,"2007-05-11",46965,64,null,null,null,null,null,null,66,471,471,1309,null,66,1,66.010000000000005,471,null,0,28,null,471,501,1308,1335]
[null,null,"2007-05-11",52947,76,null,null,null,null,null,null,66,472,472,1310,null,66,1,66.010000000000005,472,null,0,26,null,472,502,1310,1335]
[null,null,"2007-05-11",64668,80,null,null,null,null,null,null,66,473,473,1311,null,66,1,66.010000000000005,473,null,0,25,null,473,503,1311,1335]
[null,null,"2007-05-11",8448,146,null,null,null,null,null,null,66,474,474,1311,null,66,1,66.010000000000005,474,null,0,25,null,474,504,1311,1335]
[null,null,"2007-05-11",8619,181,null,null,null,null,null,null,66,475,475,1311,null,66,1,66.010000000000005,475,null,0,25,null,475,505,1311,1335]
[null,null,"2007-05-11",2484,174,null,null,null,null,null,null,66,476,476,1312,null,66,1,66.010000000000005,476,null,0,24,null,476,506,1312,1335]
[null,null,"2007-05-11",14345,176,null,null,null,null,null,null,66,477,477,1314,null,66,1,66.010000000000005,477,null,0,23,null,477,507,1313,1335]
[null,null,"2007-05-11",12805,144,null,null,null,null,null,null,66,478,478,1316,null,66,1,66.010000000000005,478,null,0,21,null,478,508,1315,1335]
[null,null,"2007-05-11",12997,112,null,null,null,null,null,null,66,479,479,1317,null,66,1,66.010000000000005,479,null,0,19,null,479,509,1317,1335]
[null,null,"2007-05-11",14794,111,null,null,null,null,null,null,66,480,480,1317,null,66,1,66.010000000000005,480,null,0,19,null,480,510,1317,1335]
[null,null,"2007-05-11",21982,177,null,null,null,null,null,null,66,481,481,1317,null,66,1,66.010000000000005,481,null,0,19,null,481,511,1317,1335]
[null,null,"2007-05-11",31338,110,null,null,null,null,null,null,66,482,482,1318,null,66,1,66.010000000000005,482,null,0,18,null,482,512,1318,1335]
[null,null,"2007-05-11",41559,159,null,null,null,null,null,null,66,483,483,1320,null,66,1,66.010000000000005,483,null,0,17,null,483,513,1319,1335]
[null,null,"2007-05-11",45566,129,null,null,null,null,null,null,67,484,484,1320,null,67,0,67,484,null,0,16,null,484,514,1320,1335]
[null,null,"2007-05-11",53166,103,null,null,null,null,null,null,67,485,485,1321,null,67,1,67.010000000000005,485,null,0,15,null,485,515,1321,1335]
[null,null,"2007-05-11",63434,148,null,null,null,null,null,null,67,486,486,1321,null,67,1,67.010000000000005,486,null,0,15,null,486,516,1321,1335]
[null,null,"2007-05-11",12290,396,null,null,null,null,null,null,67,487,487,1321,null,67,1,67.010000000000005,487,null,0,15,null,487,517,1321,1335]
[null,null,"2007-05-11",14032,470,null,null,null,null,null,null,67,488,488,1325,null,67,1,67.010000000000005,488,null,0,14,null,488,518,1322,1335]
[null,null,"2007-05-11",28934,360,null,null,null,null,null,null,67,489,489,1326,null,67,1,67.010000000000005,489,null,0,10,null,489,519,1326,1335]
[null,null,"2007-05-11",34968,218,null,null,null,null,null,null,67,490,490,1326,null,67,1,67.010000000000005,490,null,0,10,null,490,520,1326,1335]
[null,null,"2007-05-11",45807,308,null,null,null,null,null,null,68,491,491,1326,null,68,0,68,491,null,0,10,null,491,521,1326,1335]
[null,null,"2007-05-11",58303,400,null,null,null,null,null,null,68,492,492,1327,null,68,1,68.010000000000005,492,null,0,9,null,492,522,1327,1335]
[null,null,"2007-05-12",24992,31,null,null,null,null,null,null,68,493,493,1327,null,68,1,68.010000000000005,493,null,0,9,null,493,523,1327,1335]
[null,null,"2007-05-12",37966,12,null,null,null,null,null,null,68,494,494,1328,null,68,1,68.010000000000005,494,null,0,8,null,494,524,1328,1335]
[null,null,"2007-05-12",39234,44,null,null,null,null,null,null,68,495,495,1329,null,68,1,68.010000000000005,495,null,0,7,null,495,525,1329,1335]
[null,null,"2007-05-12",47539,12,null,null,null,null,null,null,69,496,496,1331,null,69,0,69,496,null,0,6,null,496,526,1330,1335]
[null,null,"2007-05-12",66746,5,null,null,null,null,null,null,69,497,497,1333,null,69,1,69.010000000000005,497,null,0,4,null,497,527,1332,1335]
[null,null,"2007-05-12",12653,82,null,null,null,null,null,null,69,498,498,1334,null,69,1,69.010000000000005,498,null,0,2,null,498,528,1334,1335]
[null,null,"2007-05-12",15800,89,null,null,null,null,null,null,69,499,499,1334,null,69,1,69.010000000000005,499,null,0,2,null,499,529,1334,1335]
[null,null,"2007-05-12",27627,55,null,null,null,null,null,null,69,500,500,1335,null,69,1,69.010000000000005,500,null,0,1,null,500,530,1335,1335]
[null,null,"2007-05-12",26451,59,null,null,null,null,null,null,70,501,501,1335,null,70,0,70,501,null,0,1,null,501,531,1335,1335]
[null,null,"2007-05-12",38234,95,null,null,null,null,null,null,70,502,502,1335,null,70,1,70.010000000000005,502,null,0,1,null,502,532,1335,1335]
[null,null,"2007-05-12",36788,82,null,null,null,null,null,null,70,503,503,1335,null,70,1,70.010000000000005,503,null,0,1,null,503,533,1335,1335]
[null,null,"2007-05-12",45982,100,null,null,null,null,null,null,70,504,504,1335,null,70,1,70.010000000000005,504,null,0,1,null,504,534,1335,1335]
[null,null,"2007-05-12",6270,136,null,null,null,null,null,null,70,505,505,1335,null,70,1,70.010000000000005,505,null,0,1,null,505,535,1335,1335]
[null,null,"2007-05-12",7003,171,null,null,null,null,null,null,70,506,506,1335,null,70,1,70.010000000000005,506,null,0,1,null,506,536,1335,1335]
[null,null,"2007-05-12",28305,179,null,null,null,null,null,null,70,507,507,1335,null,70,1,70.010000000000005,507,null,0,1,null,507,537,1335,1335]
[null,null,"2007-05-12",43650,200,null,null,null,null,null,null,70,508,508,1335,null,70,1,70.010000000000005,508,null,0,1,null,508,538,1335,1335]
[null,null,"2007-05-12",42945,183,null,null,null,null,null,null,70,509,509,1335,null,70,1,70.010000000000005,509,null,0,1,null,509,539,1335,1335]
[null,null,"2007-05-12",69138,177,null,null,null,null,null,null,70,510,510,1335,null,70,1,70.010000000000005,510,null,0,1,null,510,540,1335,1335]
[null,null,"2007-05-12",76844,120,null,null,null,null,null,null,71,511,511,1335,null,71,0,71,511,null,0,1,null,511,541,1335,1335]
[null,null,"2007-05-12",77586,162,null,null,null,null,null,null,71,512,512,1335,null,71,1,71.010000000000005,512,null,0,1,null,512,542,1335,1335]
[null,null,"2007-05-12",8538,450,null,null,null,null,null,null,71,513,513,1335,null,71,1,71.010000000000005,513,null,{"$f":"IF(W518=MAX($W$6:$W$1340),1,0)","v":0},1,null,513,543,1335,1335]
[null,null,"2007-05-12",3658,441,null,null,null,null,null,null,71,514,514,{"$f":"VLOOKUP(N519,$L$6:$M$1340,2,TRUE)","v":1335},null,71,1,{"$f":"Q519+R519*0.01","v":71.010000000000005},514,null,0,{"$f":"AB519-AA519+1","v":1},null,514,{"$f":"Y519+$J$6","v":544},{"$f":"VLOOKUP(Y519,$S$6:$T$1340,2,TRUE)","v":1335},{"$f":"VLOOKUP(Z519,$Q$6:$T$1340,4,TRUE)","v":1335}]
[null,null,"2007-05-12",28384,234,null,null,null,null,null,null,71,515,515,1335,null,71,{"$f":"IF(Q520=Q519,1,0)","v":1},71.010000000000005,515,null,0,1,null,515,545,1335,1335]
[null,null,"2007-05-12",34486,342,null,null,null,null,null,null,71,516,516,1335,null,71,1,71.010000000000005,516,null,0,1,null,516,546,1335,1335]
[null,null,"2007-05-12",39992,239,null,null,null,null,null,null,71,517,517,1335,null,71,1,71.010000000000005,517,null,0,1,null,517,547,1335,1335]
[null,null,"2007-05-12",49431,226,null,null,null,null,null,null,71,518,518,1335,null,71,1,71.010000000000005,518,null,0,1,null,518,548,1335,1335]
[null,null,"2007-05-12",43178,302,null,null,null,null,null,null,72,519,519,1335,null,72,0,72,519,null,0,1,null,519,549,1335,1335]
[null,null,"2007-05-12",65273,363,null,null,null,null,null,null,72,520,520,1335,null,72,1,72.010000000000005,520,null,0,1,null,520,550,1335,1335]
[null,null,"2007-05-13",8327,4,null,null,null,null,null,null,72,521,521,1335,null,72,1,72.010000000000005,521,null,0,1,null,521,551,1335,1335]
[null,null,"2007-05-13",2163,20,null,null,null,null,null,null,72,522,522,1335,null,72,1,72.010000000000005,522,null,0,1,null,522,552,1335,1335]
[null,null,"2007-05-13",8189,9,null,null,null,null,null,null,72,523,523,1335,null,72,1,72.010000000000005,523,null,0,1,null,523,553,1335,1335]
[null,null,"2007-05-13",19529,36,null,null,null,null,null,null,72,524,524,1335,null,72,1,72.010000000000005,524,null,0,1,null,524,554,1335,1335]
[null,null,"2007-05-13",16532,25,null,null,null,null,null,null,72,525,525,1335,null,72,1,72.010000000000005,525,null,0,1,null,525,555,1335,1335]
[null,null,"2007-05-13",18116,27,null,null,null,null,null,null,72,526,526,1335,null,72,1,72.010000000000005,526,null,0,1,null,526,556,1335,1335]
[null,null,"2007-05-13",24383,25,null,null,null,null,null,null,72,527,527,1335,null,72,1,72.010000000000005,527,null,0,1,null,527,557,1335,1335]
[null,null,"2007-05-13",78278,21,null,null,null,null,null,null,73,528,528,1335,null,73,0,73,528,null,0,1,null,528,558,1335,1335]
[null,null,"2007-05-13",7225,95,null,null,null,null,null,null,73,529,529,1335,null,73,1,73.010000000000005,529,null,0,1,null,529,559,1335,1335]
[null,null,"2007-05-13",524,51,null,null,null,null,null,null,73,530,530,1335,null,73,1,73.010000000000005,530,null,0,1,null,530,560,1335,1335]
[null,null,"2007-05-13",7919,84,null,null,null,null,null,null,73,531,531,1335,null,73,1,73.010000000000005,531,null,0,1,null,531,561,1335,1335]
[null,null,"2007-05-13",4437,88,null,null,null,null,null,null,73,532,532,1335,null,73,1,73.010000000000005,532,null,0,1,null,532,562,1335,1335]
[null,null,"2007-05-13",14828,87,null,null,null,null,null,null,73,533,533,1335,null,73,1,73.010000000000005,533,null,0,1,null,533,563,1335,1335]
[null,null,"2007-05-13",16134,93,null,null,null,null,null,null,73,534,534,1335,null,73,1,73.010000000000005,534,null,0,1,null,534,564,1335,1335]
[null,null,"2007-05-13",13423,55,null,null,null,null,null,null,73,535,535,1335,null,73,1,73.010000000000005,535,null,0,1,null,535,565,1335,1335]
[null,null,"2007-05-13",18728,98,null,null,null,null,null,null,74,536,536,1335,null,74,0,74,536,null,0,1,null,536,566,1335,1335]
[null,null,"2007-05-13",21472,62,null,null,null,null,null,null,74,537,537,1335,null,74,1,74.010000000000005,537,null,0,1,null,537,567,1335,1335]
[null,null,"2007-05-13",25274,80,null,null,null,null,null,null,74,538,538,1335,null,74,1,74.010000000000005,538,null,0,1,null,538,568,1335,1335]
[null,null,"2007-05-13",37261,61,null,null,null,null,null,null,74,539,539,1335,null,74,1,74.010000000000005,539,null,0,1,null,539,569,1335,1335]
[null,null,"2007-05-13",39318,85,null,null,null,null,null,null,74,540,540,1335,null,74,1,74.010000000000005,540,null,0,1,null,540,570,1335,1335]
[null,null,"2007-05-13",47398,75,null,null,null,null,null,null,74,541,541,1335,null,74,1,74.010000000000005,541,null,0,1,null,541,571,1335,1335]
[null,null,"2007-05-13",54614,64,null,null,null,null,null,null,74,542,542,1335,null,74,1,74.010000000000005,542,null,0,1,null,542,572,1335,1335]
[null,null,"2007-05-13",2045,193,null,null,null,null,null,null,74,543,543,1335,null,74,1,74.010000000000005,543,null,0,1,null,543,573,1335,1335]
[null,null,"2007-05-13",3155,175,null,null,null,null,null,null,74,544,544,1335,null,74,1,74.010000000000005,544,null,0,1,null,544,574,1335,1335]
[null,null,"2007-05-13",5969,161,null,null,null,null,null,null,75,545,545,1335,null,75,0,75,545,null,0,1,null,545,575,1335,1335]
[null,null,"2007-05-13",14351,142,null,null,null,null,null,null,75,546,546,1335,null,75,1,75.010000000000005,546,null,0,1,null,546,576,1335,1335]
[null,null,"2007-05-13",11392,163,null,null,null,null,null,null,75,547,547,1335,null,75,1,75.010000000000005,547,null,0,1,null,547,577,1335,1335]
[null,null,"2007-05-13",26631,169,null,null,null,null,null,null,75,548,548,1335,null,75,1,75.010000000000005,548,null,0,1,null,548,578,1335,1335]
[null,null,"2007-05-13",31348,109,null,null,null,null,null,null,75,549,549,1335,null,75,1,75.010000000000005,549,null,0,1,null,549,579,1335,1335]
[null,null,"2007-05-13",45447,132,null,null,null,null,null,null,75,550,550,1335,null,75,1,75.010000000000005,550,null,0,1,null,550,580,1335,1335]
[null,null,"2007-05-13",72539,147,null,null,null,null,null,null,75,551,551,1335,null,75,1,75.010000000000005,551,null,0,1,null,551,581,1335,1335]
[null,null,"2007-05-13",13404,289,null,null,null,null,null,null,75,552,552,1335,null,75,1,75.010000000000005,552,null,0,1,null,552,582,1335,1335]
[null,null,"2007-05-13",10116,382,null,null,null,null,null,null,75,553,553,1335,null,75,1,75.010000000000005,553,null,0,1,null,553,583,1335,1335]
[null,null,"2007-05-13",14067,290,null,null,null,null,null,null,76,554,554,1335,null,76,0,76,554,null,0,1,null,554,584,1335,1335]
[null,null,"2007-05-13",12544,307,null,null,null,null,null,null,76,555,555,1335,null,76,1,76.010000000000005,555,null,0,1,null,555,585,1335,1335]
[null,null,"2007-05-13",12964,483,null,null,null,null,null,null,76,556,556,1335,null,76,1,76.010000000000005,556,null,0,1,null,556,586,1335,1335]
[null,null,"2007-05-13",24429,321,null,null,null,null,null,null,76,557,557,1335,null,76,1,76.010000000000005,557,null,0,1,null,557,587,1335,1335]
[null,null,"2007-05-13",53387,472,null,null,null,null,null,null,76,558,558,1335,null,76,1,76.010000000000005,558,null,0,1,null,558,588,1335,1335]
[null,null,"2007-05-14",13120,27,null,null,null,null,null,null,76,559,559,1335,null,76,1,76.010000000000005,559,null,0,1,null,559,589,1335,1335]
[null,null,"2007-05-14",13665,4,null,null,null,null,null,null,76,560,560,1335,null,76,1,76.010000000000005,560,null,0,1,null,560,590,1335,1335]
[null,null,"2007-05-14",10675,32,null,null,null,null,null,null,76,561,561,1335,null,76,1,76.010000000000005,561,null,0,1,null,561,591,1335,1335]
[null,null,"2007-05-14",27226,33,null,null,null,null,null,null,76,562,562,1335,null,76,1,76.010000000000005,562,null,0,1,null,562,592,1335,1335]
[null,null,"2007-05-14",27396,23,null,null,null,null,null,null,77,563,563,1335,null,77,0,77,563,null,0,1,null,563,593,1335,1335]
[null,null,"2007-05-14",53658,38,null,null,null,null,null,null,77,564,564,1335,null,77,1,77.010000000000005,564,null,0,1,null,564,594,1335,1335]
[null,null,"2007-05-14",50647,39,null,null,null,null,null,null,77,565,565,1335,null,77,1,77.010000000000005,565,null,0,1,null,565,595,1335,1335]
[null,null,"2007-05-14",56428,42,null,null,null,null,null,null,77,566,566,1335,null,77,1,77.010000000000005,566,null,0,1,null,566,596,1335,1335]
[null,null,"2007-05-14",69424,4,null,null,null,null,null,null,77,567,567,1335,null,77,1,77.010000000000005,567,null,0,1,null,567,597,1335,1335]
[null,null,"2007-05-14",71202,4,null,null,null,null,null,null,77,568,568,1335,null,77,1,77.010000000000005,568,null,0,1,null,568,598,1335,1335]
[null,null,"2007-05-14",6086,86,null,null,null,null,null,null,78,569,569,1335,null,78,0,78,569,null,0,1,null,569,599,1335,1335]
[null,null,"2007-05-14",11227,72,null,null,null,null,null,null,78,570,570,1335,null,78,1,78.010000000000005,570,null,0,1,null,570,600,1335,1335]
[null,null,"2007-05-14",15644,93,null,null,null,null,null,null,78,571,571,1335,null,78,1,78.010000000000005,571,null,0,1,null,571,601,1335,1335]
[null,null,"2007-05-14",25168,76,null,null,null,null,null,null,78,572,572,1335,null,78,1,78.010000000000005,572,null,0,1,null,572,602,1335,1335]
[null,null,"2007-05-14",21685,72,null,null,null,null,null,null,78,573,573,1335,null,78,1,78.010000000000005,573,null,0,1,null,573,603,1335,1335]
[null,null,"2007-05-14",42629,50,null,null,null,null,null,null,78,574,574,1335,null,78,1,78.010000000000005,574,null,0,1,null,574,604,1335,1335]
[null,null,"2007-05-14",58800,66,null,null,null,null,null,null,78,575,575,1335,null,78,1,78.010000000000005,575,null,0,1,null,575,605,1335,1335]
[null,null,"2007-05-14",3745,184,null,null,null,null,null,null,79,576,576,1335,null,79,0,79,576,null,0,1,null,576,606,1335,1335]
[null,null,"2007-05-14",10099,155,null,null,null,null,null,null,79,577,577,1335,null,79,1,79.010000000000005,577,null,{"$f":"IF(W582=MAX($W$6:$W$1340),1,0)","v":0},1,null,577,607,1335,1335]
[null,null,"2007-05-14",15357,164,null,null,null,null,null,null,79,578,578,{"$f":"VLOOKUP(N583,$L$6:$M$1340,2,TRUE)","v":1335},null,79,1,{"$f":"Q583+R583*0.01","v":79.010000000000005},578,null,0,{"$f":"AB583-AA583+1","v":1},null,578,{"$f":"Y583+$J$6","v":608},{"$f":"VLOOKUP(Y583,$S$6:$T$1340,2,TRUE)","v":1335},{"$f":"VLOOKUP(Z583,$Q$6:$T$1340,4,TRUE)","v":1335}]
[null,null,"2007-05-14",19465,118,null,null,null,null,null,null,79,579,579,1335,null,79,{"$f":"IF(Q584=Q583,1,0)","v":1},79.010000000000005,579,null,0,1,null,579,609,1335,1335]
[null,null,"2007-05-14",27387,193,null,null,null,null,null,null,79,580,580,1335,null,79,1,79.010000000000005,580,null,0,1,null,580,610,1335,1335]
[null,null,"2007-05-14",27597,200,null,null,null,null,null,null,79,581,581,1335,null,79,1,79.010000000000005,581,null,0,1,null,581,611,1335,1335]
[null,null,"2007-05-14",34963,150,null,null,null,null,null,null,79,582,582,1335,null,79,1,79.010000000000005,582,null,0,1,null,582,612,1335,1335]
[null,null,"2007-05-14",47414,195,null,null,null,null,null,null,79,583,583,1335,null,79,1,79.010000000000005,583,null,0,1,null,583,613,1335,1335]
[null,null,"2007-05-14",50558,140,null,null,null,null,null,null,80,584,584,1335,null,80,0,80,584,null,0,1,null,584,614,1335,1335]
[null,null,"2007-05-14",54628,161,null,null,null,null,null,null,80,585,585,1335,null,80,1,80.010000000000005,585,null,0,1,null,585,615,1335,1335]
[null,null,"2007-05-14",68852,144,null,null,null,null,null,null,80,586,586,1335,null,80,1,80.010000000000005,586,null,0,1,null,586,616,1335,1335]
[null,null,"2007-05-14",66252,118,null,null,null,null,null,null,80,587,587,1335,null,80,1,80.010000000000005,587,null,0,1,null,587,617,1335,1335]
[null,null,"2007-05-14",77026,119,null,null,null,null,null,null,80,588,588,1335,null,80,1,80.010000000000005,588,null,0,1,null,588,618,1335,1335]
[null,null,"2007-05-14",71063,175,null,null,null,null,null,null,80,589,589,1335,null,80,1,80.010000000000005,589,null,0,1,null,589,619,1335,1335]
[null,null,"2007-05-14",92810,184,null,null,null,null,null,null,80,590,590,1335,null,80,1,80.010000000000005,590,null,0,1,null,590,620,1335,1335]
[null,null,"2007-05-14",4822,233,null,null,null,null,null,null,80,591,591,1335,null,80,1,80.010000000000005,591,null,0,1,null,591,621,1335,1335]
[null,null,"2007-05-14",13013,213,null,null,null,null,null,null,80,592,592,1335,null,80,1,80.010000000000005,592,null,0,1,null,592,622,1335,1335]
[null,null,"2007-05-14",22647,209,null,null,null,null,null,null,80,593,593,1335,null,80,1,80.010000000000005,593,null,0,1,null,593,623,1335,1335]
[null,null,"2007-05-14",25884,314,null,null,null,null,null,null,80,594,594,1335,null,80,1,80.010000000000005,594,null,0,1,null,594,624,1335,1335]
[null,null,"2007-05-14",37331,363,null,null,null,null,null,null,80,595,595,1335,null,80,1,80.010000000000005,595,null,0,1,null,595,625,1335,1335]
[null,null,"2007-05-14",41260,496,null,null,null,null,null,null,80,596,596,1335,null,80,1,80.010000000000005,596,null,0,1,null,596,626,1335,1335]
[null,null,"2007-05-14",59053,264,null,null,null,null,null,null,80,597,597,1335,null,80,1,80.010000000000005,597,null,0,1,null,597,627,1335,1335]
[null,null,"2007-05-15",1884,4,null,null,null,null,null,null,80,598,598,1335,null,80,1,80.010000000000005,598,null,0,1,null,598,628,1335,1335]
[null,null,"2007-05-15",15001,14,null,null,null,null,null,null,80,599,599,1335,null,80,1,80.010000000000005,599,null,0,1,null,599,629,1335,1335]
[null,null,"2007-05-15",25926,9,null,null,null,null,null,null,81,600,600,1335,null,81,0,81,600,null,0,1,null,600,630,1335,1335]
[null,null,"2007-05-15",39059,8,null,null,null,null,null,null,81,601,601,1335,null,81,1,81.010000000000005,601,null,0,1,null,601,631,1335,1335]
[null,null,"2007-05-15",34338,11,null,null,null,null,null,null,81,602,602,1335,null,81,1,81.010000000000005,602,null,0,1,null,602,632,1335,1335]
[null,null,"2007-05-15",40356,49,null,null,null,null,null,null,81,603,603,1335,null,81,1,81.010000000000005,603,null,0,1,null,603,633,1335,1335]
[null,null,"2007-05-15",55675,12,null,null,null,null,null,null,81,604,604,1335,null,81,1,81.010000000000005,604,null,0,1,null,604,634,1335,1335]
[null,null,"2007-05-15",68237,23,null,null,null,null,null,null,81,605,605,1335,null,81,1,81.010000000000005,605,null,0,1,null,605,635,1335,1335]
[null,null,"2007-05-15",8517,98,null,null,null,null,null,null,81,606,606,1335,null,81,1,81.010000000000005,606,null,0,1,null,606,636,1335,1335]
[null,null,"2007-05-15",7024,89,null,null,null,null,null,null,81,607,607,1335,null,81,1,81.010000000000005,607,null,0,1,null,607,637,1335,1335]
[null,null,"2007-05-15",6048,53,null,null,null,null,null,null,81,608,608,1335,null,81,1,81.010000000000005,608,null,0,1,null,608,638,1335,1335]
[null,null,"2007-05-15",3066,78,null,null,null,null,null,null,81,609,609,1335,null,81,1,81.010000000000005,609,null,0,1,null,609,639,1335,1335]
[null,null,"2007-05-15",6400,95,null,null,null,null,null,null,82,610,610,1335,null,82,0,82,610,null,0,1,null,610,640,1335,1335]
[null,null,"2007-05-15",6960,81,null,null,null,null,null,null,82,611,611,1335,null,82,1,82.01,611,null,0,1,null,611,641,1335,1335]
[null,null,"2007-05-15",2189,75,null,null,null,null,null,null,82,612,612,1335,null,82,1,82.01,612,null,0,1,null,612,642,1335,1335]
[null,null,"2007-05-15",11051,60,null,null,null,null,null,null,82,613,613,1335,null,82,1,82.01,613,null,0,1,null,613,643,1335,1335]
[null,null,"2007-05-15",15438,71,null,null,null,null,null,null,82,614,614,1335,null,82,1,82.01,614,null,0,1,null,614,644,1335,1335]
[null,null,"2007-05-15",16608,83,null,null,null,null,null,null,82,615,615,1335,null,82,1,82.01,615,null,0,1,null,615,645,1335,1335]
[null,null,"2007-05-15",14423,86,null,null,null,null,null,null,83,616,616,1335,null,83,0,83,616,null,0,1,null,616,646,1335,1335]
[null,null,"2007-05-15",27445,81,null,null,null,null,null,null,83,617,617,1335,null,83,1,83.01,617,null,0,1,null,617,647,1335,1335]
[null,null,"2007-05-15",28513,72,null,null,null,null,null,null,83,618,618,1335,null,83,1,83.01,618,null,0,1,null,618,648,1335,1335]
[null,null,"2007-05-15",24383,80,null,null,null,null,null,null,83,619,619,1335,null,83,1,83.01,619,null,0,1,null,619,649,1335,1335]
[null,null,"2007-05-15",28479,81,null,null,null,null,null,null,83,620,620,1335,null,83,1,83.01,620,null,0,1,null,620,650,1335,1335]
[null,null,"2007-05-15",21028,57,null,null,null,null,null,null,83,621,621,1335,null,83,1,83.01,621,null,0,1,null,621,651,1335,1335]
[null,null,"2007-05-15",49051,81,null,null,null,null,null,null,83,622,622,1335,null,83,1,83.01,622,null,0,1,null,622,652,1335,1335]
[null,null,"2007-05-15",68517,96,null,null,null,null,null,null,83,623,623,1335,null,83,1,83.01,623,null,0,1,null,623,653,1335,1335]
[null,null,"2007-05-15",77544,84,null,null,null,null,null,null,83,624,624,1335,null,83,1,83.01,624,null,0,1,null,624,654,1335,1335]
[null,null,"2007-05-15",6652,155,null,null,null,null,null,null,83,625,625,1335,null,83,1,83.01,625,null,0,1,null,625,655,1335,1335]
[null,null,"2007-05-15",6838,135,null,null,null,null,null,null,83,626,626,1335,null,83,1,83.01,626,null,0,1,null,626,656,1335,1335]
[null,null,"2007-05-15",3385,195,null,null,null,null,null,null,83,627,627,1335,null,83,1,83.01,627,null,0,1,null,627,657,1335,1335]
[null,null,"2007-05-15",14218,102,null,null,null,null,null,null,83,628,628,1335,null,83,1,83.01,628,null,0,1,null,628,658,1335,1335]
[null,null,"2007-05-15",11335,112,null,null,null,null,null,null,83,629,629,1335,null,83,1,83.01,629,null,0,1,null,629,659,1335,1335]
[null,null,"2007-05-15",15973,123,null,null,null,null,null,null,83,630,630,1335,null,83,1,83.01,630,null,0,1,null,630,660,1335,1335]
[null,null,"2007-05-15",10448,176,null,null,null,null,null,null,84,631,631,1335,null,84,0,84,631,null,0,1,null,631,661,1335,1335]
[null,null,"2007-05-15",16405,150,null,null,null,null,null,null,84,632,632,1335,null,84,1,84.01,632,null,0,1,null,632,662,1335,1335]
[null,null,"2007-05-15",15606,198,null,null,null,null,null,null,84,633,633,1335,null,84,1,84.01,633,null,0,1,null,633,663,1335,1335]
[null,null,"2007-05-15",15784,173,null,null,null,null,null,null,84,634,634,1335,null,84,1,84.01,634,null,0,1,null,634,664,1335,1335]
[null,null,"2007-05-15",20704,101,null,null,null,null,null,null,85,635,635,1335,null,85,0,85,635,null,0,1,null,635,665,1335,1335]
[null,null,"2007-05-15",34125,109,null,null,null,null,null,null,85,636,636,1335,null,85,1,85.01,636,null,0,1,null,636,666,1335,1335]
[null,null,"2007-05-15",60050,114,null,null,null,null,null,null,85,637,637,1335,null,85,1,85.01,637,null,0,1,null,637,667,1335,1335]
[null,null,"2007-05-15",65387,161,null,null,null,null,null,null,85,638,638,1335,null,85,1,85.01,638,null,0,1,null,638,668,1335,1335]
[null,null,"2007-05-15",2202,443,null,null,null,null,null,null,85,639,639,1335,null,85,1,85.01,639,null,0,1,null,639,669,1335,1335]
[null,null,"2007-05-15",13031,373,null,null,null,null,null,null,85,640,640,1335,null,85,1,85.01,640,null,0,1,null,640,670,1335,1335]
[null,null,"2007-05-15",28409,379,null,null,null,null,null,null,85,641,641,1335,null,85,1,85.01,641,null,{"$f":"IF(W646=MAX($W$6:$W$1340),1,0)","v":0},1,null,641,671,1335,1335]
[null,null,"2007-05-15",23705,464,null,null,null,null,null,null,85,642,642,{"$f":"VLOOKUP(N647,$L$6:$M$1340,2,TRUE)","v":1335},null,85,1,{"$f":"Q647+R647*0.01","v":85.01},642,null,0,{"$f":"AB647-AA647+1","v":1},null,642,{"$f":"Y647+$J$6","v":672},{"$f":"VLOOKUP(Y647,$S$6:$T$1340,2,TRUE)","v":1335},{"$f":"VLOOKUP(Z647,$Q$6:$T$1340,4,TRUE)","v":1335}]
[null,null,"2007-05-15",31585,340,null,null,null,null,null,null,85,643,643,1335,null,85,{"$f":"IF(Q648=Q647,1,0)","v":1},85.01,643,null,0,1,null,643,673,1335,1335]
[null,null,"2007-05-15",37922,352,null,null,null,null,null,null,85,644,644,1335,null,85,1,85.01,644,null,0,1,null,644,674,1335,1335]
[null,null,"2007-05-15",49064,280,null,null,null,null,null,null,86,645,645,1335,null,86,0,86,645,null,0,1,null,645,675,1335,1335]
[null,null,"2007-05-16",14327,45,null,null,null,null,null,null,86,646,646,1335,null,86,1,86.01,646,null,0,1,null,646,676,1335,1335]
[null,null,"2007-05-16",16977,14,null,null,null,null,null,null,86,647,647,1335,null,86,1,86.01,647,null,0,1,null,647,677,1335,1335]
[null,null,"2007-05-16",17239,18,null,null,null,null,null,null,86,648,648,1335,null,86,1,86.01,648,null,0,1,null,648,678,1335,1335]
[null,null,"2007-05-16",17250,25,null,null,null,null,null,null,86,649,649,1335,null,86,1,86.01,649,null,0,1,null,649,679,1335,1335]
[null,null,"2007-05-16",29885,5,null,null,null,null,null,null,86,650,650,1335,null,86,1,86.01,650,null,0,1,null,650,680,1335,1335]
[null,null,"2007-05-16",20063,47,null,null,null,null,null,null,86,651,651,1335,null,86,1,86.01,651,null,0,1,null,651,681,1335,1335]
[null,null,"2007-05-16",25195,21,null,null,null,null,null,null,86,652,652,1335,null,86,1,86.01,652,null,0,1,null,652,682,1335,1335]
[null,null,"2007-05-16",36897,17,null,null,null,null,null,null,86,653,653,1335,null,86,1,86.01,653,null,0,1,null,653,683,1335,1335]
[null,null,"2007-05-16",45512,3,null,null,null,null,null,null,86,654,654,1335,null,86,1,86.01,654,null,0,1,null,654,684,1335,1335]
[null,null,"2007-05-16",77312,20,null,null,null,null,null,null,87,655,655,1335,null,87,0,87,655,null,0,1,null,655,685,1335,1335]
[null,null,"2007-05-16",76825,4,null,null,null,null,null,null,87,656,656,1335,null,87,1,87.01,656,null,0,1,null,656,686,1335,1335]
[null,null,"2007-05-16",93471,25,null,null,null,null,null,null,87,657,657,1335,null,87,1,87.01,657,null,0,1,null,657,687,1335,1335]
[null,null,"2007-05-16",5037,100,null,null,null,null,null,null,87,658,658,1335,null,87,1,87.01,658,null,0,1,null,658,688,1335,1335]
[null,null,"2007-05-16",6940,62,null,null,null,null,null,null,87,659,659,1335,null,87,1,87.01,659,null,0,1,null,659,689,1335,1335]
[null,null,"2007-05-16",8656,78,null,null,null,null,null,null,87,660,660,1335,null,87,1,87.01,660,null,0,1,null,660,690,1335,1335]
[null,null,"2007-05-16",9257,99,null,null,null,null,null,null,87,661,661,1335,null,87,1,87.01,661,null,0,1,null,661,691,1335,1335]
[null,null,"2007-05-16",10020,79,null,null,null,null,null,null,88,662,662,1335,null,88,0,88,662,null,0,1,null,662,692,1335,1335]
[null,null,"2007-05-16",12963,78,null,null,null,null,null,null,88,663,663,1335,null,88,1,88.01,663,null,0,1,null,663,693,1335,1335]
[null,null,"2007-05-16",17066,92,null,null,null,null,null,null,88,664,664,1335,null,88,1,88.01,664,null,0,1,null,664,694,1335,1335]
[null,null,"2007-05-16",15929,94,null,null,null,null,null,null,88,665,665,1335,null,88,1,88.01,665,null,0,1,null,665,695,1335,1335]
[null,null,"2007-05-16",18187,72,null,null,null,null,null,null,88,666,666,1335,null,88,1,88.01,666,null,0,1,null,666,696,1335,1335]
[null,null,"2007-05-16",15783,53,null,null,null,null,null,null,88,667,667,1335,null,88,1,88.01,667,null,0,1,null,667,697,1335,1335]
[null,null,"2007-05-16",27892,88,null,null,null,null,null,null,88,668,668,1335,null,88,1,88.01,668,null,0,1,null,668,698,1335,1335]
[null,null,"2007-05-16",26465,65,null,null,null,null,null,null,89,669,669,1335,null,89,0,89,669,null,0,1,null,669,699,1335,1335]
[null,null,"2007-05-16",59288,86,null,null,null,null,null,null,89,670,670,1335,null,89,1,89.01,670,null,0,1,null,670,700,1335,1335]
[null,null,"2007-05-16",1877,186,null,null,null,null,null,null,89,671,671,1335,null,89,1,89.01,671,null,0,1,null,671,701,1335,1335]
[null,null,"2007-05-16",1110,124,null,null,null,null,null,null,89,672,672,1335,null,89,1,89.01,672,null,0,1,null,672,702,1335,1335]
[null,null,"2007-05-16",7145,128,null,null,null,null,null,null,89,673,673,1335,null,89,1,89.01,673,null,0,1,null,673,703,1335,1335]
[null,null,"2007-05-16",4983,129,null,null,null,null,null,null,89,674,674,1335,null,89,1,89.01,674,null,0,1,null,674,704,1335,1335]
[null,null,"2007-05-16",5609,152,null,null,null,null,null,null,89,675,675,1335,null,89,1,89.01,675,null,0,1,null,675,705,1335,1335]
[null,null,"2007-05-16",16114,153,null,null,null,null,null,null,89,676,676,1335,null,89,1,89.01,676,null,0,1,null,676,706,1335,1335]
[null,null,"2007-05-16",15528,179,null,null,null,null,null,null,90,677,677,1335,null,90,0,90,677,null,0,1,null,677,707,1335,1335]
[null,null,"2007-05-16",26869,146,null,null,null,null,null,null,90,678,678,1335,null,90,1,90.01,678,null,0,1,null,678,708,1335,1335]
[null,null,"2007-05-16",22034,113,null,null,null,null,null,null,90,679,679,1335,null,90,1,90.01,679,null,0,1,null,679,709,1335,1335]
[null,null,"2007-05-16",33693,108,null,null,null,null,null,null,90,680,680,1335,null,90,1,90.01,680,null,0,1,null,680,710,1335,1335]
[null,null,"2007-05-16",46803,168,null,null,null,null,null,null,90,681,681,1335,null,90,1,90.01,681,null,0,1,null,681,711,1335,1335]
[null,null,"2007-05-16",51932,172,null,null,null,null,null,null,90,682,682,1335,null,90,1,90.01,682,null,0,1,null,682,712,1335,1335]
[null,null,"2007-05-16",64782,143,null,null,null,null,null,null,90,683,683,1335,null,90,1,90.01,683,null,0,1,null,683,713,1335,1335]
[null,null,"2007-05-16",68841,198,null,null,null,null,null,null,90,684,684,1335,null,90,1,90.01,684,null,0,1,null,684,714,1335,1335]
[null,null,"2007-05-16",2310,286,null,null,null,null,null,null,91,685,685,1335,null,91,0,91,685,null,0,1,null,685,715,1335,1335]
[null,null,"2007-05-16",2776,457,null,null,null,null,null,null,91,686,686,1335,null,91,1,91.01,686,null,0,1,null,686,716,1335,1335]
[null,null,"2007-05-16",7746,455,null,null,null,null,null,null,91,687,687,1335,null,91,1,91.01,687,null,0,1,null,687,717,1335,1335]
[null,null,"2007-05-16",20290,347,null,null,null,null,null,null,91,688,688,1335,null,91,1,91.01,688,null,0,1,null,688,718,1335,1335]
[null,null,"2007-05-16",33259,442,null,null,null,null,null,null,91,689,689,1335,null,91,1,91.01,689,null,0,1,null,689,719,1335,1335]
[null,null,"2007-05-17",2459,34,null,null,null,null,null,null,91,690,690,1335,null,91,1,91.01,690,null,0,1,null,690,720,1335,1335]
[null,null,"2007-05-17",6206,9,null,null,null,null,null,null,91,691,691,1335,null,91,1,91.01,691,null,0,1,null,691,721,1335,1335]
[null,null,"2007-05-17",19101,29,null,null,null,null,null,null,92,692,692,1335,null,92,0,92,692,null,0,1,null,692,722,1335,1335]
[null,null,"2007-05-17",14647,32,null,null,null,null,null,null,92,693,693,1335,null,92,1,92.01,693,null,0,1,null,693,723,1335,1335]
[null,null,"2007-05-17",23234,45,null,null,null,null,null,null,92,694,694,1335,null,92,1,92.01,694,null,0,1,null,694,724,1335,1335]
[null,null,"2007-05-17",37689,32,null,null,null,null,null,null,92,695,695,1335,null,92,1,92.01,695,null,0,1,null,695,725,1335,1335]
[null,null,"2007-05-17",41931,10,null,null,null,null,null,null,92,696,696,1335,null,92,1,92.01,696,null,0,1,null,696,726,1335,1335]
[null,null,"2007-05-17",43919,2,null,null,null,null,null,null,92,697,697,1335,null,92,1,92.01,697,null,0,1,null,697,727,1335,1335]
[null,null,"2007-05-17",53038,43,null,null,null,null,null,null,92,698,698,1335,null,92,1,92.01,698,null,0,1,null,698,728,1335,1335]
[null,null,"2007-05-17",1473,63,null,null,null,null,null,null,92,699,699,1335,null,92,1,92.01,699,null,0,1,null,699,729,1335,1335]
[null,null,"2007-05-17",4715,92,null,null,null,null,null,null,92,700,700,1335,null,92,1,92.01,700,null,0,1,null,700,730,1335,1335]
[null,null,"2007-05-17",11021,66,null,null,null,null,null,null,93,701,701,1335,null,93,0,93,701,null,0,1,null,701,731,1335,1335]
[null,null,"2007-05-17",17503,98,null,null,null,null,null,null,93,702,702,1335,null,93,1,93.01,702,null,0,1,null,702,732,1335,1335]
[null,null,"2007-05-17",16153,52,null,null,null,null,null,null,93,703,703,1335,null,93,1,93.01,703,null,0,1,null,703,733,1335,1335]
[null,null,"2007-05-17",12351,94,null,null,null,null,null,null,93,704,704,1335,null,93,1,93.01,704,null,0,1,null,704,734,1335,1335]
[null,null,"2007-05-17",17253,60,null,null,null,null,null,null,93,705,705,1335,null,93,1,93.01,705,null,{"$f":"IF(W710=MAX($W$6:$W$1340),1,0)","v":0},1,null,705,735,1335,1335]
[null,null,"2007-05-17",28726,55,null,null,null,null,null,null,93,706,706,{"$f":"VLOOKUP(N711,$L$6:$M$1340,2,TRUE)","v":1335},null,93,1,{"$f":"Q711+R711*0.01","v":93.01},706,null,0,{"$f":"AB711-AA711+1","v":1},null,706,{"$f":"Y711+$J$6","v":736},{"$f":"VLOOKUP(Y711,$S$6:$T$1340,2,TRUE)","v":1335},{"$f":"VLOOKUP(Z711,$Q$6:$T$1340,4,TRUE)","v":1335}]
[null,null,"2007-05-17",28809,99,null,null,null,null,null,null,93,707,707,1335,null,93,{"$f":"IF(Q712=Q711,1,0)","v":1},93.01,707,null,0,1,null,707,737,1335,1335]
[null,null,"2007-05-17",45610,62,null,null,null,null,null,null,93,708,708,1335,null,93,1,93.01,708,null,0,1,null,708,738,1335,1335]
[null,null,"2007-05-17",47794,86,null,null,null,null,null,null,94,709,709,1335,null,94,0,94,709,null,0,1,null,709,739,1335,1335]
[null,null,"2007-05-17",2275,168,null,null,null,null,null,null,94,710,710,1335,null,94,1,94.01,710,null,0,1,null,710,740,1335,1335]
[null,null,"2007-05-17",16843,187,null,null,null,null,null,null,94,711,711,1335,null,94,1,94.01,711,null,0,1,null,711,741,1335,1335]
[null,null,"2007-05-17",16840,139,null,null,null,null,null,null,94,712,712,1335,null,94,1,94.01,712,null,0,1,null,712,742,1335,1335]
[null,null,"2007-05-17",16333,177,null,null,null,null,null,null,94,713,713,1335,null,94,1,94.01,713,null,0,1,null,713,743,1335,1335]
[null,null,"2007-05-17",15308,149,null,null,null,null,null,null,94,714,714,1335,null,94,1,94.01,714,null,0,1,null,714,744,1335,1335]
[null,null,"2007-05-17",12461,128,null,null,null,null,null,null,94,715,715,1335,null,94,1,94.01,715,null,0,1,null,715,745,1335,1335]
[null,null,"2007-05-17",11277,120,null,null,null,null,null,null,95,716,716,1335,null,95,0,95,716,null,0,1,null,716,746,1335,1335]
[null,null,"2007-05-17",13702,133,null,null,null,null,null,null,95,717,717,1335,null,95,1,95.01,717,null,0,1,null,717,747,1335,1335]
[null,null,"2007-05-17",25790,135,null,null,null,null,null,null,95,718,718,1335,null,95,1,95.01,718,null,0,1,null,718,748,1335,1335]
[null,null,"2007-05-17",31614,192,null,null,null,null,null,null,95,719,719,1335,null,95,1,95.01,719,null,0,1,null,719,749,1335,1335]
[null,null,"2007-05-17",46059,146,null,null,null,null,null,null,95,720,720,1335,null,95,1,95.01,720,null,0,1,null,720,750,1335,1335]
[null,null,"2007-05-17",55553,157,null,null,null,null,null,null,95,721,721,1335,null,95,1,95.01,721,null,0,1,null,721,751,1335,1335]
[null,null,"2007-05-17",56948,125,null,null,null,null,null,null,95,722,722,1335,null,95,1,95.01,722,null,0,1,null,722,752,1335,1335]
[null,null,"2007-05-17",51414,147,null,null,null,null,null,null,95,723,723,1335,null,95,1,95.01,723,null,0,1,null,723,753,1335,1335]
[null,null,"2007-05-17",9612,237,null,null,null,null,null,null,95,724,724,1335,null,95,1,95.01,724,null,0,1,null,724,754,1335,1335]
[null,null,"2007-05-17",2059,320,null,null,null,null,null,null,95,725,725,1335,null,95,1,95.01,725,null,0,1,null,725,755,1335,1335]
[null,null,"2007-05-17",1298,218,null,null,null,null,null,null,96,726,726,1335,null,96,0,96,726,null,0,1,null,726,756,1335,1335]
[null,null,"2007-05-17",18574,228,null,null,null,null,null,null,96,727,727,1335,null,96,1,96.01,727,null,0,1,null,727,757,1335,1335]
[null,null,"2007-05-17",16776,225,null,null,null,null,null,null,96,728,728,1335,null,96,1,96.01,728,null,0,1,null,728,758,1335,1335]
[null,null,"2007-05-17",27848,211,null,null,null,null,null,null,96,729,729,1335,null,96,1,96.01,729,null,0,1,null,729,759,1335,1335]
[null,null,"2007-05-17",23448,325,null,null,null,null,null,null,96,730,730,1335,null,96,1,96.01,730,null,0,1,null,730,760,1335,1335]
[null,null,"2007-05-17",35661,462,null,null,null,null,null,null,96,731,731,1335,null,96,1,96.01,731,null,0,1,null,731,761,1335,1335]
[null,null,"2007-05-17",48556,421,null,null,null,null,null,null,96,732,732,1335,null,96,1,96.01,732,null,0,1,null,732,762,1335,1335]
[null,null,"2007-05-18",8437,34,null,null,null,null,null,null,97,733,733,1335,null,97,0,97,733,null,0,1,null,733,763,1335,1335]
[null,null,"2007-05-18",2965,22,null,null,null,null,null,null,97,734,734,1335,null,97,1,97.01,734,null,0,1,null,734,764,1335,1335]
[null,null,"2007-05-18",9849,40,null,null,null,null,null,null,97,735,735,1335,null,97,1,97.01,735,null,0,1,null,735,765,1335,1335]
[null,null,"2007-05-18",7834,16,null,null,null,null,null,null,97,736,736,1335,null,97,1,97.01,736,null,0,1,null,736,766,1335,1335]
[null,null,"2007-05-18",9097,1,null,null,null,null,null,null,98,737,737,1335,null,98,0,98,737,null,0,1,null,737,767,1335,1335]
[null,null,"2007-05-18",5170,3,null,null,null,null,null,null,98,738,738,1335,null,98,1,98.01,738,null,0,1,null,738,768,1335,1335]
[null,null,"2007-05-18",17368,39,null,null,null,null,null,null,98,739,739,1335,null,98,1,98.01,739,null,0,1,null,739,769,1335,1335]
[null,null,"2007-05-18",12164,41,null,null,null,null,null,null,98,740,740,1335,null,98,1,98.01,740,null,0,1,null,740,770,1335,1335]
[null,null,"2007-05-18",17286,1,null,null,null,null,null,null,98,741,741,1335,null,98,1,98.01,741,null,0,1,null,741,771,1335,1335]
[null,null,"2007-05-18",34614,4,null,null,null,null,null,null,98,742,742,1335,null,98,1,98.01,742,null,0,1,null,742,772,1335,1335]
[null,null,"2007-05-18",50959,5,null,null,null,null,null,null,99,743,743,1335,null,99,0,99,743,null,0,1,null,743,773,1335,1335]
[null,null,"2007-05-18",64628,48,null,null,null,null,null,null,99,744,744,1335,null,99,1,99.01,744,null,0,1,null,744,774,1335,1335]
[null,null,"2007-05-18",149,85,null,null,null,null,null,null,99,745,745,1335,null,99,1,99.01,745,null,0,1,null,745,775,1335,1335]
[null,null,"2007-05-18",6964,79,null,null,null,null,null,null,99,746,746,1335,null,99,1,99.01,746,null,0,1,null,746,776,1335,1335]
[null,null,"2007-05-18",14390,76,null,null,null,null,null,null,99,747,747,1335,null,99,1,99.01,747,null,0,1,null,747,777,1335,1335]
[null,null,"2007-05-18",19993,87,null,null,null,null,null,null,99,748,748,1335,null,99,1,99.01,748,null,0,1,null,748,778,1335,1335]
[null,null,"2007-05-18",15808,87,null,null,null,null,null,null,99,749,749,1335,null,99,1,99.01,749,null,0,1,null,749,779,1335,1335]
[null,null,"2007-05-18",23980,68,null,null,null,null,null,null,99,750,750,1335,null,99,1,99.01,750,null,0,1,null,750,780,1335,1335]
[null,null,"2007-05-18",29886,52,null,null,null,null,null,null,100,751,751,1335,null,100,0,100,751,null,0,1,null,751,781,1335,1335]
[null,null,"2007-05-18",24778,92,null,null,null,null,null,null,100,752,752,1335,null,100,1,100.01,752,null,0,1,null,752,782,1335,1335]
[null,null,"2007-05-18",24722,83,null,null,null,null,null,null,100,753,753,1335,null,100,1,100.01,753,null,0,1,null,753,783,1335,1335]
[null,null,"2007-05-18",27766,52,null,null,null,null,null,null,100,754,754,1335,null,100,1,100.01,754,null,0,1,null,754,784,1335,1335]
[null,null,"2007-05-18",39286,83,null,null,null,null,null,null,100,755,755,1335,null,100,1,100.01,755,null,0,1,null,755,785,1335,1335]
[null,null,"2007-05-18",36805,77,null,null,null,null,null,null,100,756,756,1335,null,100,1,100.01,756,null,0,1,null,756,786,1335,1335]
[null,null,"2007-05-18",40653,64,null,null,null,null,null,null,100,757,757,1335,null,100,1,100.01,757,null,0,1,null,757,787,1335,1335]
[null,null,"2007-05-18",42787,86,null,null,null,null,null,null,100,758,758,1335,null,100,1,100.01,758,null,0,1,null,758,788,1335,1335]
[null,null,"2007-05-18",96068,91,null,null,null,null,null,null,100,759,759,1335,null,100,1,100.01,759,null,0,1,null,759,789,1335,1335]
[null,null,"2007-05-18",7409,117,null,null,null,null,null,null,100,760,760,1335,null,100,1,100.01,760,null,0,1,null,760,790,1335,1335]
[null,null,"2007-05-18",17487,116,null,null,null,null,null,null,100,761,761,1335,null,100,1,100.01,761,null,0,1,null,761,791,1335,1335]
[null,null,"2007-05-18",26425,112,null,null,null,null,null,null,101,762,762,1335,null,101,0,101,762,null,0,1,null,762,792,1335,1335]
[null,null,"2007-05-18",27309,133,null,null,null,null,null,null,101,763,763,1335,null,101,1,101.01,763,null,0,1,null,763,793,1335,1335]
[null,null,"2007-05-18",60825,105,null,null,null,null,null,null,101,764,764,1335,null,101,1,101.01,764,null,0,1,null,764,794,1335,1335]
[null,null,"2007-05-18",6972,317,null,null,null,null,null,null,101,765,765,1335,null,101,1,101.01,765,null,0,1,null,765,795,1335,1335]
[null,null,"2007-05-18",10081,208,null,null,null,null,null,null,101,766,766,1335,null,101,1,101.01,766,null,0,1,null,766,796,1335,1335]
[null,null,"2007-05-18",20240,317,null,null,null,null,null,null,101,767,767,1335,null,101,1,101.01,767,null,0,1,null,767,797,1335,1335]
[null,null,"2007-05-18",24028,385,null,null,null,null,null,null,101,768,768,1335,null,101,1,101.01,768,null,0,1,null,768,798,1335,1335]
[null,null,"2007-05-18",34998,401,null,null,null,null,null,null,102,769,769,1335,null,102,0,102,769,null,{"$f":"IF(W774=MAX($W$6:$W$1340),1,0)","v":0},1,null,769,799,1335,1335]
[null,null,"2007-05-18",42676,429,null,null,null,null,null,null,102,770,770,{"$f":"VLOOKUP(N775,$L$6:$M$1340,2,TRUE)","v":1335},null,102,1,{"$f":"Q775+R775*0.01","v":102.01},770,null,0,{"$f":"AB775-AA775+1","v":1},null,770,{"$f":"Y775+$J$6","v":800},{"$f":"VLOOKUP(Y775,$S$6:$T$1340,2,TRUE)","v":1335},{"$f":"VLOOKUP(Z775,$Q$6:$T$1340,4,TRUE)","v":1335}]
[null,null,"2007-05-18",52161,266,null,null,null,null,null,null,102,771,771,1335,null,102,{"$f":"IF(Q776=Q775,1,0)","v":1},102.01,771,null,0,1,null,771,801,1335,1335]
[null,null,"2007-05-18",65887,496,null,null,null,null,null,null,102,772,772,1335,null,102,1,102.01,772,null,0,1,null,772,802,1335,1335]
[null,null,"2007-05-18",75774,381,null,null,null,null,null,null,103,773,773,1335,null,103,0,103,773,null,0,1,null,773,803,1335,1335]
[null,null,"2007-05-19",1986,27,null,null,null,null,null,null,103,774,774,1335,null,103,1,103.01,774,null,0,1,null,774,804,1335,1335]
[null,null,"2007-05-19",3328,29,null,null,null,null,null,null,104,775,775,1335,null,104,0,104,775,null,0,1,null,775,805,1335,1335]
[null,null,"2007-05-19",19968,8,null,null,null,null,null,null,104,776,776,1335,null,104,1,104.01,776,null,0,1,null,776,806,1335,1335]
[null,null,"2007-05-19",17311,18,null,null,null,null,null,null,105,777,777,1335,null,105,0,105,777,null,0,1,null,777,807,1335,1335]
[null,null,"2007-05-19",26051,48,null,null,null,null,null,null,105,778,778,1335,null,105,1,105.01,778,null,0,1,null,778,808,1335,1335]
[null,null,"2007-05-19",38914,39,null,null,null,null,null,null,105,779,779,1335,null,105,1,105.01,779,null,0,1,null,779,809,1335,1335]
[null,null,"2007-05-19",30833,37,null,null,null,null,null,null,105,780,780,1335,null,105,1,105.01,780,null,0,1,null,780,810,1335,1335]
[null,null,"2007-05-19",45291,50,null,null,null,null,null,null,105,781,781,1335,null,105,1,105.01,781,null,0,1,null,781,811,1335,1335]
[null,null,"2007-05-19",51657,10,null,null,null,null,null,null,105,782,782,1335,null,105,1,105.01,782,null,0,1,null,782,812,1335,1335]
[null,null,"2007-05-19",50254,2,null,null,null,null,null,null,105,783,783,1335,null,105,1,105.01,783,null,0,1,null,783,813,1335,1335]
[null,null,"2007-05-19",832,53,null,null,null,null,null,null,106,784,784,1335,null,106,0,106,784,null,0,1,null,784,814,1335,1335]
[null,null,"2007-05-19",16737,70,null,null,null,null,null,null,106,785,785,1335,null,106,1,106.01,785,null,0,1,null,785,815,1335,1335]
[null,null,"2007-05-19",12881,52,null,null,null,null,null,null,106,786,786,1335,null,106,1,106.01,786,null,0,1,null,786,816,1335,1335]
[null,null,"2007-05-19",13944,58,null,null,null,null,null,null,106,787,787,1335,null,106,1,106.01,787,null,0,1,null,787,817,1335,1335]
[null,null,"2007-05-19",27346,56,null,null,null,null,null,null,106,788,788,1335,null,106,1,106.01,788,null,0,1,null,788,818,1335,1335]
[null,null,"2007-05-19",32459,91,null,null,null,null,null,null,106,789,789,1335,null,106,1,106.01,789,null,0,1,null,789,819,1335,1335]
[null,null,"2007-05-19",34231,87,null,null,null,null,null,null,107,790,790,1335,null,107,0,107,790,null,0,1,null,790,820,1335,1335]
[null,null,"2007-05-19",59940,75,null,null,null,null,null,null,107,791,791,1335,null,107,1,107.01,791,null,0,1,null,791,821,1335,1335]
[null,null,"2007-05-19",62558,67,null,null,null,null,null,null,107,792,792,1335,null,107,1,107.01,792,null,0,1,null,792,822,1335,1335]
[null,null,"2007-05-19",87785,83,null,null,null,null,null,null,108,793,793,1335,null,108,0,108,793,null,0,1,null,793,823,1335,1335]
[null,null,"2007-05-19",8911,138,null,null,null,null,null,null,108,794,794,1335,null,108,1,108.01,794,null,0,1,null,794,824,1335,1335]
[null,null,"2007-05-19",18680,126,null,null,null,null,null,null,108,795,795,1335,null,108,1,108.01,795,null,0,1,null,795,825,1335,1335]
[null,null,"2007-05-19",10960,159,null,null,null,null,null,null,108,796,796,1335,null,108,1,108.01,796,null,0,1,null,796,826,1335,1335]
[null,null,"2007-05-19",14193,180,null,null,null,null,null,null,108,797,797,1335,null,108,1,108.01,797,null,0,1,null,797,827,1335,1335]
[null,null,"2007-05-19",24584,171,null,null,null,null,null,null,109,798,798,1335,null,109,0,109,798,null,0,1,null,798,828,1335,1335]
[null,null,"2007-05-19",29569,197,null,null,null,null,null,null,109,799,799,1335,null,109,1,109.01,799,null,0,1,null,799,829,1335,1335]
[null,null,"2007-05-19",22376,131,null,null,null,null,null,null,109,800,800,1335,null,109,1,109.01,800,null,0,1,null,800,830,1335,1335]
[null,null,"2007-05-19",21748,160,null,null,null,null,null,null,110,801,801,1335,null,110,0,110,801,null,0,1,null,801,831,1335,1335]
[null,null,"2007-05-19",37251,184,null,null,null,null,null,null,111,802,802,1335,null,111,0,111,802,null,0,1,null,802,832,1335,1335]
[null,null,"2007-05-19",30526,102,null,null,null,null,null,null,111,803,803,1335,null,111,1,111.01,803,null,0,1,null,803,833,1335,1335]
[null,null,"2007-05-19",44361,180,null,null,null,null,null,null,111,804,804,1335,null,111,1,111.01,804,null,0,1,null,804,834,1335,1335]
[null,null,"2007-05-19",54990,105,null,null,null,null,null,null,111,805,805,1335,null,111,1,111.01,805,null,0,1,null,805,835,1335,1335]
[null,null,"2007-05-19",12210,285,null,null,null,null,null,null,111,806,806,1335,null,111,1,111.01,806,null,0,1,null,806,836,1335,1335]
[null,null,"2007-05-19",14546,500,null,null,null,null,null,null,112,807,807,1335,null,112,0,112,807,null,0,1,null,807,837,1335,1335]
[null,null,"2007-05-19",14499,241,null,null,null,null,null,null,112,808,808,1335,null,112,1,112.01,808,null,0,1,null,808,838,1335,1335]
[null,null,"2007-05-19",36022,282,null,null,null,null,null,null,112,809,809,1335,null,112,1,112.01,809,null,0,1,null,809,839,1335,1335]
[null,null,"2007-05-20",3712,30,null,null,null,null,null,null,112,810,810,1335,null,112,1,112.01,810,null,0,1,null,810,840,1335,1335]
[null,null,"2007-05-20",12996,4,null,null,null,null,null,null,113,811,811,1335,null,113,0,113,811,null,0,1,null,811,841,1335,1335]
[null,null,"2007-05-20",17307,47,null,null,null,null,null,null,114,812,812,1335,null,114,0,114,812,null,0,1,null,812,842,1335,1335]
[null,null,"2007-05-20",23258,34,null,null,null,null,null,null,114,813,813,1335,null,114,1,114.01,813,null,0,1,null,813,843,1335,1335]
[null,null,"2007-05-20",25084,10,null,null,null,null,null,null,115,814,814,1335,null,115,0,115,814,null,0,1,null,814,844,1335,1335]
[null,null,"2007-05-20",31193,39,null,null,null,null,null,null,115,815,815,1335,null,115,1,115.01,815,null,0,1,null,815,845,1335,1335]
[null,null,"2007-05-20",42607,11,null,null,null,null,null,null,116,816,816,1335,null,116,0,116,816,null,0,1,null,816,846,1335,1335]
[null,null,"2007-05-20",40282,46,null,null,null,null,null,null,116,817,817,1335,null,116,1,116.01,817,null,0,1,null,817,847,1335,1335]
[null,null,"2007-05-20",48943,2,null,null,null,null,null,null,117,818,818,1335,null,117,0,117,818,null,0,1,null,818,848,1335,1335]
[null,null,"2007-05-20",54916,27,null,null,null,null,null,null,117,819,819,1335,null,117,1,117.01,819,null,0,1,null,819,849,1335,1335]
[null,null,"2007-05-20",3156,78,null,null,null,null,null,null,117,820,820,1335,null,117,1,117.01,820,null,0,1,null,820,850,1335,1335]
[null,null,"2007-05-20",4618,70,null,null,null,null,null,null,118,821,821,1335,null,118,0,118,821,null,0,1,null,821,851,1335,1335]
[null,null,"2007-05-20",9784,91,null,null,null,null,null,null,118,822,822,1335,null,118,1,118.01,822,null,0,1,null,822,852,1335,1335]
[null,null,"2007-05-20",2182,100,null,null,null,null,null,null,118,823,823,1335,null,118,1,118.01,823,null,0,1,null,823,853,1335,1335]
[null,null,"2007-05-20",10345,93,null,null,null,null,null,null,118,824,824,1335,null,118,1,118.01,824,null,0,1,null,824,854,1335,1335]
[null,null,"2007-05-20",13320,98,null,null,null,null,null,null,119,825,825,1335,null,119,0,119,825,null,0,1,null,825,855,1335,1335]
[null,null,"2007-05-20",13246,96,null,null,null,null,null,null,119,826,826,1335,null,119,1,119.01,826,null,0,1,null,826,856,1335,1335]
[null,null,"2007-05-20",18363,65,null,null,null,null,null,null,120,827,827,1335,null,120,0,120,827,null,0,1,null,827,857,1335,1335]
[null,null,"2007-05-20",29186,83,null,null,null,null,null,null,120,828,828,1335,null,120,1,120.01,828,null,0,1,null,828,858,1335,1335]
[null,null,"2007-05-20",20593,53,null,null,null,null,null,null,120,829,829,1335,null,120,1,120.01,829,null,0,1,null,829,859,1335,1335]
[null,null,"2007-05-20",31893,93,null,null,null,null,null,null,120,830,830,1335,null,120,1,120.01,830,null,0,1,null,830,860,1335,1335]
[null,null,"2007-05-20",39824,71,null,null,null,null,null,null,120,831,831,1335,null,120,1,120.01,831,null,0,1,null,831,861,1335,1335]
[null,null,"2007-05-20",42496,65,null,null,null,null,null,null,120,832,832,1335,null,120,1,120.01,832,null,0,1,null,832,862,1335,1335]
[null,null,"2007-05-20",41501,76,null,null,null,null,null,null,120,833,833,1335,null,120,1,120.01,833,null,{"$f":"IF(W838=MAX($W$6:$W$1340),1,0)","v":0},1,null,833,863,1335,1335]
[null,null,"2007-05-20",76707,54,null,null,null,null,null,null,121,834,834,{"$f":"VLOOKUP(N839,$L$6:$M$1340,2,TRUE)","v":1335},null,121,0,{"$f":"Q839+R839*0.01","v":121},834,null,0,{"$f":"AB839-AA839+1","v":1},null,834,{"$f":"Y839+$J$6","v":864},{"$f":"VLOOKUP(Y839,$S$6:$T$1340,2,TRUE)","v":1335},{"$f":"VLOOKUP(Z839,$Q$6:$T$1340,4,TRUE)","v":1335}]
[null,null,"2007-05-20",3199,180,null,null,null,null,null,null,121,835,835,1335,null,121,{"$f":"IF(Q840=Q839,1,0)","v":1},121.01,835,null,0,1,null,835,865,1335,1335]
[null,null,"2007-05-20",7396,150,null,null,null,null,null,null,121,836,836,1335,null,121,1,121.01,836,null,0,1,null,836,866,1335,1335]
[null,null,"2007-05-20",2666,128,null,null,null,null,null,null,121,837,837,1335,null,121,1,121.01,837,null,0,1,null,837,867,1335,1335]
[null,null,"2007-05-20",10559,157,null,null,null,null,null,null,121,838,838,1335,null,121,1,121.01,838,null,0,1,null,838,868,1335,1335]
[null,null,"2007-05-20",12636,101,null,null,null,null,null,null,121,839,839,1335,null,121,1,121.01,839,null,0,1,null,839,869,1335,1335]
[null,null,"2007-05-20",18455,154,null,null,null,null,null,null,122,840,840,1335,null,122,0,122,840,null,0,1,null,840,870,1335,1335]
[null,null,"2007-05-20",29780,123,null,null,null,null,null,null,122,841,841,1335,null,122,1,122.01,841,null,0,1,null,841,871,1335,1335]
[null,null,"2007-05-20",21875,199,null,null,null,null,null,null,123,842,842,1335,null,123,0,123,842,null,0,1,null,842,872,1335,1335]
[null,null,"2007-05-20",26460,135,null,null,null,null,null,null,123,843,843,1335,null,123,1,123.01,843,null,0,1,null,843,873,1335,1335]
[null,null,"2007-05-20",34904,199,null,null,null,null,null,null,123,844,844,1335,null,123,1,123.01,844,null,0,1,null,844,874,1335,1335]
[null,null,"2007-05-20",32568,120,null,null,null,null,null,null,124,845,845,1335,null,124,0,124,845,null,0,1,null,845,875,1335,1335]
[null,null,"2007-05-20",36158,140,null,null,null,null,null,null,124,846,846,1335,null,124,1,124.01,846,null,0,1,null,846,876,1335,1335]
[null,null,"2007-05-20",1153,224,null,null,null,null,null,null,125,847,847,1335,null,125,0,125,847,null,0,1,null,847,877,1335,1335]
[null,null,"2007-05-20",8030,332,null,null,null,null,null,null,125,848,848,1335,null,125,1,125.01,848,null,0,1,null,848,878,1335,1335]
[null,null,"2007-05-20",3296,227,null,null,null,null,null,null,125,849,849,1335,null,125,1,125.01,849,null,0,1,null,849,879,1335,1335]
[null,null,"2007-05-20",155,221,null,null,null,null,null,null,125,850,850,1335,null,125,1,125.01,850,null,0,1,null,850,880,1335,1335]
[null,null,"2007-05-20",15292,478,null,null,null,null,null,null,126,851,851,1335,null,126,0,126,851,null,0,1,null,851,881,1335,1335]
[null,null,"2007-05-20",25886,369,null,null,null,null,null,null,126,852,852,1335,null,126,1,126.01,852,null,0,1,null,852,882,1335,1335]
[null,null,"2007-05-20",25412,446,null,null,null,null,null,null,126,853,853,1335,null,126,1,126.01,853,null,0,1,null,853,883,1335,1335]
[null,null,"2007-05-20",28183,267,null,null,null,null,null,null,126,854,854,1335,null,126,1,126.01,854,null,0,1,null,854,884,1335,1335]
[null,null,"2007-05-21",1762,5,null,null,null,null,null,null,126,855,855,1335,null,126,1,126.01,855,null,0,1,null,855,885,1335,1335]
[null,null,"2007-05-21",16494,19,null,null,null,null,null,null,127,856,856,1335,null,127,0,127,856,null,0,1,null,856,886,1335,1335]
[null,null,"2007-05-21",13255,38,null,null,null,null,null,null,127,857,857,1335,null,127,1,127.01,857,null,0,1,null,857,887,1335,1335]
[null,null,"2007-05-21",14880,46,null,null,null,null,null,null,127,858,858,1335,null,127,1,127.01,858,null,0,1,null,858,888,1335,1335]
[null,null,"2007-05-21",18871,19,null,null,null,null,null,null,128,859,859,1335,null,128,0,128,859,null,0,1,null,859,889,1335,1335]
[null,null,"2007-05-21",29301,39,null,null,null,null,null,null,128,860,860,1335,null,128,1,128.01,860,null,0,1,null,860,890,1335,1335]
[null,null,"2007-05-21",32785,20,null,null,null,null,null,null,128,861,861,1335,null,128,1,128.01,861,null,0,1,null,861,891,1335,1335]
[null,null,"2007-05-21",38608,34,null,null,null,null,null,null,128,862,862,1335,null,128,1,128.01,862,null,0,1,null,862,892,1335,1335]
[null,null,"2007-05-21",40952,36,null,null,null,null,null,null,128,863,863,1335,null,128,1,128.01,863,null,0,1,null,863,893,1335,1335]
[null,null,"2007-05-21",49699,16,null,null,null,null,null,null,128,864,864,1335,null,128,1,128.01,864,null,0,1,null,864,894,1335,1335]
[null,null,"2007-05-21",61224,1,null,null,null,null,null,null,128,865,865,1335,null,128,1,128.01,865,null,0,1,null,865,895,1335,1335]
[null,null,"2007-05-21",4888,64,null,null,null,null,null,null,129,866,866,1335,null,129,0,129,866,null,0,1,null,866,896,1335,1335]
[null,null,"2007-05-21",4024,74,null,null,null,null,null,null,129,867,867,1335,null,129,1,129.01,867,null,0,1,null,867,897,1335,1335]
[null,null,"2007-05-21",116,66,null,null,null,null,null,null,129,868,868,1335,null,129,1,129.01,868,null,0,1,null,868,898,1335,1335]
[null,null,"2007-05-21",19728,67,null,null,null,null,null,null,129,869,869,1335,null,129,1,129.01,869,null,0,1,null,869,899,1335,1335]
[null,null,"2007-05-21",27439,56,null,null,null,null,null,null,129,870,870,1335,null,129,1,129.01,870,null,0,1,null,870,900,1335,1335]
[null,null,"2007-05-21",23283,61,null,null,null,null,null,null,130,871,871,1335,null,130,0,130,871,null,0,1,null,871,901,1335,1335]
[null,null,"2007-05-21",20970,95,null,null,null,null,null,null,130,872,872,1335,null,130,1,130.01,872,null,0,1,null,872,902,1335,1335]
[null,null,"2007-05-21",44297,100,null,null,null,null,null,null,130,873,873,1335,null,130,1,130.01,873,null,0,1,null,873,903,1335,1335]
[null,null,"2007-05-21",49829,71,null,null,null,null,null,null,131,874,874,1335,null,131,0,131,874,null,0,1,null,874,904,1335,1335]
[null,null,"2007-05-21",56327,99,null,null,null,null,null,null,131,875,875,1335,null,131,1,131.01,875,null,0,1,null,875,905,1335,1335]
[null,null,"2007-05-21",54993,88,null,null,null,null,null,null,131,876,876,1335,null,131,1,131.01,876,null,0,1,null,876,906,1335,1335]
[null,null,"2007-05-21",87035,85,null,null,null,null,null,null,131,877,877,1335,null,131,1,131.01,877,null,0,1,null,877,907,1335,1335]
[null,null,"2007-05-21",60,144,null,null,null,null,null,null,131,878,878,1335,null,131,1,131.01,878,null,0,1,null,878,908,1335,1335]
[null,null,"2007-05-21",3709,184,null,null,null,null,null,null,131,879,879,1335,null,131,1,131.01,879,null,0,1,null,879,909,1335,1335]
[null,null,"2007-05-21",14071,101,null,null,null,null,null,null,132,880,880,1335,null,132,0,132,880,null,0,1,null,880,910,1335,1335]
[null,null,"2007-05-21",17824,161,null,null,null,null,null,null,132,881,881,1335,null,132,1,132.01,881,null,0,1,null,881,911,1335,1335]
[null,null,"2007-05-21",13233,165,null,null,null,null,null,null,133,882,882,1335,null,133,0,133,882,null,0,1,null,882,912,1335,1335]
[null,null,"2007-05-21",21650,159,null,null,null,null,null,null,133,883,883,1335,null,133,1,133.01,883,null,0,1,null,883,913,1335,1335]
[null,null,"2007-05-21",24478,128,null,null,null,null,null,null,133,884,884,1335,null,133,1,133.01,884,null,0,1,null,884,914,1335,1335]
[null,null,"2007-05-21",39648,161,null,null,null,null,null,null,133,885,885,1335,null,133,1,133.01,885,null,0,1,null,885,915,1335,1335]
[null,null,"2007-05-21",41656,122,null,null,null,null,null,null,135,886,886,1335,null,135,0,135,886,null,0,1,null,886,916,1335,1335]
[null,null,"2007-05-21",48879,120,null,null,null,null,null,null,135,887,887,1335,null,135,1,135.01,887,null,0,1,null,887,917,1335,1335]
[null,null,"2007-05-21",46881,171,null,null,null,null,null,null,135,888,888,1335,null,135,1,135.01,888,null,0,1,null,888,918,1335,1335]
[null,null,"2007-05-21",93492,107,null,null,null,null,null,null,135,889,889,1335,null,135,1,135.01,889,null,0,1,null,889,919,1335,1335]
[null,null,"2007-05-21",2799,485,null,null,null,null,null,null,135,890,890,1335,null,135,1,135.01,890,null,0,1,null,890,920,1335,1335]
[null,null,"2007-05-21",14158,425,null,null,null,null,null,null,136,891,891,1335,null,136,0,136,891,null,0,1,null,891,921,1335,1335]
[null,null,"2007-05-21",27408,471,null,null,null,null,null,null,136,892,892,1335,null,136,1,136.01,892,null,0,1,null,892,922,1335,1335]
[null,null,"2007-05-21",23915,434,null,null,null,null,null,null,136,893,893,1335,null,136,1,136.01,893,null,0,1,null,893,923,1335,1335]
[null,null,"2007-05-21",20839,449,null,null,null,null,null,null,136,894,894,1335,null,136,1,136.01,894,null,0,1,null,894,924,1335,1335]
[null,null,"2007-05-21",27172,332,null,null,null,null,null,null,137,895,895,1335,null,137,0,137,895,null,0,1,null,895,925,1335,1335]
[null,null,"2007-05-22",3484,30,null,null,null,null,null,null,137,896,896,1335,null,137,1,137.01,896,null,0,1,null,896,926,1335,1335]
[null,null,"2007-05-22",7281,22,null,null,null,null,null,null,138,897,897,1335,null,138,0,138,897,null,{"$f":"IF(W902=MAX($W$6:$W$1340),1,0)","v":0},1,null,897,927,1335,1335]
[null,null,"2007-05-22",19874,18,null,null,null,null,null,null,138,898,898,{"$f":"VLOOKUP(N903,$L$6:$M$1340,2,TRUE)","v":1335},null,138,1,{"$f":"Q903+R903*0.01","v":138.01},898,null,0,{"$f":"AB903-AA903+1","v":1},null,898,{"$f":"Y903+$J$6","v":928},{"$f":"VLOOKUP(Y903,$S$6:$T$1340,2,TRUE)","v":1335},{"$f":"VLOOKUP(Z903,$Q$6:$T$1340,4,TRUE)","v":1335}]
[null,null,"2007-05-22",10985,34,null,null,null,null,null,null,138,899,899,1335,null,138,{"$f":"IF(Q904=Q903,1,0)","v":1},138.01,899,null,0,1,null,899,929,1335,1335]
[null,null,"2007-05-22",25405,8,null,null,null,null,null,null,138,900,900,1335,null,138,1,138.01,900,null,0,1,null,900,930,1335,1335]
[null,null,"2007-05-22",28533,18,null,null,null,null,null,null,138,901,901,1335,null,138,1,138.01,901,null,0,1,null,901,931,1335,1335]
[null,null,"2007-05-22",27972,41,null,null,null,null,null,null,139,902,902,1335,null,139,0,139,902,null,0,1,null,902,932,1335,1335]
[null,null,"2007-05-22",20942,25,null,null,null,null,null,null,139,903,903,1335,null,139,1,139.01,903,null,0,1,null,903,933,1335,1335]
[null,null,"2007-05-22",24909,35,null,null,null,null,null,null,139,904,904,1335,null,139,1,139.01,904,null,0,1,null,904,934,1335,1335]
[null,null,"2007-05-22",36961,34,null,null,null,null,null,null,139,905,905,1335,null,139,1,139.01,905,null,0,1,null,905,935,1335,1335]
[null,null,"2007-05-22",5968,94,null,null,null,null,null,null,139,906,906,1335,null,139,1,139.01,906,null,0,1,null,906,936,1335,1335]
[null,null,"2007-05-22",1254,94,null,null,null,null,null,null,139,907,907,1335,null,139,1,139.01,907,null,0,1,null,907,937,1335,1335]
[null,null,"2007-05-22",8155,58,null,null,null,null,null,null,140,908,908,1335,null,140,0,140,908,null,0,1,null,908,938,1335,1335]
[null,null,"2007-05-22",17110,80,null,null,null,null,null,null,140,909,909,1335,null,140,1,140.01,909,null,0,1,null,909,939,1335,1335]
[null,null,"2007-05-22",14951,51,null,null,null,null,null,null,140,910,910,1335,null,140,1,140.01,910,null,0,1,null,910,940,1335,1335]
[null,null,"2007-05-22",12651,80,null,null,null,null,null,null,140,911,911,1335,null,140,1,140.01,911,null,0,1,null,911,941,1335,1335]
[null,null,"2007-05-22",22348,90,null,null,null,null,null,null,140,912,912,1335,null,140,1,140.01,912,null,0,1,null,912,942,1335,1335]
[null,null,"2007-05-22",20304,75,null,null,null,null,null,null,140,913,913,1335,null,140,1,140.01,913,null,0,1,null,913,943,1335,1335]
[null,null,"2007-05-22",38590,51,null,null,null,null,null,null,141,914,914,1335,null,141,0,141,914,null,0,1,null,914,944,1335,1335]
[null,null,"2007-05-22",53348,82,null,null,null,null,null,null,141,915,915,1335,null,141,1,141.01,915,null,0,1,null,915,945,1335,1335]
[null,null,"2007-05-22",61432,61,null,null,null,null,null,null,141,916,916,1335,null,141,1,141.01,916,null,0,1,null,916,946,1335,1335]
[null,null,"2007-05-22",5057,130,null,null,null,null,null,null,142,917,917,1335,null,142,0,142,917,null,0,1,null,917,947,1335,1335]
[null,null,"2007-05-22",597,129,null,null,null,null,null,null,142,918,918,1335,null,142,1,142.01,918,null,0,1,null,918,948,1335,1335]
[null,null,"2007-05-22",15533,108,null,null,null,null,null,null,142,919,919,1335,null,142,1,142.01,919,null,0,1,null,919,949,1335,1335]
[null,null,"2007-05-22",22762,147,null,null,null,null,null,null,142,920,920,1335,null,142,1,142.01,920,null,0,1,null,920,950,1335,1335]
[null,null,"2007-05-22",25415,176,null,null,null,null,null,null,143,921,921,1335,null,143,0,143,921,null,0,1,null,921,951,1335,1335]
[null,null,"2007-05-22",31737,139,null,null,null,null,null,null,143,922,922,1335,null,143,1,143.01,922,null,0,1,null,922,952,1335,1335]
[null,null,"2007-05-22",49018,195,null,null,null,null,null,null,143,923,923,1335,null,143,1,143.01,923,null,0,1,null,923,953,1335,1335]
[null,null,"2007-05-22",42636,131,null,null,null,null,null,null,143,924,924,1335,null,143,1,143.01,924,null,0,1,null,924,954,1335,1335]
[null,null,"2007-05-22",55529,168,null,null,null,null,null,null,144,925,925,1335,null,144,0,144,925,null,0,1,null,925,955,1335,1335]
[null,null,"2007-05-22",17259,477,null,null,null,null,null,null,144,926,926,1335,null,144,1,144.01,926,null,0,1,null,926,956,1335,1335]
[null,null,"2007-05-22",17967,219,null,null,null,null,null,null,144,927,927,1335,null,144,1,144.01,927,null,0,1,null,927,957,1335,1335]
[null,null,"2007-05-22",28436,391,null,null,null,null,null,null,144,928,928,1335,null,144,1,144.01,928,null,0,1,null,928,958,1335,1335]
[null,null,"2007-05-22",32523,328,null,null,null,null,null,null,145,929,929,1335,null,145,0,145,929,null,0,1,null,929,959,1335,1335]
[null,null,"2007-05-22",39444,405,null,null,null,null,null,null,146,930,930,1335,null,146,0,146,930,null,0,1,null,930,960,1335,1335]
[null,null,"2007-05-22",43223,211,null,null,null,null,null,null,146,931,931,1335,null,146,1,146.01,931,null,0,1,null,931,961,1335,1335]
[null,null,"2007-05-23",5690,9,null,null,null,null,null,null,146,932,932,1335,null,146,1,146.01,932,null,0,1,null,932,962,1335,1335]
[null,null,"2007-05-23",2842,34,null,null,null,null,null,null,146,933,933,1335,null,146,1,146.01,933,null,0,1,null,933,963,1335,1335]
[null,null,"2007-05-23",25544,22,null,null,null,null,null,null,147,934,934,1335,null,147,0,147,934,null,0,1,null,934,964,1335,1335]
[null,null,"2007-05-23",20349,5,null,null,null,null,null,null,147,935,935,1335,null,147,1,147.01,935,null,0,1,null,935,965,1335,1335]
[null,null,"2007-05-23",34925,26,null,null,null,null,null,null,147,936,936,1335,null,147,1,147.01,936,null,0,1,null,936,966,1335,1335]
[null,null,"2007-05-23",5816,81,null,null,null,null,null,null,147,937,937,1335,null,147,1,147.01,937,null,0,1,null,937,967,1335,1335]
[null,null,"2007-05-23",14664,51,null,null,null,null,null,null,147,938,938,1335,null,147,1,147.01,938,null,0,1,null,938,968,1335,1335]
[null,null,"2007-05-23",11278,52,null,null,null,null,null,null,147,939,939,1335,null,147,1,147.01,939,null,0,1,null,939,969,1335,1335]
[null,null,"2007-05-23",12715,73,null,null,null,null,null,null,147,940,940,1335,null,147,1,147.01,940,null,0,1,null,940,970,1335,1335]
[null,null,"2007-05-23",15943,61,null,null,null,null,null,null,147,941,941,1335,null,147,1,147.01,941,null,0,1,null,941,971,1335,1335]
[null,null,"2007-05-23",17699,69,null,null,null,null,null,null,147,942,942,1335,null,147,1,147.01,942,null,0,1,null,942,972,1335,1335]
[null,null,"2007-05-23",27651,56,null,null,null,null,null,null,148,943,943,1335,null,148,0,148,943,null,0,1,null,943,973,1335,1335]
[null,null,"2007-05-23",24869,67,null,null,null,null,null,null,148,944,944,1335,null,148,1,148.01,944,null,0,1,null,944,974,1335,1335]
[null,null,"2007-05-23",38396,83,null,null,null,null,null,null,149,945,945,1335,null,149,0,149,945,null,0,1,null,945,975,1335,1335]
[null,null,"2007-05-23",50717,54,null,null,null,null,null,null,149,946,946,1335,null,149,1,149.01,946,null,0,1,null,946,976,1335,1335]
[null,null,"2007-05-23",73976,65,null,null,null,null,null,null,150,947,947,1335,null,150,0,150,947,null,0,1,null,947,977,1335,1335]
[null,null,"2007-05-23",4695,196,null,null,null,null,null,null,150,948,948,1335,null,150,1,150.01,948,null,0,1,null,948,978,1335,1335]
[null,null,"2007-05-23",5702,104,null,null,null,null,null,null,150,949,949,1335,null,150,1,150.01,949,null,0,1,null,949,979,1335,1335]
[null,null,"2007-05-23",15249,102,null,null,null,null,null,null,150,950,950,1335,null,150,1,150.01,950,null,0,1,null,950,980,1335,1335]
[null,null,"2007-05-23",12185,138,null,null,null,null,null,null,150,951,951,1335,null,150,1,150.01,951,null,0,1,null,951,981,1335,1335]
[null,null,"2007-05-23",11176,126,null,null,null,null,null,null,150,952,952,1335,null,150,1,150.01,952,null,0,1,null,952,982,1335,1335]
[null,null,"2007-05-23",19758,138,null,null,null,null,null,null,151,953,953,1335,null,151,0,151,953,null,0,1,null,953,983,1335,1335]
[null,null,"2007-05-23",27676,105,null,null,null,null,null,null,151,954,954,1335,null,151,1,151.01,954,null,0,1,null,954,984,1335,1335]
[null,null,"2007-05-23",20114,178,null,null,null,null,null,null,152,955,955,1335,null,152,0,152,955,null,0,1,null,955,985,1335,1335]
[null,null,"2007-05-23",28980,145,null,null,null,null,null,null,152,956,956,1335,null,152,1,152.01,956,null,0,1,null,956,986,1335,1335]
[null,null,"2007-05-23",21410,137,null,null,null,null,null,null,152,957,957,1335,null,152,1,152.01,957,null,0,1,null,957,987,1335,1335]
[null,null,"2007-05-23",34728,149,null,null,null,null,null,null,152,958,958,1335,null,152,1,152.01,958,null,0,1,null,958,988,1335,1335]
[null,null,"2007-05-23",31888,174,null,null,null,null,null,null,153,959,959,1335,null,153,0,153,959,null,0,1,null,959,989,1335,1335]
[null,null,"2007-05-23",36927,131,null,null,null,null,null,null,153,960,960,1335,null,153,1,153.01,960,null,0,1,null,960,990,1335,1335]
[null,null,"2007-05-23",55381,128,null,null,null,null,null,null,154,961,961,1335,null,154,0,154,961,null,{"$f":"IF(W966=MAX($W$6:$W$1340),1,0)","v":0},1,null,961,991,1335,1335]
[null,null,"2007-05-23",73682,195,null,null,null,null,null,null,154,962,962,{"$f":"VLOOKUP(N967,$L$6:$M$1340,2,TRUE)","v":1335},null,154,1,{"$f":"Q967+R967*0.01","v":154.01},962,null,0,{"$f":"AB967-AA967+1","v":1},null,962,{"$f":"Y967+$J$6","v":992},{"$f":"VLOOKUP(Y967,$S$6:$T$1340,2,TRUE)","v":1335},{"$f":"VLOOKUP(Z967,$Q$6:$T$1340,4,TRUE)","v":1335}]
[null,null,"2007-05-23",6571,435,null,null,null,null,null,null,154,963,963,1335,null,154,{"$f":"IF(Q968=Q967,1,0)","v":1},154.01,963,null,0,1,null,963,993,1335,1335]
[null,null,"2007-05-23",536,387,null,null,null,null,null,null,155,964,964,1335,null,155,0,155,964,null,0,1,null,964,994,1335,1335]
[null,null,"2007-05-23",3911,369,null,null,null,null,null,null,155,965,965,1335,null,155,1,155.01,965,null,0,1,null,965,995,1335,1335]
[null,null,"2007-05-23",9909,296,null,null,null,null,null,null,155,966,966,1335,null,155,1,155.01,966,null,0,1,null,966,996,1335,1335]
[null,null,"2007-05-23",19598,205,null,null,null,null,null,null,155,967,967,1335,null,155,1,155.01,967,null,0,1,null,967,997,1335,1335]
[null,null,"2007-05-23",13419,427,null,null,null,null,null,null,156,968,968,1335,null,156,0,156,968,null,0,1,null,968,998,1335,1335]
[null,null,"2007-05-23",20524,252,null,null,null,null,null,null,156,969,969,1335,null,156,1,156.01,969,null,0,1,null,969,999,1335,1335]
[null,null,"2007-05-23",36999,320,null,null,null,null,null,null,157,970,970,1335,null,157,0,157,970,null,0,1,null,970,1000,1335,1335]
[null,null,"2007-05-23",38853,497,null,null,null,null,null,null,157,971,971,1335,null,157,1,157.01,971,null,0,1,null,971,1001,1335,1335]
[null,null,"2007-05-23",51526,420,null,null,null,null,null,null,157,972,972,1335,null,157,1,157.01,972,null,0,1,null,972,1002,1335,1335]
[null,null,"2007-05-24",1348,5,null,null,null,null,null,null,157,973,973,1335,null,157,1,157.01,973,null,0,1,null,973,1003,1335,1335]
[null,null,"2007-05-24",6242,50,null,null,null,null,null,null,157,974,974,1335,null,157,1,157.01,974,null,0,1,null,974,1004,1335,1335]
[null,null,"2007-05-24",7197,48,null,null,null,null,null,null,157,975,975,1335,null,157,1,157.01,975,null,0,1,null,975,1005,1335,1335]
[null,null,"2007-05-24",10138,32,null,null,null,null,null,null,158,976,976,1335,null,158,0,158,976,null,0,1,null,976,1006,1335,1335]
[null,null,"2007-05-24",14944,44,null,null,null,null,null,null,159,977,977,1335,null,159,0,159,977,null,0,1,null,977,1007,1335,1335]
[null,null,"2007-05-24",13711,8,null,null,null,null,null,null,159,978,978,1335,null,159,1,159.01,978,null,0,1,null,978,1008,1335,1335]
[null,null,"2007-05-24",23194,39,null,null,null,null,null,null,159,979,979,1335,null,159,1,159.01,979,null,0,1,null,979,1009,1335,1335]
[null,null,"2007-05-24",27035,50,null,null,null,null,null,null,159,980,980,1335,null,159,1,159.01,980,null,0,1,null,980,1010,1335,1335]
[null,null,"2007-05-24",37672,13,null,null,null,null,null,null,159,981,981,1335,null,159,1,159.01,981,null,0,1,null,981,1011,1335,1335]
[null,null,"2007-05-24",44544,48,null,null,null,null,null,null,159,982,982,1335,null,159,1,159.01,982,null,0,1,null,982,1012,1335,1335]
[null,null,"2007-05-24",54991,15,null,null,null,null,null,null,159,983,983,1335,null,159,1,159.01,983,null,0,1,null,983,1013,1335,1335]
[null,null,"2007-05-24",59611,27,null,null,null,null,null,null,160,984,984,1335,null,160,0,160,984,null,0,1,null,984,1014,1335,1335]
[null,null,"2007-05-24",80507,36,null,null,null,null,null,null,160,985,985,1335,null,160,1,160.01,985,null,0,1,null,985,1015,1335,1335]
[null,null,"2007-05-24",6685,82,null,null,null,null,null,null,160,986,986,1335,null,160,1,160.01,986,null,0,1,null,986,1016,1335,1335]
[null,null,"2007-05-24",5688,65,null,null,null,null,null,null,160,987,987,1335,null,160,1,160.01,987,null,0,1,null,987,1017,1335,1335]
[null,null,"2007-05-24",9818,100,null,null,null,null,null,null,161,988,988,1335,null,161,0,161,988,null,0,1,null,988,1018,1335,1335]
[null,null,"2007-05-24",765,70,null,null,null,null,null,null,161,989,989,1335,null,161,1,161.01,989,null,0,1,null,989,1019,1335,1335]
[null,null,"2007-05-24",14919,74,null,null,null,null,null,null,161,990,990,1335,null,161,1,161.01,990,null,0,1,null,990,1020,1335,1335]
[null,null,"2007-05-24",18123,87,null,null,null,null,null,null,161,991,991,1335,null,161,1,161.01,991,null,0,1,null,991,1021,1335,1335]
[null,null,"2007-05-24",14900,96,null,null,null,null,null,null,161,992,992,1335,null,161,1,161.01,992,null,0,1,null,992,1022,1335,1335]
[null,null,"2007-05-24",19955,97,null,null,null,null,null,null,161,993,993,1335,null,161,1,161.01,993,null,0,1,null,993,1023,1335,1335]
[null,null,"2007-05-24",17229,80,null,null,null,null,null,null,162,994,994,1335,null,162,0,162,994,null,0,1,null,994,1024,1335,1335]
[null,null,"2007-05-24",13464,72,null,null,null,null,null,null,162,995,995,1335,null,162,1,162.01,995,null,0,1,null,995,1025,1335,1335]
[null,null,"2007-05-24",17432,88,null,null,null,null,null,null,162,996,996,1335,null,162,1,162.01,996,null,0,1,null,996,1026,1335,1335]
[null,null,"2007-05-24",21593,54,null,null,null,null,null,null,163,997,997,1335,null,163,0,163,997,null,0,1,null,997,1027,1335,1335]
[null,null,"2007-05-24",21191,95,null,null,null,null,null,null,163,998,998,1335,null,163,1,163.01,998,null,0,1,null,998,1028,1335,1335]
[null,null,"2007-05-24",28997,72,null,null,null,null,null,null,164,999,999,1335,null,164,0,164,999,null,0,1,null,999,1029,1335,1335]
[null,null,"2007-05-24",28221,66,null,null,null,null,null,null,165,1000,1000,1335,null,165,0,165,1000,null,0,1,null,1000,1030,1335,1335]
[null,null,"2007-05-24",22650,66,null,null,null,null,null,null,165,1001,1001,1335,null,165,1,165.01,1001,null,0,1,null,1001,1031,1335,1335]
[null,null,"2007-05-24",38692,98,null,null,null,null,null,null,165,1002,1002,1335,null,165,1,165.01,1002,null,0,1,null,1002,1032,1335,1335]
[null,null,"2007-05-24",42213,77,null,null,null,null,null,null,167,1003,1003,1335,null,167,0,167,1003,null,0,1,null,1003,1033,1335,1335]
[null,null,"2007-05-24",53250,73,null,null,null,null,null,null,167,1004,1004,1335,null,167,1,167.01,1004,null,0,1,null,1004,1034,1335,1335]
[null,null,"2007-05-24",52884,51,null,null,null,null,null,null,167,1005,1005,1335,null,167,1,167.01,1005,null,0,1,null,1005,1035,1335,1335]
[null,null,"2007-05-24",79495,73,null,null,null,null,null,null,168,1006,1006,1335,null,168,0,168,1006,null,0,1,null,1006,1036,1335,1335]
[null,null,"2007-05-24",85142,81,null,null,null,null,null,null,168,1007,1007,1335,null,168,1,168.01,1007,null,0,1,null,1007,1037,1335,1335]
[null,null,"2007-05-24",672,183,null,null,null,null,null,null,168,1008,1008,1335,null,168,1,168.01,1008,null,0,1,null,1008,1038,1335,1335]
[null,null,"2007-05-24",8068,111,null,null,null,null,null,null,168,1009,1009,1335,null,168,1,168.01,1009,null,0,1,null,1009,1039,1335,1335]
[null,null,"2007-05-24",1545,130,null,null,null,null,null,null,169,1010,1010,1335,null,169,0,169,1010,null,0,1,null,1010,1040,1335,1335]
[null,null,"2007-05-24",17872,179,null,null,null,null,null,null,169,1011,1011,1335,null,169,1,169.01,1011,null,0,1,null,1011,1041,1335,1335]
[null,null,"2007-05-24",28042,129,null,null,null,null,null,null,169,1012,1012,1335,null,169,1,169.01,1012,null,0,1,null,1012,1042,1335,1335]
[null,null,"2007-05-24",27873,169,null,null,null,null,null,null,169,1013,1013,1335,null,169,1,169.01,1013,null,0,1,null,1013,1043,1335,1335]
[null,null,"2007-05-24",26109,182,null,null,null,null,null,null,169,1014,1014,1335,null,169,1,169.01,1014,null,0,1,null,1014,1044,1335,1335]
[null,null,"2007-05-24",25996,142,null,null,null,null,null,null,169,1015,1015,1335,null,169,1,169.01,1015,null,0,1,null,1015,1045,1335,1335]
[null,null,"2007-05-24",31696,112,null,null,null,null,null,null,169,1016,1016,1335,null,169,1,169.01,1016,null,0,1,null,1016,1046,1335,1335]
[null,null,"2007-05-24",33789,125,null,null,null,null,null,null,170,1017,1017,1335,null,170,0,170,1017,null,0,1,null,1017,1047,1335,1335]
[null,null,"2007-05-24",36180,125,null,null,null,null,null,null,170,1018,1018,1335,null,170,1,170.01,1018,null,0,1,null,1018,1048,1335,1335]
[null,null,"2007-05-24",40377,151,null,null,null,null,null,null,171,1019,1019,1335,null,171,0,171,1019,null,0,1,null,1019,1049,1335,1335]
[null,null,"2007-05-24",7365,440,null,null,null,null,null,null,171,1020,1020,1335,null,171,1,171.01,1020,null,0,1,null,1020,1050,1335,1335]
[null,null,"2007-05-24",2435,327,null,null,null,null,null,null,171,1021,1021,1335,null,171,1,171.01,1021,null,0,1,null,1021,1051,1335,1335]
[null,null,"2007-05-24",4267,483,null,null,null,null,null,null,171,1022,1022,1335,null,171,1,171.01,1022,null,0,1,null,1022,1052,1335,1335]
[null,null,"2007-05-24",5727,406,null,null,null,null,null,null,172,1023,1023,1335,null,172,0,172,1023,null,0,1,null,1023,1053,1335,1335]
[null,null,"2007-05-24",19110,471,null,null,null,null,null,null,172,1024,1024,1335,null,172,1,172.01,1024,null,0,1,null,1024,1054,1335,1335]
[null,null,"2007-05-24",16846,479,null,null,null,null,null,null,172,1025,1025,1335,null,172,1,172.01,1025,null,{"$f":"IF(W1030=MAX($W$6:$W$1340),1,0)","v":0},1,null,1025,1055,1335,1335]
[null,null,"2007-05-24",16603,363,null,null,null,null,null,null,173,1026,1026,{"$f":"VLOOKUP(N1031,$L$6:$M$1340,2,TRUE)","v":1335},null,173,0,{"$f":"Q1031+R1031*0.01","v":173},1026,null,0,{"$f":"AB1031-AA1031+1","v":1},null,1026,{"$f":"Y1031+$J$6","v":1056},{"$f":"VLOOKUP(Y1031,$S$6:$T$1340,2,TRUE)","v":1335},{"$f":"VLOOKUP(Z1031,$Q$6:$T$1340,4,TRUE)","v":1335}]
[null,null,"2007-05-24",14462,326,null,null,null,null,null,null,173,1027,1027,1335,null,173,{"$f":"IF(Q1032=Q1031,1,0)","v":1},173.01,1027,null,0,1,null,1027,1057,1335,1335]
[null,null,"2007-05-24",24110,355,null,null,null,null,null,null,173,1028,1028,1335,null,173,1,173.01,1028,null,0,1,null,1028,1058,1335,1335]
[null,null,"2007-05-24",26669,301,null,null,null,null,null,null,173,1029,1029,1335,null,173,1,173.01,1029,null,0,1,null,1029,1059,1335,1335]
[null,null,"2007-05-25",5805,22,null,null,null,null,null,null,174,1030,1030,1335,null,174,0,174,1030,null,0,1,null,1030,1060,1335,1335]
[null,null,"2007-05-25",6022,41,null,null,null,null,null,null,174,1031,1031,1335,null,174,1,174.01,1031,null,0,1,null,1031,1061,1335,1335]
[null,null,"2007-05-25",13132,42,null,null,null,null,null,null,174,1032,1032,1335,null,174,1,174.01,1032,null,0,1,null,1032,1062,1335,1335]
[null,null,"2007-05-25",12228,43,null,null,null,null,null,null,175,1033,1033,1335,null,175,0,175,1033,null,0,1,null,1033,1063,1335,1335]
[null,null,"2007-05-25",24388,47,null,null,null,null,null,null,175,1034,1034,1335,null,175,1,175.01,1034,null,0,1,null,1034,1064,1335,1335]
[null,null,"2007-05-25",23450,47,null,null,null,null,null,null,175,1035,1035,1335,null,175,1,175.01,1035,null,0,1,null,1035,1065,1335,1335]
[null,null,"2007-05-25",23247,38,null,null,null,null,null,null,175,1036,1036,1335,null,175,1,175.01,1036,null,0,1,null,1036,1066,1335,1335]
[null,null,"2007-05-25",36852,40,null,null,null,null,null,null,175,1037,1037,1335,null,175,1,175.01,1037,null,0,1,null,1037,1067,1335,1335]
[null,null,"2007-05-25",40634,29,null,null,null,null,null,null,175,1038,1038,1335,null,175,1,175.01,1038,null,0,1,null,1038,1068,1335,1335]
[null,null,"2007-05-25",55909,35,null,null,null,null,null,null,176,1039,1039,1335,null,176,0,176,1039,null,0,1,null,1039,1069,1335,1335]
[null,null,"2007-05-25",71239,26,null,null,null,null,null,null,176,1040,1040,1335,null,176,1,176.01,1040,null,0,1,null,1040,1070,1335,1335]
[null,null,"2007-05-25",94321,47,null,null,null,null,null,null,176,1041,1041,1335,null,176,1,176.01,1041,null,0,1,null,1041,1071,1335,1335]
[null,null,"2007-05-25",9834,100,null,null,null,null,null,null,176,1042,1042,1335,null,176,1,176.01,1042,null,0,1,null,1042,1072,1335,1335]
[null,null,"2007-05-25",3541,79,null,null,null,null,null,null,176,1043,1043,1335,null,176,1,176.01,1043,null,0,1,null,1043,1073,1335,1335]
[null,null,"2007-05-25",1805,77,null,null,null,null,null,null,177,1044,1044,1335,null,177,0,177,1044,null,0,1,null,1044,1074,1335,1335]
[null,null,"2007-05-25",6060,57,null,null,null,null,null,null,177,1045,1045,1335,null,177,1,177.01,1045,null,0,1,null,1045,1075,1335,1335]
[null,null,"2007-05-25",17322,83,null,null,null,null,null,null,177,1046,1046,1335,null,177,1,177.01,1046,null,0,1,null,1046,1076,1335,1335]
[null,null,"2007-05-25",15251,69,null,null,null,null,null,null,177,1047,1047,1335,null,177,1,177.01,1047,null,0,1,null,1047,1077,1335,1335]
[null,null,"2007-05-25",14600,57,null,null,null,null,null,null,177,1048,1048,1335,null,177,1,177.01,1048,null,0,1,null,1048,1078,1335,1335]
[null,null,"2007-05-25",23595,56,null,null,null,null,null,null,178,1049,1049,1335,null,178,0,178,1049,null,0,1,null,1049,1079,1335,1335]
[null,null,"2007-05-25",21922,92,null,null,null,null,null,null,178,1050,1050,1335,null,178,1,178.01,1050,null,0,1,null,1050,1080,1335,1335]
[null,null,"2007-05-25",39671,66,null,null,null,null,null,null,179,1051,1051,1335,null,179,0,179,1051,null,0,1,null,1051,1081,1335,1335]
[null,null,"2007-05-25",37645,73,null,null,null,null,null,null,179,1052,1052,1335,null,179,1,179.01,1052,null,0,1,null,1052,1082,1335,1335]
[null,null,"2007-05-25",43405,91,null,null,null,null,null,null,179,1053,1053,1335,null,179,1,179.01,1053,null,0,1,null,1053,1083,1335,1335]
[null,null,"2007-05-25",44315,95,null,null,null,null,null,null,179,1054,1054,1335,null,179,1,179.01,1054,null,0,1,null,1054,1084,1335,1335]
[null,null,"2007-05-25",48799,85,null,null,null,null,null,null,179,1055,1055,1335,null,179,1,179.01,1055,null,0,1,null,1055,1085,1335,1335]
[null,null,"2007-05-25",43812,88,null,null,null,null,null,null,180,1056,1056,1335,null,180,0,180,1056,null,0,1,null,1056,1086,1335,1335]
[null,null,"2007-05-25",55562,83,null,null,null,null,null,null,180,1057,1057,1335,null,180,1,180.01,1057,null,0,1,null,1057,1087,1335,1335]
[null,null,"2007-05-25",55379,91,null,null,null,null,null,null,180,1058,1058,1335,null,180,1,180.01,1058,null,0,1,null,1058,1088,1335,1335]
[null,null,"2007-05-25",56375,65,null,null,null,null,null,null,180,1059,1059,1335,null,180,1,180.01,1059,null,0,1,null,1059,1089,1335,1335]
[null,null,"2007-05-25",55926,50,null,null,null,null,null,null,181,1060,1060,1335,null,181,0,181,1060,null,0,1,null,1060,1090,1335,1335]
[null,null,"2007-05-25",10785,143,null,null,null,null,null,null,181,1061,1061,1335,null,181,1,181.01,1061,null,0,1,null,1061,1091,1335,1335]
[null,null,"2007-05-25",18439,157,null,null,null,null,null,null,182,1062,1062,1335,null,182,0,182,1062,null,0,1,null,1062,1092,1335,1335]
[null,null,"2007-05-25",16870,193,null,null,null,null,null,null,182,1063,1063,1335,null,182,1,182.01,1063,null,0,1,null,1063,1093,1335,1335]
[null,null,"2007-05-25",16828,200,null,null,null,null,null,null,183,1064,1064,1335,null,183,0,183,1064,null,0,1,null,1064,1094,1335,1335]
[null,null,"2007-05-25",25719,141,null,null,null,null,null,null,183,1065,1065,1335,null,183,1,183.01,1065,null,0,1,null,1065,1095,1335,1335]
[null,null,"2007-05-25",29306,147,null,null,null,null,null,null,183,1066,1066,1335,null,183,1,183.01,1066,null,0,1,null,1066,1096,1335,1335]
[null,null,"2007-05-25",25284,121,null,null,null,null,null,null,183,1067,1067,1335,null,183,1,183.01,1067,null,0,1,null,1067,1097,1335,1335]
[null,null,"2007-05-25",21457,139,null,null,null,null,null,null,183,1068,1068,1335,null,183,1,183.01,1068,null,0,1,null,1068,1098,1335,1335]
[null,null,"2007-05-25",20123,147,null,null,null,null,null,null,184,1069,1069,1335,null,184,0,184,1069,null,0,1,null,1069,1099,1335,1335]
[null,null,"2007-05-25",32767,177,null,null,null,null,null,null,184,1070,1070,1335,null,184,1,184.01,1070,null,0,1,null,1070,1100,1335,1335]
[null,null,"2007-05-25",39360,169,null,null,null,null,null,null,184,1071,1071,1335,null,184,1,184.01,1071,null,0,1,null,1071,1101,1335,1335]
[null,null,"2007-05-25",47207,108,null,null,null,null,null,null,184,1072,1072,1335,null,184,1,184.01,1072,null,0,1,null,1072,1102,1335,1335]
[null,null,"2007-05-25",49090,128,null,null,null,null,null,null,184,1073,1073,1335,null,184,1,184.01,1073,null,0,1,null,1073,1103,1335,1335]
[null,null,"2007-05-25",62341,147,null,null,null,null,null,null,184,1074,1074,1335,null,184,1,184.01,1074,null,0,1,null,1074,1104,1335,1335]
[null,null,"2007-05-25",66756,165,null,null,null,null,null,null,185,1075,1075,1335,null,185,0,185,1075,null,0,1,null,1075,1105,1335,1335]
[null,null,"2007-05-25",11595,450,null,null,null,null,null,null,185,1076,1076,1335,null,185,1,185.01,1076,null,0,1,null,1076,1106,1335,1335]
[null,null,"2007-05-25",15618,498,null,null,null,null,null,null,185,1077,1077,1335,null,185,1,185.01,1077,null,0,1,null,1077,1107,1335,1335]
[null,null,"2007-05-25",28644,308,null,null,null,null,null,null,186,1078,1078,1335,null,186,0,186,1078,null,0,1,null,1078,1108,1335,1335]
[null,null,"2007-05-25",28209,358,null,null,null,null,null,null,186,1079,1079,1335,null,186,1,186.01,1079,null,0,1,null,1079,1109,1335,1335]
[null,null,"2007-05-25",22501,390,null,null,null,null,null,null,186,1080,1080,1335,null,186,1,186.01,1080,null,0,1,null,1080,1110,1335,1335]
[null,null,"2007-05-25",68756,449,null,null,null,null,null,null,186,1081,1081,1335,null,186,1,186.01,1081,null,0,1,null,1081,1111,1335,1335]
[null,null,"2007-05-25",71270,365,null,null,null,null,null,null,187,1082,1082,1335,null,187,0,187,1082,null,0,1,null,1082,1112,1335,1335]
[null,null,"2007-05-26",3337,22,null,null,null,null,null,null,187,1083,1083,1335,null,187,1,187.01,1083,null,0,1,null,1083,1113,1335,1335]
[null,null,"2007-05-26",13371,28,null,null,null,null,null,null,188,1084,1084,1335,null,188,0,188,1084,null,0,1,null,1084,1114,1335,1335]
[null,null,"2007-05-26",16986,10,null,null,null,null,null,null,188,1085,1085,1335,null,188,1,188.01,1085,null,0,1,null,1085,1115,1335,1335]
[null,null,"2007-05-26",15150,34,null,null,null,null,null,null,190,1086,1086,1335,null,190,0,190,1086,null,0,1,null,1086,1116,1335,1335]
[null,null,"2007-05-26",38021,12,null,null,null,null,null,null,190,1087,1087,1335,null,190,1,190.01,1087,null,0,1,null,1087,1117,1335,1335]
[null,null,"2007-05-26",58815,39,null,null,null,null,null,null,190,1088,1088,1335,null,190,1,190.01,1088,null,0,1,null,1088,1118,1335,1335]
[null,null,"2007-05-26",65964,12,null,null,null,null,null,null,190,1089,1089,1335,null,190,1,190.01,1089,null,{"$f":"IF(W1094=MAX($W$6:$W$1340),1,0)","v":0},1,null,1089,1119,1335,1335]
[null,null,"2007-05-26",72823,36,null,null,null,null,null,null,192,1090,1090,{"$f":"VLOOKUP(N1095,$L$6:$M$1340,2,TRUE)","v":1335},null,192,0,{"$f":"Q1095+R1095*0.01","v":192},1090,null,0,{"$f":"AB1095-AA1095+1","v":1},null,1090,{"$f":"Y1095+$J$6","v":1120},{"$f":"VLOOKUP(Y1095,$S$6:$T$1340,2,TRUE)","v":1335},{"$f":"VLOOKUP(Z1095,$Q$6:$T$1340,4,TRUE)","v":1335}]
[null,null,"2007-05-26",97874,7,null,null,null,null,null,null,192,1091,1091,1335,null,192,{"$f":"IF(Q1096=Q1095,1,0)","v":1},192.01,1091,null,0,1,null,1091,1121,1335,1335]
[null,null,"2007-05-26",4278,83,null,null,null,null,null,null,192,1092,1092,1335,null,192,1,192.01,1092,null,0,1,null,1092,1122,1335,1335]
[null,null,"2007-05-26",851,61,null,null,null,null,null,null,193,1093,1093,1335,null,193,0,193,1093,null,0,1,null,1093,1123,1335,1335]
[null,null,"2007-05-26",2225,65,null,null,null,null,null,null,193,1094,1094,1335,null,193,1,193.01,1094,null,0,1,null,1094,1124,1335,1335]
[null,null,"2007-05-26",1847,70,null,null,null,null,null,null,193,1095,1095,1335,null,193,1,193.01,1095,null,0,1,null,1095,1125,1335,1335]
[null,null,"2007-05-26",8821,76,null,null,null,null,null,null,193,1096,1096,1335,null,193,1,193.01,1096,null,0,1,null,1096,1126,1335,1335]
[null,null,"2007-05-26",9306,70,null,null,null,null,null,null,193,1097,1097,1335,null,193,1,193.01,1097,null,0,1,null,1097,1127,1335,1335]
[null,null,"2007-05-26",8029,61,null,null,null,null,null,null,193,1098,1098,1335,null,193,1,193.01,1098,null,0,1,null,1098,1128,1335,1335]
[null,null,"2007-05-26",19669,80,null,null,null,null,null,null,194,1099,1099,1335,null,194,0,194,1099,null,0,1,null,1099,1129,1335,1335]
[null,null,"2007-05-26",16158,92,null,null,null,null,null,null,195,1100,1100,1335,null,195,0,195,1100,null,0,1,null,1100,1130,1335,1335]
[null,null,"2007-05-26",17163,91,null,null,null,null,null,null,195,1101,1101,1335,null,195,1,195.01,1101,null,0,1,null,1101,1131,1335,1335]
[null,null,"2007-05-26",19318,86,null,null,null,null,null,null,195,1102,1102,1335,null,195,1,195.01,1102,null,0,1,null,1102,1132,1335,1335]
[null,null,"2007-05-26",10476,64,null,null,null,null,null,null,195,1103,1103,1335,null,195,1,195.01,1103,null,0,1,null,1103,1133,1335,1335]
[null,null,"2007-05-26",21185,90,null,null,null,null,null,null,196,1104,1104,1335,null,196,0,196,1104,null,0,1,null,1104,1134,1335,1335]
[null,null,"2007-05-26",25303,75,null,null,null,null,null,null,196,1105,1105,1335,null,196,1,196.01,1105,null,0,1,null,1105,1135,1335,1335]
[null,null,"2007-05-26",25951,83,null,null,null,null,null,null,196,1106,1106,1335,null,196,1,196.01,1106,null,0,1,null,1106,1136,1335,1335]
[null,null,"2007-05-26",24999,76,null,null,null,null,null,null,197,1107,1107,1335,null,197,0,197,1107,null,0,1,null,1107,1137,1335,1335]
[null,null,"2007-05-26",39399,66,null,null,null,null,null,null,197,1108,1108,1335,null,197,1,197.01,1108,null,0,1,null,1108,1138,1335,1335]
[null,null,"2007-05-26",42769,99,null,null,null,null,null,null,198,1109,1109,1335,null,198,0,198,1109,null,0,1,null,1109,1139,1335,1335]
[null,null,"2007-05-26",54633,90,null,null,null,null,null,null,198,1110,1110,1335,null,198,1,198.01,1110,null,0,1,null,1110,1140,1335,1335]
[null,null,"2007-05-26",7374,106,null,null,null,null,null,null,198,1111,1111,1335,null,198,1,198.01,1111,null,0,1,null,1111,1141,1335,1335]
[null,null,"2007-05-26",2945,137,null,null,null,null,null,null,199,1112,1112,1335,null,199,0,199,1112,null,0,1,null,1112,1142,1335,1335]
[null,null,"2007-05-26",9477,101,null,null,null,null,null,null,199,1113,1113,1335,null,199,1,199.01,1113,null,0,1,null,1113,1143,1335,1335]
[null,null,"2007-05-26",2698,160,null,null,null,null,null,null,199,1114,1114,1335,null,199,1,199.01,1114,null,0,1,null,1114,1144,1335,1335]
[null,null,"2007-05-26",310,111,null,null,null,null,null,null,200,1115,1115,1335,null,200,0,200,1115,null,0,1,null,1115,1145,1335,1335]
[null,null,"2007-05-26",4677,139,null,null,null,null,null,null,200,1116,1116,1335,null,200,1,200.01,1116,null,0,1,null,1116,1146,1335,1335]
[null,null,"2007-05-26",9020,150,null,null,null,null,null,null,200,1117,1117,1335,null,200,1,200.01,1117,null,0,1,null,1117,1147,1335,1335]
[null,null,"2007-05-26",18507,180,null,null,null,null,null,null,200,1118,1118,1335,null,200,1,200.01,1118,null,0,1,null,1118,1148,1335,1335]
[null,null,"2007-05-26",11974,185,null,null,null,null,null,null,200,1119,1119,1335,null,200,1,200.01,1119,null,0,1,null,1119,1149,1335,1335]
[null,null,"2007-05-26",13426,108,null,null,null,null,null,null,201,1120,1120,1335,null,201,0,201,1120,null,0,1,null,1120,1150,1335,1335]
[null,null,"2007-05-26",23974,121,null,null,null,null,null,null,202,1121,1121,1335,null,202,0,202,1121,null,0,1,null,1121,1151,1335,1335]
[null,null,"2007-05-26",28550,142,null,null,null,null,null,null,204,1122,1122,1335,null,204,0,204,1122,null,0,1,null,1122,1152,1335,1335]
[null,null,"2007-05-26",26106,135,null,null,null,null,null,null,205,1123,1123,1335,null,205,0,205,1123,null,0,1,null,1123,1153,1335,1335]
[null,null,"2007-05-26",20867,105,null,null,null,null,null,null,208,1124,1124,1335,null,208,0,208,1124,null,0,1,null,1124,1154,1335,1335]
[null,null,"2007-05-26",21655,143,null,null,null,null,null,null,208,1125,1125,1335,null,208,1,208.01,1125,null,0,1,null,1125,1155,1335,1335]
[null,null,"2007-05-26",22627,120,null,null,null,null,null,null,209,1126,1126,1335,null,209,0,209,1126,null,0,1,null,1126,1156,1335,1335]
[null,null,"2007-05-26",29291,157,null,null,null,null,null,null,211,1127,1127,1335,null,211,0,211,1127,null,0,1,null,1127,1157,1335,1335]
[null,null,"2007-05-26",31266,105,null,null,null,null,null,null,211,1128,1128,1335,null,211,1,211.01,1128,null,0,1,null,1128,1158,1335,1335]
[null,null,"2007-05-26",40512,173,null,null,null,null,null,null,211,1129,1129,1335,null,211,1,211.01,1129,null,0,1,null,1129,1159,1335,1335]
[null,null,"2007-05-26",58326,139,null,null,null,null,null,null,213,1130,1130,1335,null,213,0,213,1130,null,0,1,null,1130,1160,1335,1335]
[null,null,"2007-05-26",25870,279,null,null,null,null,null,null,216,1131,1131,1335,null,216,0,216,1131,null,0,1,null,1131,1161,1335,1335]
[null,null,"2007-05-26",28198,279,null,null,null,null,null,null,218,1132,1132,1335,null,218,0,218,1132,null,0,1,null,1132,1162,1335,1335]
[null,null,"2007-05-26",21372,476,null,null,null,null,null,null,218,1133,1133,1335,null,218,1,218.01,1133,null,0,1,null,1133,1163,1335,1335]
[null,null,"2007-05-26",38042,402,null,null,null,null,null,null,218,1134,1134,1335,null,218,1,218.01,1134,null,0,1,null,1134,1164,1335,1335]
[null,null,"2007-05-26",30790,488,null,null,null,null,null,null,219,1135,1135,1335,null,219,0,219,1135,null,0,1,null,1135,1165,1335,1335]
[null,null,"2007-05-26",46844,219,null,null,null,null,null,null,219,1136,1136,1335,null,219,1,219.01,1136,null,0,1,null,1136,1166,1335,1335]
[null,null,"2007-05-26",41371,315,null,null,null,null,null,null,221,1137,1137,1335,null,221,0,221,1137,null,0,1,null,1137,1167,1335,1335]
[null,null,"2007-05-27",6133,42,null,null,null,null,null,null,224,1138,1138,1335,null,224,0,224,1138,null,0,1,null,1138,1168,1335,1335]
[null,null,"2007-05-27",18155,28,null,null,null,null,null,null,225,1139,1139,1335,null,225,0,225,1139,null,0,1,null,1139,1169,1335,1335]
[null,null,"2007-05-27",29736,19,null,null,null,null,null,null,226,1140,1140,1335,null,226,0,226,1140,null,0,1,null,1140,1170,1335,1335]
[null,null,"2007-05-27",25219,7,null,null,null,null,null,null,227,1141,1141,1335,null,227,0,227,1141,null,0,1,null,1141,1171,1335,1335]
[null,null,"2007-05-27",39123,4,null,null,null,null,null,null,227,1142,1142,1335,null,227,1,227.01,1142,null,0,1,null,1142,1172,1335,1335]
[null,null,"2007-05-27",56751,5,null,null,null,null,null,null,228,1143,1143,1335,null,228,0,228,1143,null,0,1,null,1143,1173,1335,1335]
[null,null,"2007-05-27",57120,15,null,null,null,null,null,null,229,1144,1144,1335,null,229,0,229,1144,null,0,1,null,1144,1174,1335,1335]
[null,null,"2007-05-27",54200,22,null,null,null,null,null,null,231,1145,1145,1335,null,231,0,231,1145,null,0,1,null,1145,1175,1335,1335]
[null,null,"2007-05-27",5860,77,null,null,null,null,null,null,233,1146,1146,1335,null,233,0,233,1146,null,0,1,null,1146,1176,1335,1335]
[null,null,"2007-05-27",5758,51,null,null,null,null,null,null,234,1147,1147,1335,null,234,0,234,1147,null,0,1,null,1147,1177,1335,1335]
[null,null,"2007-05-27",8310,60,null,null,null,null,null,null,234,1148,1148,1335,null,234,1,234.01,1148,null,0,1,null,1148,1178,1335,1335]
[null,null,"2007-05-27",704,50,null,null,null,null,null,null,236,1149,1149,1335,null,236,0,236,1149,null,0,1,null,1149,1179,1335,1335]
[null,null,"2007-05-27",17011,55,null,null,null,null,null,null,237,1150,1150,1335,null,237,0,237,1150,null,0,1,null,1150,1180,1335,1335]
[null,null,"2007-05-27",24878,65,null,null,null,null,null,null,239,1151,1151,1335,null,239,0,239,1151,null,0,1,null,1151,1181,1335,1335]
[null,null,"2007-05-27",24212,81,null,null,null,null,null,null,241,1152,1152,1335,null,241,0,241,1152,null,0,1,null,1152,1182,1335,1335]
[null,null,"2007-05-27",35710,72,null,null,null,null,null,null,245,1153,1153,1335,null,245,0,245,1153,null,{"$f":"IF(W1158=MAX($W$6:$W$1340),1,0)","v":0},1,null,1153,1183,1335,1335]
[null,null,"2007-05-27",57765,51,null,null,null,null,null,null,252,1154,1154,{"$f":"VLOOKUP(N1159,$L$6:$M$1340,2,TRUE)","v":1335},null,252,0,{"$f":"Q1159+R1159*0.01","v":252},1154,null,0,{"$f":"AB1159-AA1159+1","v":1},null,1154,{"$f":"Y1159+$J$6","v":1184},{"$f":"VLOOKUP(Y1159,$S$6:$T$1340,2,TRUE)","v":1335},{"$f":"VLOOKUP(Z1159,$Q$6:$T$1340,4,TRUE)","v":1335}]
[null,null,"2007-05-27",68717,50,null,null,null,null,null,null,253,1155,1155,1335,null,253,{"$f":"IF(Q1160=Q1159,1,0)","v":0},253,1155,null,0,1,null,1155,1185,1335,1335]
[null,null,"2007-05-27",4058,136,null,null,null,null,null,null,256,1156,1156,1335,null,256,0,256,1156,null,0,1,null,1156,1186,1335,1335]
[null,null,"2007-05-27",7415,108,null,null,null,null,null,null,258,1157,1157,1335,null,258,0,258,1157,null,0,1,null,1157,1187,1335,1335]
[null,null,"2007-05-27",5821,175,null,null,null,null,null,null,258,1158,1158,1335,null,258,1,258.01,1158,null,0,1,null,1158,1188,1335,1335]
[null,null,"2007-05-27",7297,118,null,null,null,null,null,null,259,1159,1159,1335,null,259,0,259,1159,null,0,1,null,1159,1189,1335,1335]
[null,null,"2007-05-27",3458,188,null,null,null,null,null,null,259,1160,1160,1335,null,259,1,259.01,1160,null,0,1,null,1160,1190,1335,1335]
[null,null,"2007-05-27",13556,162,null,null,null,null,null,null,264,1161,1161,1335,null,264,0,264,1161,null,0,1,null,1161,1191,1335,1335]
[null,null,"2007-05-27",10909,141,null,null,null,null,null,null,266,1162,1162,1335,null,266,0,266,1162,null,0,1,null,1162,1192,1335,1335]
[null,null,"2007-05-27",13666,186,null,null,null,null,null,null,267,1163,1163,1335,null,267,0,267,1163,null,0,1,null,1163,1193,1335,1335]
[null,null,"2007-05-27",31554,170,null,null,null,null,null,null,267,1164,1164,1335,null,267,1,267.01,1164,null,0,1,null,1164,1194,1335,1335]
[null,null,"2007-05-27",54907,123,null,null,null,null,null,null,270,1165,1165,1335,null,270,0,270,1165,null,0,1,null,1165,1195,1335,1335]
[null,null,"2007-05-27",5899,492,null,null,null,null,null,null,275,1166,1166,1335,null,275,0,275,1166,null,0,1,null,1166,1196,1335,1335]
[null,null,"2007-05-27",19537,462,null,null,null,null,null,null,278,1167,1167,1335,null,278,0,278,1167,null,0,1,null,1167,1197,1335,1335]
[null,null,"2007-05-27",27929,356,null,null,null,null,null,null,279,1168,1168,1335,null,279,0,279,1168,null,0,1,null,1168,1198,1335,1335]
[null,null,"2007-05-27",34182,270,null,null,null,null,null,null,279,1169,1169,1335,null,279,1,279.01,1169,null,0,1,null,1169,1199,1335,1335]
[null,null,"2007-05-28",6235,43,null,null,null,null,null,null,280,1170,1170,1335,null,280,0,280,1170,null,0,1,null,1170,1200,1335,1335]
[null,null,"2007-05-28",6559,32,null,null,null,null,null,null,281,1171,1171,1335,null,281,0,281,1171,null,0,1,null,1171,1201,1335,1335]
[null,null,"2007-05-28",14132,19,null,null,null,null,null,null,282,1172,1172,1335,null,282,0,282,1172,null,0,1,null,1172,1202,1335,1335]
[null,null,"2007-05-28",11999,48,null,null,null,null,null,null,285,1173,1173,1335,null,285,0,285,1173,null,0,1,null,1173,1203,1335,1335]
[null,null,"2007-05-28",19988,38,null,null,null,null,null,null,286,1174,1174,1335,null,286,0,286,1174,null,0,1,null,1174,1204,1335,1335]
[null,null,"2007-05-28",18100,21,null,null,null,null,null,null,287,1175,1175,1335,null,287,0,287,1175,null,0,1,null,1175,1205,1335,1335]
[null,null,"2007-05-28",23926,3,null,null,null,null,null,null,288,1176,1176,1335,null,288,0,288,1176,null,0,1,null,1176,1206,1335,1335]
[null,null,"2007-05-28",20265,34,null,null,null,null,null,null,289,1177,1177,1335,null,289,0,289,1177,null,0,1,null,1177,1207,1335,1335]
[null,null,"2007-05-28",42728,48,null,null,null,null,null,null,290,1178,1178,1335,null,290,0,290,1178,null,0,1,null,1178,1208,1335,1335]
[null,null,"2007-05-28",89275,47,null,null,null,null,null,null,290,1179,1179,1335,null,290,1,290.01,1179,null,0,1,null,1179,1209,1335,1335]
[null,null,"2007-05-28",6679,77,null,null,null,null,null,null,290,1180,1180,1335,null,290,1,290.01,1180,null,0,1,null,1180,1210,1335,1335]
[null,null,"2007-05-28",7096,90,null,null,null,null,null,null,291,1181,1181,1335,null,291,0,291,1181,null,0,1,null,1181,1211,1335,1335]
[null,null,"2007-05-28",2077,80,null,null,null,null,null,null,292,1182,1182,1335,null,292,0,292,1182,null,0,1,null,1182,1212,1335,1335]
[null,null,"2007-05-28",2185,99,null,null,null,null,null,null,295,1183,1183,1335,null,295,0,295,1183,null,0,1,null,1183,1213,1335,1335]
[null,null,"2007-05-28",15991,55,null,null,null,null,null,null,295,1184,1184,1335,null,295,1,295.01,1184,null,0,1,null,1184,1214,1335,1335]
[null,null,"2007-05-28",13215,70,null,null,null,null,null,null,296,1185,1185,1335,null,296,0,296,1185,null,0,1,null,1185,1215,1335,1335]
[null,null,"2007-05-28",11626,66,null,null,null,null,null,null,300,1186,1186,1335,null,300,0,300,1186,null,0,1,null,1186,1216,1335,1335]
[null,null,"2007-05-28",10168,74,null,null,null,null,null,null,301,1187,1187,1335,null,301,0,301,1187,null,0,1,null,1187,1217,1335,1335]
[null,null,"2007-05-28",11096,74,null,null,null,null,null,null,302,1188,1188,1335,null,302,0,302,1188,null,0,1,null,1188,1218,1335,1335]
[null,null,"2007-05-28",20560,56,null,null,null,null,null,null,305,1189,1189,1335,null,305,0,305,1189,null,0,1,null,1189,1219,1335,1335]
[null,null,"2007-05-28",26444,76,null,null,null,null,null,null,307,1190,1190,1335,null,307,0,307,1190,null,0,1,null,1190,1220,1335,1335]
[null,null,"2007-05-28",41586,64,null,null,null,null,null,null,307,1191,1191,1335,null,307,1,307.01,1191,null,0,1,null,1191,1221,1335,1335]
[null,null,"2007-05-28",52526,56,null,null,null,null,null,null,308,1192,1192,1335,null,308,0,308,1192,null,0,1,null,1192,1222,1335,1335]
[null,null,"2007-05-28",58306,95,null,null,null,null,null,null,308,1193,1193,1335,null,308,1,308.01,1193,null,0,1,null,1193,1223,1335,1335]
[null,null,"2007-05-28",50177,84,null,null,null,null,null,null,309,1194,1194,1335,null,309,0,309,1194,null,0,1,null,1194,1224,1335,1335]
[null,null,"2007-05-28",70088,80,null,null,null,null,null,null,311,1195,1195,1335,null,311,0,311,1195,null,0,1,null,1195,1225,1335,1335]
[null,null,"2007-05-28",1342,194,null,null,null,null,null,null,314,1196,1196,1335,null,314,0,314,1196,null,0,1,null,1196,1226,1335,1335]
[null,null,"2007-05-28",10358,138,null,null,null,null,null,null,315,1197,1197,1335,null,315,0,315,1197,null,0,1,null,1197,1227,1335,1335]
[null,null,"2007-05-28",14043,158,null,null,null,null,null,null,315,1198,1198,1335,null,315,1,315.01,1198,null,0,1,null,1198,1228,1335,1335]
[null,null,"2007-05-28",10222,115,null,null,null,null,null,null,315,1199,1199,1335,null,315,1,315.01,1199,null,0,1,null,1199,1229,1335,1335]
[null,null,"2007-05-28",29475,157,null,null,null,null,null,null,317,1200,1200,1335,null,317,0,317,1200,null,0,1,null,1200,1230,1335,1335]
[null,null,"2007-05-28",26100,173,null,null,null,null,null,null,317,1201,1201,1335,null,317,1,317.01,1201,null,0,1,null,1201,1231,1335,1335]
[null,null,"2007-05-28",26493,126,null,null,null,null,null,null,319,1202,1202,1335,null,319,0,319,1202,null,0,1,null,1202,1232,1335,1335]
[null,null,"2007-05-28",29518,169,null,null,null,null,null,null,319,1203,1203,1335,null,319,1,319.01,1203,null,0,1,null,1203,1233,1335,1335]
[null,null,"2007-05-28",39080,170,null,null,null,null,null,null,320,1204,1204,1335,null,320,0,320,1204,null,0,1,null,1204,1234,1335,1335]
[null,null,"2007-05-28",36554,178,null,null,null,null,null,null,320,1205,1205,1335,null,320,1,320.01,1205,null,0,1,null,1205,1235,1335,1335]
[null,null,"2007-05-28",48121,160,null,null,null,null,null,null,321,1206,1206,1335,null,321,0,321,1206,null,0,1,null,1206,1236,1335,1335]
[null,null,"2007-05-28",54505,115,null,null,null,null,null,null,325,1207,1207,1335,null,325,0,325,1207,null,0,1,null,1207,1237,1335,1335]
[null,null,"2007-05-28",88360,175,null,null,null,null,null,null,325,1208,1208,1335,null,325,1,325.01,1208,null,0,1,null,1208,1238,1335,1335]
[null,null,"2007-05-28",7739,349,null,null,null,null,null,null,326,1209,1209,1335,null,326,0,326,1209,null,0,1,null,1209,1239,1335,1335]
[null,null,"2007-05-28",8391,258,null,null,null,null,null,null,327,1210,1210,1335,null,327,0,327,1210,null,0,1,null,1210,1240,1335,1335]
[null,null,"2007-05-28",13274,416,null,null,null,null,null,null,328,1211,1211,1335,null,328,0,328,1211,null,0,1,null,1211,1241,1335,1335]
[null,null,"2007-05-28",25957,315,null,null,null,null,null,null,331,1212,1212,1335,null,331,0,331,1212,null,0,1,null,1212,1242,1335,1335]
[null,null,"2007-05-28",43999,437,null,null,null,null,null,null,332,1213,1213,1335,null,332,0,332,1213,null,0,1,null,1213,1243,1335,1335]
[null,null,"2007-05-28",43961,307,null,null,null,null,null,null,332,1214,1214,1335,null,332,1,332.01,1214,null,0,1,null,1214,1244,1335,1335]
[null,null,"2007-05-28",56476,363,null,null,null,null,null,null,333,1215,1215,1335,null,333,0,333,1215,null,0,1,null,1215,1245,1335,1335]
[null,null,"2007-05-29",1543,33,null,null,null,null,null,null,334,1216,1216,1335,null,334,0,334,1216,null,0,1,null,1216,1246,1335,1335]
[null,null,"2007-05-29",6237,45,null,null,null,null,null,null,335,1217,1217,1335,null,335,0,335,1217,null,{"$f":"IF(W1222=MAX($W$6:$W$1340),1,0)","v":0},1,null,1217,1247,1335,1335]
[null,null,"2007-05-29",4435,19,null,null,null,null,null,null,340,1218,1218,{"$f":"VLOOKUP(N1223,$L$6:$M$1340,2,TRUE)","v":1335},null,340,0,{"$f":"Q1223+R1223*0.01","v":340},1218,null,0,{"$f":"AB1223-AA1223+1","v":1},null,1218,{"$f":"Y1223+$J$6","v":1248},{"$f":"VLOOKUP(Y1223,$S$6:$T$1340,2,TRUE)","v":1335},{"$f":"VLOOKUP(Z1223,$Q$6:$T$1340,4,TRUE)","v":1335}]
[null,null,"2007-05-29",18765,18,null,null,null,null,null,null,341,1219,1219,1335,null,341,{"$f":"IF(Q1224=Q1223,1,0)","v":0},341,1219,null,0,1,null,1219,1249,1335,1335]
[null,null,"2007-05-29",19207,10,null,null,null,null,null,null,341,1220,1220,1335,null,341,1,341.01,1220,null,0,1,null,1220,1250,1335,1335]
[null,null,"2007-05-29",26875,11,null,null,null,null,null,null,342,1221,1221,1335,null,342,0,342,1221,null,0,1,null,1221,1251,1335,1335]
[null,null,"2007-05-29",34641,24,null,null,null,null,null,null,346,1222,1222,1335,null,346,0,346,1222,null,0,1,null,1222,1252,1335,1335]
[null,null,"2007-05-29",33648,18,null,null,null,null,null,null,347,1223,1223,1335,null,347,0,347,1223,null,0,1,null,1223,1253,1335,1335]
[null,null,"2007-05-29",48502,23,null,null,null,null,null,null,349,1224,1224,1335,null,349,0,349,1224,null,0,1,null,1224,1254,1335,1335]
[null,null,"2007-05-29",83130,36,null,null,null,null,null,null,352,1225,1225,1335,null,352,0,352,1225,null,0,1,null,1225,1255,1335,1335]
[null,null,"2007-05-29",937,71,null,null,null,null,null,null,355,1226,1226,1335,null,355,0,355,1226,null,0,1,null,1226,1256,1335,1335]
[null,null,"2007-05-29",5853,51,null,null,null,null,null,null,356,1227,1227,1335,null,356,0,356,1227,null,0,1,null,1227,1257,1335,1335]
[null,null,"2007-05-29",11184,93,null,null,null,null,null,null,358,1228,1228,1335,null,358,0,358,1228,null,0,1,null,1228,1258,1335,1335]
[null,null,"2007-05-29",18776,64,null,null,null,null,null,null,360,1229,1229,1335,null,360,0,360,1229,null,0,1,null,1229,1259,1335,1335]
[null,null,"2007-05-29",15888,83,null,null,null,null,null,null,360,1230,1230,1335,null,360,1,360.01,1230,null,0,1,null,1230,1260,1335,1335]
[null,null,"2007-05-29",29479,81,null,null,null,null,null,null,363,1231,1231,1335,null,363,0,363,1231,null,0,1,null,1231,1261,1335,1335]
[null,null,"2007-05-29",41690,79,null,null,null,null,null,null,363,1232,1232,1335,null,363,1,363.01,1232,null,0,1,null,1232,1262,1335,1335]
[null,null,"2007-05-29",59223,76,null,null,null,null,null,null,363,1233,1233,1335,null,363,1,363.01,1233,null,0,1,null,1233,1263,1335,1335]
[null,null,"2007-05-29",58921,52,null,null,null,null,null,null,363,1234,1234,1335,null,363,1,363.01,1234,null,0,1,null,1234,1264,1335,1335]
[null,null,"2007-05-29",2590,179,null,null,null,null,null,null,365,1235,1235,1335,null,365,0,365,1235,null,0,1,null,1235,1265,1335,1335]
[null,null,"2007-05-29",3854,121,null,null,null,null,null,null,368,1236,1236,1335,null,368,0,368,1236,null,0,1,null,1236,1266,1335,1335]
[null,null,"2007-05-29",30062,125,null,null,null,null,null,null,369,1237,1237,1335,null,369,0,369,1237,null,0,1,null,1237,1267,1335,1335]
[null,null,"2007-05-29",30307,121,null,null,null,null,null,null,369,1238,1238,1335,null,369,1,369.01,1238,null,0,1,null,1238,1268,1335,1335]
[null,null,"2007-05-29",44129,176,null,null,null,null,null,null,370,1239,1239,1335,null,370,0,370,1239,null,0,1,null,1239,1269,1335,1335]
[null,null,"2007-05-29",59188,159,null,null,null,null,null,null,372,1240,1240,1335,null,372,0,372,1240,null,0,1,null,1240,1270,1335,1335]
[null,null,"2007-05-29",60601,119,null,null,null,null,null,null,373,1241,1241,1335,null,373,0,373,1241,null,0,1,null,1241,1271,1335,1335]
[null,null,"2007-05-29",70879,102,null,null,null,null,null,null,375,1242,1242,1335,null,375,0,375,1242,null,0,1,null,1242,1272,1335,1335]
[null,null,"2007-05-29",319,319,null,null,null,null,null,null,376,1243,1243,1335,null,376,0,376,1243,null,0,1,null,1243,1273,1335,1335]
[null,null,"2007-05-29",26050,218,null,null,null,null,null,null,377,1244,1244,1335,null,377,0,377,1244,null,0,1,null,1244,1274,1335,1335]
[null,null,"2007-05-29",30066,431,null,null,null,null,null,null,379,1245,1245,1335,null,379,0,379,1245,null,0,1,null,1245,1275,1335,1335]
[null,null,"2007-05-29",45602,341,null,null,null,null,null,null,381,1246,1246,1335,null,381,0,381,1246,null,0,1,null,1246,1276,1335,1335]
[null,null,"2007-05-29",55309,267,null,null,null,null,null,null,382,1247,1247,1335,null,382,0,382,1247,null,0,1,null,1247,1277,1335,1335]
[null,null,"2007-05-29",64583,418,null,null,null,null,null,null,383,1248,1248,1335,null,383,0,383,1248,null,0,1,null,1248,1278,1335,1335]
[null,null,"2007-05-30",16783,9,null,null,null,null,null,null,385,1249,1249,1335,null,385,0,385,1249,null,0,1,null,1249,1279,1335,1335]
[null,null,"2007-05-30",10189,50,null,null,null,null,null,null,387,1250,1250,1335,null,387,0,387,1250,null,0,1,null,1250,1280,1335,1335]
[null,null,"2007-05-30",19276,19,null,null,null,null,null,null,387,1251,1251,1335,null,387,1,387.01,1251,null,0,1,null,1251,1281,1335,1335]
[null,null,"2007-05-30",13104,11,null,null,null,null,null,null,388,1252,1252,1335,null,388,0,388,1252,null,0,1,null,1252,1282,1335,1335]
[null,null,"2007-05-30",21817,2,null,null,null,null,null,null,390,1253,1253,1335,null,390,0,390,1253,null,0,1,null,1253,1283,1335,1335]
[null,null,"2007-05-30",23923,23,null,null,null,null,null,null,391,1254,1254,1335,null,391,0,391,1254,null,0,1,null,1254,1284,1335,1335]
[null,null,"2007-05-30",29089,40,null,null,null,null,null,null,396,1255,1255,1335,null,396,0,396,1255,null,0,1,null,1255,1285,1335,1335]
[null,null,"2007-05-30",30661,25,null,null,null,null,null,null,398,1256,1256,1335,null,398,0,398,1256,null,0,1,null,1256,1286,1335,1335]
[null,null,"2007-05-30",44853,3,null,null,null,null,null,null,400,1257,1257,1335,null,400,0,400,1257,null,0,1,null,1257,1287,1335,1335]
[null,null,"2007-05-30",53374,15,null,null,null,null,null,null,400,1258,1258,1335,null,400,1,400.01,1258,null,0,1,null,1258,1288,1335,1335]
[null,null,"2007-05-30",65510,9,null,null,null,null,null,null,400,1259,1259,1335,null,400,1,400.01,1259,null,0,1,null,1259,1289,1335,1335]
[null,null,"2007-05-30",7731,69,null,null,null,null,null,null,401,1260,1260,1335,null,401,0,401,1260,null,0,1,null,1260,1290,1335,1335]
[null,null,"2007-05-30",1674,60,null,null,null,null,null,null,402,1261,1261,1335,null,402,0,402,1261,null,0,1,null,1261,1291,1335,1335]
[null,null,"2007-05-30",3105,85,null,null,null,null,null,null,402,1262,1262,1335,null,402,1,402.01,1262,null,0,1,null,1262,1292,1335,1335]
[null,null,"2007-05-30",10144,79,null,null,null,null,null,null,403,1263,1263,1335,null,403,0,403,1263,null,0,1,null,1263,1293,1335,1335]
[null,null,"2007-05-30",23598,80,null,null,null,null,null,null,405,1264,1264,1335,null,405,0,405,1264,null,0,1,null,1264,1294,1335,1335]
[null,null,"2007-05-30",29812,81,null,null,null,null,null,null,406,1265,1265,1335,null,406,0,406,1265,null,0,1,null,1265,1295,1335,1335]
[null,null,"2007-05-30",35048,85,null,null,null,null,null,null,408,1266,1266,1335,null,408,0,408,1266,null,0,1,null,1266,1296,1335,1335]
[null,null,"2007-05-30",32416,66,null,null,null,null,null,null,410,1267,1267,1335,null,410,0,410,1267,null,0,1,null,1267,1297,1335,1335]
[null,null,"2007-05-30",54071,92,null,null,null,null,null,null,411,1268,1268,1335,null,411,0,411,1268,null,0,1,null,1268,1298,1335,1335]
[null,null,"2007-05-30",68930,57,null,null,null,null,null,null,416,1269,1269,1335,null,416,0,416,1269,null,0,1,null,1269,1299,1335,1335]
[null,null,"2007-05-30",85206,90,null,null,null,null,null,null,418,1270,1270,1335,null,418,0,418,1270,null,0,1,null,1270,1300,1335,1335]
[null,null,"2007-05-30",4186,124,null,null,null,null,null,null,419,1271,1271,1335,null,419,0,419,1271,null,0,1,null,1271,1301,1335,1335]
[null,null,"2007-05-30",8729,107,null,null,null,null,null,null,420,1272,1272,1335,null,420,0,420,1272,null,0,1,null,1272,1302,1335,1335]
[null,null,"2007-05-30",9984,159,null,null,null,null,null,null,420,1273,1273,1335,null,420,1,420.01,1273,null,0,1,null,1273,1303,1335,1335]
[null,null,"2007-05-30",17791,117,null,null,null,null,null,null,421,1274,1274,1335,null,421,0,421,1274,null,0,1,null,1274,1304,1335,1335]
[null,null,"2007-05-30",33231,146,null,null,null,null,null,null,421,1275,1275,1335,null,421,1,421.01,1275,null,0,1,null,1275,1305,1335,1335]
[null,null,"2007-05-30",35198,193,null,null,null,null,null,null,421,1276,1276,1335,null,421,1,421.01,1276,null,0,1,null,1276,1306,1335,1335]
[null,null,"2007-05-30",42836,126,null,null,null,null,null,null,425,1277,1277,1335,null,425,0,425,1277,null,0,1,null,1277,1307,1335,1335]
[null,null,"2007-05-30",54529,153,null,null,null,null,null,null,427,1278,1278,1335,null,427,0,427,1278,null,0,1,null,1278,1308,1335,1335]
[null,null,"2007-05-30",56802,186,null,null,null,null,null,null,427,1279,1279,1335,null,427,1,427.01,1279,null,0,1,null,1279,1309,1335,1335]
[null,null,"2007-05-30",63870,128,null,null,null,null,null,null,428,1280,1280,1335,null,428,0,428,1280,null,0,1,null,1280,1310,1335,1335]
[null,null,"2007-05-30",74006,130,null,null,null,null,null,null,428,1281,1281,1335,null,428,1,428.01,1281,null,{"$f":"IF(W1286=MAX($W$6:$W$1340),1,0)","v":0},1,null,1281,1311,1335,1335]
[null,null,"2007-05-30",11412,368,null,null,null,null,null,null,429,1282,1282,{"$f":"VLOOKUP(N1287,$L$6:$M$1340,2,TRUE)","v":1335},null,429,0,{"$f":"Q1287+R1287*0.01","v":429},1282,null,0,{"$f":"AB1287-AA1287+1","v":1},null,1282,{"$f":"Y1287+$J$6","v":1312},{"$f":"VLOOKUP(Y1287,$S$6:$T$1340,2,TRUE)","v":1335},{"$f":"VLOOKUP(Z1287,$Q$6:$T$1340,4,TRUE)","v":1335}]
[null,null,"2007-05-30",10292,245,null,null,null,null,null,null,431,1283,1283,1335,null,431,{"$f":"IF(Q1288=Q1287,1,0)","v":0},431,1283,null,0,1,null,1283,1313,1335,1335]
[null,null,"2007-05-30",29809,278,null,null,null,null,null,null,434,1284,1284,1335,null,434,0,434,1284,null,0,1,null,1284,1314,1335,1335]
[null,null,"2007-05-30",23708,288,null,null,null,null,null,null,434,1285,1285,1335,null,434,1,434.01,1285,null,0,1,null,1285,1315,1335,1335]
[null,null,"2007-05-30",35180,335,null,null,null,null,null,null,435,1286,1286,1335,null,435,0,435,1286,null,0,1,null,1286,1316,1335,1335]
[null,null,"2007-05-30",54501,360,null,null,null,null,null,null,437,1287,1287,1335,null,437,0,437,1287,null,0,1,null,1287,1317,1335,1335]
[null,null,"2007-05-31",7487,27,null,null,null,null,null,null,437,1288,1288,1335,null,437,1,437.01,1288,null,0,1,null,1288,1318,1335,1335]
[null,null,"2007-05-31",3526,2,null,null,null,null,null,null,440,1289,1289,1335,null,440,0,440,1289,null,0,1,null,1289,1319,1335,1335]
[null,null,"2007-05-31",17996,15,null,null,null,null,null,null,441,1290,1290,1335,null,441,0,441,1290,null,0,1,null,1290,1320,1335,1335]
[null,null,"2007-05-31",29297,34,null,null,null,null,null,null,441,1291,1291,1335,null,441,1,441.01,1291,null,0,1,null,1291,1321,1335,1335]
[null,null,"2007-05-31",22778,45,null,null,null,null,null,null,442,1292,1292,1335,null,442,0,442,1292,null,0,1,null,1292,1322,1335,1335]
[null,null,"2007-05-31",40378,20,null,null,null,null,null,null,443,1293,1293,1335,null,443,0,443,1293,null,0,1,null,1293,1323,1335,1335]
[null,null,"2007-05-31",49494,6,null,null,null,null,null,null,445,1294,1294,1335,null,445,0,445,1294,null,0,1,null,1294,1324,1335,1335]
[null,null,"2007-05-31",42221,15,null,null,null,null,null,null,446,1295,1295,1335,null,446,0,446,1295,null,0,1,null,1295,1325,1335,1335]
[null,null,"2007-05-31",53858,33,null,null,null,null,null,null,449,1296,1296,1335,null,449,0,449,1296,null,0,1,null,1296,1326,1335,1335]
[null,null,"2007-05-31",69790,47,null,null,null,null,null,null,449,1297,1297,1335,null,449,1,449.01,1297,null,0,1,null,1297,1327,1335,1335]
[null,null,"2007-05-31",98256,7,null,null,null,null,null,null,450,1298,1298,1335,null,450,0,450,1298,null,0,1,null,1298,1328,1335,1335]
[null,null,"2007-05-31",2876,71,null,null,null,null,null,null,450,1299,1299,1335,null,450,1,450.01,1299,null,0,1,null,1299,1329,1335,1335]
[null,null,"2007-05-31",6542,81,null,null,null,null,null,null,450,1300,1300,1335,null,450,1,450.01,1300,null,0,1,null,1300,1330,1335,1335]
[null,null,"2007-05-31",473,74,null,null,null,null,null,null,455,1301,1301,1335,null,455,0,455,1301,null,0,1,null,1301,1331,1335,1335]
[null,null,"2007-05-31",9876,51,null,null,null,null,null,null,457,1302,1302,1335,null,457,0,457,1302,null,0,1,null,1302,1332,1335,1335]
[null,null,"2007-05-31",5063,73,null,null,null,null,null,null,462,1303,1303,1335,null,462,0,462,1303,null,0,1,null,1303,1333,1335,1335]
[null,null,"2007-05-31",7068,85,null,null,null,null,null,null,462,1304,1304,1335,null,462,1,462.01,1304,null,0,1,null,1304,1334,1335,1335]
[null,null,"2007-05-31",8921,52,null,null,null,null,null,null,464,1305,1305,1335,null,464,0,464,1305,null,0,1,null,1305,1335,1335,1335]
[null,null,"2007-05-31",1769,63,null,null,null,null,null,null,465,1306,1306,1335,null,465,0,465,1306,null,0,1,null,1306,1336,1335,1335]
[null,null,"2007-05-31",5065,99,null,null,null,null,null,null,470,1307,1307,1335,null,470,0,470,1307,null,0,1,null,1307,1337,1335,1335]
[null,null,"2007-05-31",2795,68,null,null,null,null,null,null,471,1308,1308,1335,null,471,0,471,1308,null,0,1,null,1308,1338,1335,1335]
[null,null,"2007-05-31",17017,83,null,null,null,null,null,null,471,1309,1309,1335,null,471,1,471.01,1309,null,0,1,null,1309,1339,1335,1335]
[null,null,"2007-05-31",13071,76,null,null,null,null,null,null,472,1310,1310,1335,null,472,0,472,1310,null,0,1,null,1310,1340,1335,1335]
[null,null,"2007-05-31",14410,96,null,null,null,null,null,null,473,1311,1311,1335,null,473,0,473,1311,null,0,1,null,1311,1341,1335,1335]
[null,null,"2007-05-31",13578,89,null,null,null,null,null,null,476,1312,1312,1335,null,476,0,476,1312,null,0,1,null,1312,1342,1335,1335]
[null,null,"2007-05-31",15688,52,null,null,null,null,null,null,477,1313,1313,1335,null,477,0,477,1313,null,0,1,null,1313,1343,1335,1335]
[null,null,"2007-05-31",29274,58,null,null,null,null,null,null,477,1314,1314,1335,null,477,1,477.01,1314,null,0,1,null,1314,1344,1335,1335]
[null,null,"2007-05-31",26239,73,null,null,null,null,null,null,478,1315,1315,1335,null,478,0,478,1315,null,0,1,null,1315,1345,1335,1335]
[null,null,"2007-05-31",39861,70,null,null,null,null,null,null,478,1316,1316,1335,null,478,1,478.01,1316,null,0,1,null,1316,1346,1335,1335]
[null,null,"2007-05-31",34135,54,null,null,null,null,null,null,479,1317,1317,1335,null,479,0,479,1317,null,0,1,null,1317,1347,1335,1335]
[null,null,"2007-05-31",35630,83,null,null,null,null,null,null,482,1318,1318,1335,null,482,0,482,1318,null,0,1,null,1318,1348,1335,1335]
[null,null,"2007-05-31",33892,66,null,null,null,null,null,null,483,1319,1319,1335,null,483,0,483,1319,null,0,1,null,1319,1349,1335,1335]
[null,null,"2007-05-31",45640,92,null,null,null,null,null,null,483,1320,1320,1335,null,483,1,483.01,1320,null,0,1,null,1320,1350,1335,1335]
[null,null,"2007-05-31",45113,96,null,null,null,null,null,null,485,1321,1321,1335,null,485,0,485,1321,null,0,1,null,1321,1351,1335,1335]
[null,null,"2007-05-31",12972,193,null,null,null,null,null,null,488,1322,1322,1335,null,488,0,488,1322,null,0,1,null,1322,1352,1335,1335]
[null,null,"2007-05-31",20162,167,null,null,null,null,null,null,488,1323,1323,1335,null,488,1,488.01,1323,null,0,1,null,1323,1353,1335,1335]
[null,null,"2007-05-31",52790,144,null,null,null,null,null,null,488,1324,1324,1335,null,488,1,488.01,1324,null,0,1,null,1324,1354,1335,1335]
[null,null,"2007-05-31",51306,148,null,null,null,null,null,null,488,1325,1325,1335,null,488,1,488.01,1325,null,0,1,null,1325,1355,1335,1335]
[null,null,"2007-05-31",61230,199,null,null,null,null,null,null,489,1326,1326,1335,null,489,0,489,1326,null,0,1,null,1326,1356,1335,1335]
[null,null,"2007-05-31",65588,152,null,null,null,null,null,null,492,1327,1327,1335,null,492,0,492,1327,null,0,1,null,1327,1357,1335,1335]
[null,null,"2007-05-31",78737,169,null,null,null,null,null,null,494,1328,1328,1335,null,494,0,494,1328,null,0,1,null,1328,1358,1335,1335]
[null,null,"2007-05-31",11207,291,null,null,null,null,null,null,495,1329,1329,1335,null,495,0,495,1329,null,0,1,null,1329,1359,1335,1335]
[null,null,"2007-05-31",29708,341,null,null,null,null,null,null,496,1330,1330,1335,null,496,0,496,1330,null,0,1,null,1330,1360,1335,1335]
[null,null,"2007-05-31",29968,325,null,null,null,null,null,null,496,1331,1331,1335,null,496,1,496.01,1331,null,0,1,null,1331,1361,1335,1335]
[null,null,"2007-05-31",29036,411,null,null,null,null,null,null,497,1332,1332,1335,null,497,0,497,1332,null,0,1,null,1332,1362,1335,1335]
[null,null,"2007-05-31",36255,375,null,null,null,null,null,null,497,1333,1333,1335,null,497,1,497.01,1333,null,0,1,null,1333,1363,1335,1335]
[null,null,"2007-05-31",33662,305,null,null,null,null,null,null,498,1334,1334,1335,null,498,0,498,1334,null,0,1,null,1334,1364,1335,1335]
[null,null,"2007-05-31",47005,275,null,null,null,null,null,null,500,1335,1335,1335,null,500,0,500,1335,null,0,1,null,1335,1365,1335,1335]