{"text_format":"1","workbook":"xlsx","n_sheets":43,"sheets":["Start","Vorlage","Vorlage_","Zufallszahlen","Zufallszahlen_","Alles was Sie brauchen ist …","01 Sortieren","01 Sortieren_","02 Filtern","02 Filtern_","03 Leer","04 SUMMEWENN","04 SUMMEWENN_","05 Daten für SUMMEWENNS","05 SUMMEWENNS","05 SUMMEWENNS_","06 Teilergebnis","06 Teilergebnis_","07 Pivot (Daten)","07 Pivot (Daten)_","08 Pivot (Tabelle)","08 Pivot (Tabelle)_","09 Pivot (Tipps&Tricks)","10 Pivot (Datenschnitte)","10 Pivot (Datenschnitte)_","11 Pivot (Berechnetes Feld)","11 Pivot (Berechnetes Feld)_","12 Pivot (Berechnetes Element)","12 Pivot (Berechnetes Element)_","13 Pivot (Diagramm)","13 Pivot (Diagramm)_","14 Übungsdaten (1)","15 Übungsdaten (2)","16 Zahlen als Text","17 BEREICH.VERSCHIEBEN()","18 Liste fortschreiben (1)","19 Liste fortschreiben (2)","20 Liste fortschreiben (3)","21 Liste fortschreiben (4)","22 Liste fortschreiben (5)","22 Liste fortschreiben (5)_","Firmen","Waren"],"not_rendered":{"charts":4,"images":36,"macros":1,"external_links":0,"defined_names":34,"comments":0,"pivot_tables":8},"unopened":[],"bounds":{"document_bytes":16777216,"sheet_cells":100000,"rows_first":2000,"rows_last":500,"rows_between":2000,"halvings":0,"cell_chars":16384,"cell_head_chars":4096},"cells_cut":0,"cells_raw":0,"read":"whole","date_system":"1900"}

{"sheet":"Start","index":0,"n_rows":34,"n_cols":9,"rows_kept":34,"cut":false,"hidden":false,"merged":[[35,10,35,13],[1,1,1,4],[2,1,2,4],[35,6,35,9],[5,5,33,5],[5,6,33,6]]}
[null,null,null,null,null,1,2,null,0]
[1,"Start"]
[2,"Start"]
[]
[0,null,null,2,0]
[null,null,"Start",null,null,"For many basic Excel techniques, which are used here in this file, there are detailed explanations in the file \"Excel-Basics\".\n\nTherefore - if here in this file it is said \"Do this … and that …\" and you don't know how to do it - please have a look into the file \"Excel-Basics\". Hopefully you will find the needed explanations there. \n\nIf not - send me a short notice to stern@jade-hs.de!\n\nBefore you start working with this file you should definitely work through the two sheets \"How to make notes\" and \"Help ...\" in the file \"Excel-Basics\"!\n\nIf the buttons for language switching don't work, please click the following:\n\nFile / Options / Trust Center / Trust Center Settings / Macro Settings / Enable All Macros \n\nThen close and re-open this file again.","Zu vielen grundlegenen Excel-Techniken, die hier in dieser Datei benutzt werden, gibt es detaillierte Erläuterungen in der Datei \"Excel-Basics\".\n\nWenn es daher in dieser Datei heißt \"Machen Sie dieses … und jenes …\" und Sie wissen nicht wie - sehen Sie bitte in der Datei \"Excel-Basics\" nach. Hoffentlich finden Sie dort die benötigten Erklärungen.\n\nWenn nicht - schicken Sie mir bitte einen Hinweis an stern@jade-hs.de!\n\nBevor Sie beginnen, mit dieser Datei zu arbeiten, sollten Sie aber auf jeden Fall zuerst die beiden Blätter \"Notizen machen\" und \"Hilfe ...\" in der Datei \"Excel-Basics\" durchgearbeitet haben!\n\nWenn die Buttons zur Sprachumschaltung nicht funktionieren, klicken Sie bitte folgendes an:\n\nDatei / Optionen / Trust-Center / Einstellungen für das Trust-Center / Makroeinstellungen / Alle Makros aktivieren\n\nDann diese Datei schließen und erneut öffnen."]
[null,null,"Vorlage"]
[null,null,"Zufallszahlen"]
[null,null,"Alles was Sie brauchen ist …",null,980.25]
[null,null,"01 Sortieren",null,82.5]
[null,null,"02 Filtern",null,0]
[null,null,"03 Leer"]
[null,null,"04 SUMMEWENN"]
[null,null,"05 Daten für SUMMEWENNS"]
[null,null,"05 SUMMEWENNS"]
[null,null,"06 Teilergebnis"]
[null,null,"07 Pivot (Daten)"]
[null,null,"08 Pivot (Tabelle)"]
[null,null,"09 Pivot (Tipps&Tricks)"]
[null,null,"10 Pivot (Datenschnitte)"]
[null,null,"11 Pivot (Berechnetes Feld)"]
[null,null,"12 Pivot (Berechnetes Element)"]
[null,null,"13 Pivot (Diagramm)"]
[null,null,"14 Übungsdaten (1)"]
[null,null,"15 Übungsdaten (2)"]
[null,null,"16 Zahlen als Text"]
[null,null,"17 BEREICH.VERSCHIEBEN()"]
[null,null,"18 Liste fortschreiben (1)"]
[null,null,"19 Liste fortschreiben (2)"]
[null,null,"20 Liste fortschreiben (3)"]
[null,null,"21 Liste fortschreiben (4)"]
[null,null,"22 Liste fortschreiben (5)"]
[null,null,"Firmen"]
[null,null,"Waren"]

{"sheet":"Vorlage","index":1,"n_rows":6,"n_cols":6,"rows_kept":6,"cut":false,"hidden":false,"merged":[[1,1,1,4],[2,1,2,4]]}
[null,null,null,null,null,0]
[1,"Template",null,null,null,"Back to Start"]
[2,"Vorlage",null,null,null,"Startseite"]
[]
[]
[0]

{"sheet":"Vorlage_","index":2,"n_rows":7,"n_cols":8,"rows_kept":7,"cut":false,"hidden":true,"merged":[]}
[null,2,2,2,1,1,1,0]
[1,"Template_",null,null,null,{"$f":"B2","v":"Template_"}]
[2,"Vorlage_"]
[0]
[null,1,"In meinen Übungsdateien können Sie nicht wie üblich durch Klick auf das Pluszeichen ein neues Arbeitsblatt anlegen. \n\nWenn Sie ein neues Blatt brauchen, müssen Sie eine Kopie des Blattes \"Vorlage\" anlegen.\n\nACHTUNG: Denken Sie daran, die Option \"Kopie erstellen\" zu aktivieren!\n\n\n\n",null,1,"In my exercise files you cannot create a new worksheet by clicking on the plus sign as usual. \n\nIf you need a new sheet, you have to create a copy of the sheet \"Template\".\n\nATTENTION: Please remember to activate the option \"Create copy\"!\n\n\n"]
[null,{"$f":"IF(C6<>\"\",B5+1,\"\")","v":2},"Nachdem Sie eine Kopie dieses Blattes angelegt haben, ändern Sie dessen Namen NICHT wie üblich unten auf dem Register.\n\nStattdessen schreiben Sie den Blattnamen in die Zelle B3 des kopierten Blattes.\n\nAnschließend wechseln Sie auf das \"Start\"-Blatt und klicken dort erneut auf den Sprachbutton. \n\nDann müssen Sie evtl. etwas Geduld haben, weil Excel alle Blätter - auch die ausgeblendeten mit den Videotexten - durchgeht, um sie in's Inhaltsverzeichnis aufzunehmen.\n\nDer neue Name erscheint dann in der Liste der Blätter auf dem \"Start\"-Blatt und auf dem Register des kopierten Blattes.",null,{"$f":"IF(F6<>\"\",E5+1,\"\")","v":2},"After you have created a copy of this sheet, DO NOT change its name as usual at the bottom of the tab.\n\nInstead, write the sheet name in cell B2 of the copied sheet.\n\nThen switch to the \"Start\" page and click on the language button again. \n\nThen you may have to have some patience, because Excel goes through all sheets - even the hidden ones with the video texts - to include them into the table of contents.\n\nThe new name then appears in the list of sheets on the \"Start\" sheet and on the tab of the copied sheet."]
[null,{"$f":"IF(C7<>\"\",B6+1,\"\")","v":""}]

{"sheet":"Zufallszahlen","index":3,"n_rows":44,"n_cols":10,"rows_kept":44,"cut":false,"hidden":false,"merged":[[42,2,42,8],[1,1,1,4],[2,1,2,4],[41,2,41,8],[4,2,8,9],[9,2,12,9]]}
[null,null,null,null,null,null,null,null,null,0]
[1,"Random numbers",null,null,null,"Back to Start"]
[2,"Zufallszahlen",null,null,null,"Startseite"]
[]
[2,"Achtung","Wenn Sie nach dem Drücken von Strg-Umschalt-N eine Fehlermeldung bekommen, müssen Sie zunächst die Makros aktivieren:\n\n\"Datei / Optionen / Trust Center / Einstellungen für das Trust Center / Makroeinstellungen\"\n\"Alle Makros aktivieren / OK / OK\""]
[2]
[2]
[2]
[2]
[1,"Attention","If you see an error message after pressing Ctrl-Shift-N you have to activate the macros first:\n\n\"File / Options / Trust Center / Trust Center Settings / Macro Settings\"\n\"Enable all macros / OK / OK\""]
[1]
[1]
[1]
[]
[]
[]
[]
[]
[]
[]
[]
[]
[]
[]
[]
[]
[]
[]
[]
[]
[]
[]
[]
[]
[]
[]
[]
[]
[]
[]
[]
[1,"Exercise","Try it!"]
[2,"Übung","Probieren Sie es aus!"]
[0]

{"sheet":"Zufallszahlen_","index":4,"n_rows":7,"n_cols":8,"rows_kept":7,"cut":false,"hidden":true,"merged":[]}
[null,2,2,2,1,1,1,0]
[1,"Random numbers_",null,null,null,{"$f":"B2","v":"Random numbers_"}]
[2,"Zufallszahlen_"]
[0]
[null,1,"Diese Excel-Datei enthält ein Formular zur Generierung von Zufallszahlen.\n\nSie können es mit der Tastenkombination Strg-Umschalt-N öffnen.\n\nDann können Sie es benutzen, um sich schnell beliebige Mengen von Übungsdaten zu generieren!",null,1,"This Excel file contains a form for the generation of random numbers.\n\nYou can open it with the shortcut Ctrl-Shift-N.\n\nThen you can use it to generate very quickly any number of trial data!"]
[null,{"$f":"IF(C6<>\"\",B5+1,\"\")","v":2},"Dazu müssen Sie zuerst einen Bereich markieren, der mit Zufallszahlen gefüllt werden soll. Dieser Bereich kann auch aus mehreren nicht zusammenhängenden Teilbereichen bestehen! (markieren mit gedrückter Strg-Taste)\n\nDann geben Sie die Parameter für die Generierung der Zufallszahlen ein und drücken \"Bereich(e) füllen\".\n\nSie können auswählen, ob\n- ein Teil der Zellen leer bleiben soll,\n- ein Teil der Zahlen negativ sein soll,\n- nur ganze Zahlen generiert werden sollen.\n\nMit dem Button \"Bereich(e) leeren\" können Sie … ok … das muss ich wohl nicht beschreiben.",null,{"$f":"IF(F6<>\"\",E5+1,\"\")","v":2},"To do this, you must first select a range to be filled with random numbers. This range can also consist of several non-contiguous sub ranges! (selected with pressed Ctrl key)\n\nThen enter the parameters for the generation of the random numbers and press \"Fill range(s)\".\n\nYou can choose whether\n- some of the cells should remain empty,\n- some of the numbers should be negative,\n- only integer numbers should be generated.\n\nWith the button \"Clear range(s)\" you can ... ok ... I don't have to describe that.\n\n"]
[null,{"$f":"IF(C7<>\"\",B6+1,\"\")","v":""},null,null,{"$f":"IF(F7<>\"\",E6+1,\"\")","v":""}]

{"sheet":"Alles was Sie brauchen ist …","index":5,"n_rows":32,"n_cols":15,"rows_kept":32,"cut":false,"hidden":false,"merged":[[1,1,1,4],[2,1,2,4],[4,6,7,8],[4,10,7,12],[9,6,15,8],[9,10,15,12],[17,6,25,8],[17,10,25,12],[31,6,31,9],[31,10,31,13],[27,6,27,9],[27,10,27,13],[28,6,29,9],[28,10,29,13],[30,6,30,9],[30,10,30,13]]}
[null,null,null,null,null,null,1,1,1,1,2,2,2,2,0]
[1,"All you need is …",null,null,null,"Back to Start"]
[2,"Alles was Sie brauchen ist …",null,null,null,"Startseite"]
[]
[0,null,null,null,null,null,"Our main objective for the work with lists is to \"squeeze\" information from the data!",null,null,null,"Unser Hauptziel bei der Arbeit mit Listen ist, aus den Daten Informationen \"heraus zu pressen\"!"]
[]
[]
[]
[]
[null,null,null,null,null,null,"Data are simply a collection of characters in a certain arrangement (letters, numbers, special characters).\n\nExample: A list with all the orders of our customers in the current year.",null,null,null,"Daten sind einfach eine Ansammlung von Zeichen in einer bestimmten Anordnung (Buchstaben, Ziffern, Sonderzeichen).\nBeispiel: Eine Liste aller Kundenaufträge des laufenden Jahres"]
[]
[]
[]
[]
[]
[]
[]
[null,null,null,null,null,null,"Information is a set of ordered and/or \"sqeezed\" data, which can be understood and interpreted by a person.\n\nExample: The percentage-wise share (=calculated!) of each single customer of the total turnover in the category \"beverages\" (=filtered!).",null,null,null,"Informationen sind geordnete bzw. komprimierte Daten, die ein Mensch erfassen und deuten kann.\n\nBeispiel: Der prozentuale Anteil (=berechnet!) jedes einzelnen Kunden am Gesamtumsatz in der Kategorie \"Getränke\" (=gefiltert!)."]
[]
[]
[]
[]
[]
[]
[]
[]
[]
[null,null,null,null,null,null,"All you need is …",null,null,null,"Alles was Sie brauchen ist …"]
[null,null,null,null,null,null,"… Information!",null,null,null,"… Informationen!"]
[]
[null,null,null,null,null,null,"Managers make decisions!",null,null,null,"Führungskräfte fällen Entscheidungen!"]
[null,null,null,null,null,null,"Decisions are based on information!",null,null,null,"Entscheidungen basieren auf Informationen!"]

{"sheet":"01 Sortieren","index":6,"n_rows":67,"n_cols":15,"rows_kept":67,"cut":false,"hidden":false,"merged":[[47,2,55,6],[56,2,63,6],[13,2,15,6],[17,8,37,10],[17,11,37,13],[1,1,1,4],[2,1,2,4],[4,2,6,6],[7,2,9,6],[10,2,12,6]]}
[null,null,null,null,null,null,null,null,1,1,1,2,2,2,0]
[1,"01 Sort",null,null,null,"Back to Start"]
[2,"01 Sortieren",null,null,null,"Startseite"]
[]
[2,"Kriterienspalten","Diese Spalten enthalten Kriterien, nach denen Sie die Daten sortieren, filtern oder in irgendeiner anderen Weise verdichten können."]
[2]
[2]
[2,"Datenspalten","Diese Spalten enthalten die eigentlichen Daten, die sortiert, gefiltert, oder in irgendeiner anderen Weise verdichtet werden sollen"]
[2]
[2]
[1,"criteria columns","These columns contain criteria, which may be used to sort, to filter or to \"squeeze\" the data in any other way."]
[1]
[1]
[1,"data columns","These columns contain the data, which shall be sorted, filtered or \"squeezed\" in any other way."]
[1]
[1]
[]
[null,null,"branch","customer","quarter","sales","orders",null,"Don't highlight any range of cells!\nClick only in one cell inside the list!\n\n\nData / \"Sort & Filter\" / \"A>Z\" or \"Z>A\" or \"Sort\"\n\nWith \"Sort\" several sorting levels are possible.\n\nConsider absolutely \"My data has headers\"! (must be \"have\" :-)\n\nThis setting remains valid also for the click on \"A->Z\" and \"Z->A\", respectively. Then the header may disappear suddenly!",null,null,"Sie brauchen nichts zu markieren! Klicken Sie einfach irgendeine Zelle innerhalb der Liste an!\n\nDaten / \"Sortieren und Filtern\" / \"A>Z\" oder \"Z>A\" oder \"Sortieren\"\n\nMit \"Sortieren\" sind mehrere Sortier-Ebenen möglich.\n\nBeachten Sie unbedingt \"Daten haben Überschriften\"! \n\nDiese Einstellung bleibt auch für den Klick auf \"A->Z\" bzw. \"Z->A\" erhalten. Dann ist u.U. die Überschrift plötzlich verschwunden!"]
[null,null,"Bremen","Shell",4,66745,138]
[null,null,"Bremen","Shell",3,72436,127]
[null,null,"Bremen","Shell",2,78647,120]
[null,null,"Bremen","Shell",1,80425,111]
[null,null,"Bremen","Esso",1,112536,92]
[null,null,"Bremen","Esso",3,111525,89]
[null,null,"Bremen","Esso",4,124978,96]
[null,null,"Bremen","Esso",2,131845,90]
[null,null,"Hamburg","Shell",1,78176,66]
[null,null,"Hamburg","Shell",3,88111,68]
[null,null,"Hamburg","Shell",2,82789,63]
[null,null,"Hamburg","Shell",4,94512,59]
[null,null,"Hamburg","Esso",3,213999,119]
[null,null,"Hamburg","Esso",2,224924,122]
[null,null,"Hamburg","Aral",3,35712,19]
[null,null,"Hamburg","Esso",1,243890,123]
[null,null,"Hamburg","Aral",1,38523,19]
[null,null,"Hamburg","Aral",4,32677,15]
[null,null,"Hamburg","Aral",2,39467,17]
[null,null,"Oldenburg","Shell",2,112967,92]
[null,null,"Oldenburg","Shell",3,121210,98]
[null,null,"Oldenburg","Aral",1,31243,25]
[null,null,"Oldenburg","Shell",4,119891,94]
[null,null,"Oldenburg","Shell",1,123124,88]
[null,null,"Oldenburg","Aral",2,33756,24]
[null,null,"Oldenburg","Aral",3,38299,21]
[null,null,"Oldenburg","Aral",4,35900,19]
[]
[]
[2,"Achtung","Wenn Sie vor dem Sortieren nichts markieren, erkennt Excel selber, welcher Bereich sortiert werden soll. Das klappt aber nur, wenn dieser Bereich links, rechts, oben und unten von Leerzeilen und -spalten begrenzt wird.\n\nTest: Tragen Sie mal in H17 eine Zahl ein (irgendeine!) und klicken Sie dann auf \"Daten / Sortieren und Filtern / Sortieren\". Dann werden Sie sehen, dass Excel den falschen Bereich markiert!"]
[2]
[2]
[2]
[2]
[2]
[2]
[2]
[2]
[1,"Attention","If you do not select anything before sorting, Excel itself recognizes which area is to be sorted. However, this only works if the area on the left, right, top and bottom is bordered by blank rows and columns.\n\nTest: Enter a number in H17 (any one!) and click on \"Data / Sort & Filter / Sort\". Then you will see that Excel marks the wrong area!"]
[1]
[1]
[1]
[1]
[1]
[1]
[1]
[]
[]
[0]

{"sheet":"01 Sortieren_","index":7,"n_rows":14,"n_cols":8,"rows_kept":14,"cut":false,"hidden":true,"merged":[]}
[null,2,2,2,1,1,1,0]
[1,"01 Sort_",null,null,null,{"$f":"B2","v":"01 Sort_"}]
[2,"01 Sortieren_"]
[0]
[null,1,"Bei der Bearbeitung von Datenlisten geht es immer darum, eine große Anzahl von Daten übersichtlich darzustellen, so dass Sie daraus Informationen gewinnen können. Die erste und einfachste Technik ist das Sortieren der Liste.\n\nSehen wir uns die Liste erst einmal an. Sie enthält zwei unterschiedliche Arten von Spalten: Kriterienspalten (=Spalten, nach denen man sortieren oder filtern kann) und Datenspalten (=die zu den Kriterien gehörigen Werte; i.A. Zahlen).",null,1,"When processing data lists, it is always a question of presenting a large amount of data in a clear way so that you can gain information from it. The first and easiest technique is to sort the list.\n\nLet's take a look at the list first. It contains two different types of columns: Criteria columns (=columns by which you can sort or filter) and data columns (=the values belonging to the criteria; usually numbers).\n"]
[null,{"$f":"IF(C6<>\"\",B5+1,\"\")","v":2},"Das Sortieren können Sie auf zwei unterschiedliche Arten starten:\n\n- im Menü \"Start\" und\n- im Menü \"Daten\"\n\nDas Ergebnis ist dasselbe. In beiden Fällen gibt es zwei \"Schnellbuttons\" und einen \"Komfortbutton\" (meine eigene Bezeichnung ;-)\n\nMit den \"Schnellbuttons\" können Sie die Liste auf- oder absteigend sortieren - und zwar nach der Spalte, in der Sie VORHER eine Zelle angeklickt haben.\nEINE ZELLE - nicht die ganze Spalte markieren!!",null,{"$f":"IF(F6<>\"\",E5+1,\"\")","v":2},"You can start sorting in two different ways:\n\n- in the \"Start\" menu and\n- in the \"Data\" menu\n\nThe result is the same. In both cases there are two \"quick buttons\" and one \"comfort button\" (my own name ;-)\n\nWith the \"quick buttons\" you can sort the list in ascending or descending order - by the column in which you clicked on a cell BEFORE.\nONE CELL - do not select the whole column!"]
[null,{"$f":"IF(C7<>\"\",B6+1,\"\")","v":3},"ACHTUNG: Das funktioniert nur, wenn die Liste rundherum durch Leerzeilen und -spalten vom übrigen Inhalt des Blattes abgegrenzt ist. Nur dann erkennt Excel anhand der angeklickten Zelle selber, wo sich die Liste befindet.\n\nMachen Sie mal folgendes Experiment: Schreiben Sie eine Zahl in Zelle H17. Jetzt funktioniert das nicht mehr! Jetzt müssen Sie tatsächlich die gesamte Liste mit der Maus markieren - oder Sie müssen Ihr Blatt so organisieren, dass rund um die Liste wieder Leerzeilen und -spalten sind.\n\nBeachten Sie: Wenn Sie die Liste markieren und dann auf \"A>Z\" bzw. \"Z>A\" klicken, wird nach der ERSTEN Spalte sortiert. Wenn Sie nach einer anderen Spalte sortieren wollen, müssen Sie den \"Komfortbutton\" benutzen.",null,{"$f":"IF(F7<>\"\",E6+1,\"\")","v":3},"ATTENTION: This only works if the list is separated from the rest of the sheet by blank rows and columns. Only then Excel can recognize where the list is located by the clicked cell itself.\n\nDo the following experiment: Write a number in cell H17. Now this won't work anymore! Now you really have to select the entire list with the mouse - or you have to organize your sheet so that there are empty rows and columns around the list.\n\nNote: If you select the list and then click on \"A>Z\" or \"Z>A\", the list will be sorted by the FIRST column. If you want to sort by a different column, you have to use the \"comfort button\".\n"]
[null,{"$f":"IF(C8<>\"\",B7+1,\"\")","v":4},"Kommen wir jetzt zum \"Komfortbutton\". Um ihn zu benutzen, müssen Sie eine beliebige Zelle in der Liste anklicken. Dann können Sie detailliert festlegen, nach welcher Spalte wie sortiert werden soll.\n\nBeachten Sie die Option \"Daten haben Überschriften\"!\n\nSie können auch mehrere Sortier-Ebenen definieren - es soll also z.B. ERST nach Niederlassung und DANN nach Kunde sortiert werden.\n\nACHTUNG: \nÜber \"Optionen\" können Sie auch HORIZONTALE LISTEN nach Spalten sortieren!",null,null,"Now let's get to the \"comfort button\". To use it, you must click on any cell in the list. Then you can specify in detail by which column and how it should be sorted.\n\nNote the option \"My data has headers\"! (should be \"have\" ;-)\n\nYou can also define several sorting levels - e.g. it should be sorted FIRST by branch and THEN by customer.\n\nATTENTION: \nWith \"Options\" you can also sort HORIZONTAL LISTS by columns!"]
[null,5,"Jetzt kommt der Hinweis auf eine Gemeinheit des \"Komfortbuttons\":\n\nExcel merkt sich die Einstellung \"Daten haben Überschriften\" und wendet sie auch bei den \"Schnellbuttons\" an! Wenn Ihre Liste also Überschriften hat, sie aber die Option \"Daten haben Überschriften\" deaktivieren, werden diese beim Sortieren wie Daten behandelt und mit einsortiert.\n\nBei einer sehr langen Liste kann es dann passieren, dass Ihre Überschriften ganz nach unten rutschen und damit verschwunden sind!\n",null,null,"Now comes the hint of a nastiness of the \"comfort button\":\n\nExcel remembers the setting \"My data has headers\" and applies it also to the \"Quick buttons\"! So if your data have headers, but you deactivate the option \"My data has headers\", they will be treated like data when sorting and will be sorted.\n\nIf your list is very long, it can happen that your headers slide down to the bottom and disappear!"]
[null,""]
[null,""]
[null,""]
[null,""]
[null,""]

{"sheet":"02 Filtern","index":8,"n_rows":40,"n_cols":15,"rows_kept":40,"cut":false,"hidden":false,"merged":[[1,1,1,4],[2,1,2,4],[12,8,22,10],[12,11,22,13],[4,4,4,7],[6,4,6,7],[8,4,8,7],[10,4,10,7]]}
[null,null,null,null,null,null,null,null,1,1,1,2,2,2,0]
[1,"02 Filter",null,null,null,"Back to Start"]
[2,"02 Filtern",null,null,null,"Startseite"]
[]
[2,"Textfilter","z.B. \"Enthält …\"",null,"-> \"Benutzerdefinierte Filter\" -> \"Und\" / \"Oder\""]
[2]
[2,"Zahlenfilter","z.B. \"Top 10\"",null,"-> \"Benutzerdefinierte Filter\" -> \"Und\" / \"Oder\""]
[2]
[1,"Text Filters","e.g. \"Contains …\"",null,"-> \"Custom Filter\" -> \"And\" / \"Or\""]
[1]
[1,"Number Filters","e.g. \"Top 10\"",null,"-> \"Custom Filter\" -> \"And\" / \"Or\""]
[1]
[null,null,"branch","customer","quarter","sales","orders",null,"Don't highlight any range of cells!\nClick only in one cell inside the list!\n\n\nData / \"Sort & Filter\" / \"Filter\"",null,null,"Sie brauchen nichts zu markieren! Klicken Sie einfach irgendeine Zelle innerhalb der Liste an!\n\nDaten / \"Sortieren und Filtern\" / \"Filtern\"\n"]
[null,null,"Bremen","Shell",4,66745,138]
[null,null,"Bremen","Shell",3,72436,127]
[null,null,"Bremen","Shell",2,78647,120]
[null,null,"Bremen","Shell",1,80425,111]
[null,null,"Bremen","Esso",1,112536,92]
[null,null,"Bremen","Esso",3,111525,89]
[null,null,"Bremen","Esso",4,124978,96]
[null,null,"Bremen","Esso",2,131845,90]
[null,null,"Hamburg","Shell",1,78176,66]
[null,null,"Hamburg","Shell",3,88111,68]
[null,null,"Hamburg","Shell",2,82789,63]
[null,null,"Hamburg","Shell",4,94512,59]
[null,null,"Hamburg","Esso",3,213999,119]
[null,null,"Hamburg","Esso",2,224924,122]
[null,null,"Hamburg","Aral",3,35712,19]
[null,null,"Hamburg","Esso",1,243890,123]
[null,null,"Hamburg","Aral",1,38523,19]
[null,null,"Hamburg","Aral",4,32677,15]
[null,null,"Hamburg","Aral",2,39467,17]
[null,null,"Oldenburg","Shell",2,112967,92]
[null,null,"Oldenburg","Shell",3,121210,98]
[null,null,"Oldenburg","Aral",1,31243,25]
[null,null,"Oldenburg","Shell",4,119891,94]
[null,null,"Oldenburg","Shell",1,123124,88]
[null,null,"Oldenburg","Aral",2,33756,24]
[0,null,"Oldenburg","Aral",3,38299,21]
[null,null,"Oldenburg","Aral",4,35900,19]

{"sheet":"02 Filtern_","index":9,"n_rows":7,"n_cols":8,"rows_kept":7,"cut":false,"hidden":true,"merged":[]}
[null,2,2,2,1,1,1,0]
[1,"02 Filter_",null,null,null,{"$f":"B2","v":"02 Filter_"}]
[2,"02 Filtern_"]
[0]
[null,1,"Neben dem Sortieren ist das Filtern eine einfache Technik, um Übersicht in eine lange und unübersichtliche Datenliste zu bringen. Die Wirkung des Filterns ist noch offensichtlicher, weil es die Menge der angezeigten Daten reduziert und alleine dadurch schon zur Übersichtlichkeit beiträgt.\n\nDas Filtern können Sie auf zwei unterschiedliche Arten einschalten:\n\n- im Menü \"Start\" und\n- im Menü \"Daten\"\n\nDas Ergebnis ist dasselbe. In beiden Fällen erscheinen neben den Spaltenüberschriften Buttons, mit denen sich die Filteroptionen aufklappen lassen. Hier können Sie übrigens auch nochmal sortieren - interessanterweise auch nach Farben!",null,1,"In addition to sorting, filtering is a simple technique to bring clarity to a long and confusing data list. The effect of filtering is even more obvious, because it reduces the amount of data displayed, which in itself contributes to clarity.\n\nYou can activate filtering in two different ways:\n\n- in the \"Start\" menu and\n- in the \"Data\" menu\n\nThe result is the same. In both cases, buttons appear next to the column headers to expand the filter options. By the way, you can also sort again here - interestingly, also by color!"]
[null,{"$f":"IF(C6<>\"\",B5+1,\"\")","v":2},"Erste und einfachste Filterung: Sie wählen für eine oder mehrere Spalten die anzuzeigenden Werte aus.\n\nWenn Sie gesetzte Filter löschen wollen, können Sie das für jeden Filter einzeln tun - oder über das Menü \"Daten\" für alle Filter gleichzeitig.",null,{"$f":"IF(F6<>\"\",E5+1,\"\")","v":2},"First and easiest filtering: You select the values to be displayed for one or more columns.\n\nIf you want to delete set filters, you can do this for each filter individually - or for all filters at once via the \"Data\" menu."]
[null,{"$f":"IF(C7<>\"\",B6+1,\"\")","v":3},"Weitere Filtermöglichkeiten finden Sie unter \"Textfilter\" (für Spalten mit Texten) bzw. \"Zahlenfilter\" (für Spalten mit Zahlen).\n\nEs öffnet sich dann ein Fenster, in dem Sie eine oder zwei Filterregeln eingeben können. Diese können Sie mit \"und\" oder \"oder\" verbinden - also z.B.\n\n- \"ist größer als 40.000 UND ist kleiner als 80.000\" oder\n- \"ist kleiner als 40.000 ODER ist größer als 100.000\"\n\nProbieren Sie einfach mal verschiedene Text- und Zahlenfilter aus!",null,{"$f":"IF(F7<>\"\",E6+1,\"\")","v":3},"Further filter options can be found under \"Text filters\" (for columns with text) or \"Number filters\" (for columns with numbers).\n\nA window then opens in which you can enter one or two filter rules. You can combine them with \"and\" or \"or\" - for example\n\n- \"is greater than 40,000 AND is less than 80,000\" or\n- \"is less than 40,000 OR is greater than 100,000\"\n\nJust try out different text and number filters!"]

{"sheet":"03 Leer","index":10,"n_rows":10,"n_cols":6,"rows_kept":10,"cut":false,"hidden":false,"merged":[[1,1,1,4],[2,1,2,4]]}
[null,null,null,null,null,0]
[1,"03 Empty",null,null,null,"Back to Start"]
[2,"03 Leer",null,null,null,"Startseite"]
[]
[]
[2,null,"Dieses Blatt ist leer."]
[1,null,"This sheet is empty."]
[]
[]
[0]

{"sheet":"04 SUMMEWENN","index":11,"n_rows":48,"n_cols":13,"rows_kept":48,"cut":false,"hidden":false,"merged":[[13,2,15,6],[7,2,9,6],[10,2,12,6],[4,2,6,6],[1,1,1,4],[2,1,2,4]]}
[null,null,null,null,null,null,null,null,null,null,null,null,0]
[1,"03 SUMIF",null,null,null,"Back to Start"]
[2,"04 SUMMEWENN",null,null,null,"Startseite"]
[]
[2,"Kriterienspalten","Diese Spalten enthalten Kriterien, nach denen Sie die Daten sortieren, filtern oder in irgendeiner anderen Weise verdichten können."]
[2]
[2]
[2,"Datenspalten","Diese Spalten enthalten die eigentlichen Daten, die sortiert, gefiltert, oder in irgendeiner anderen Weise verdichtet werden sollen"]
[2]
[2]
[1,"criteria columns","These columns contain criteria, which may be used to sort, to filter or to \"squeeze\" the data in any other way."]
[1]
[1]
[1,"data columns","These columns contain the data, which shall be sorted, filtered or \"squeezed\" in any other way."]
[1]
[1]
[null,null,null,null,null,null,null,null,null,null,"total"]
[null,null,"branch","customer","quarter","sales","orders",null,"branch =","Bremen",{"$f":"SUMIF(C:C,J18,F:F)","v":779137},null,{"$f":"_xlfn.FORMULATEXT(K18)","v":"=SUMIF(C:C,J18,F:F)"}]
[null,null,"Bremen","Shell",4,66745,138]
[null,null,"Bremen","Shell",3,72436,127,null,"customer =","Aral","?",null,{"$f":"IF(K20<>\"?\",_xlfn.FORMULATEXT(K20),\"\")","v":""}]
[null,null,"Bremen","Shell",2,78647,120]
[null,null,"Bremen","Shell",1,80425,111,null,"quarter =",1,"?",null,{"$f":"IF(K22<>\"?\",_xlfn.FORMULATEXT(K22),\"\")","v":""}]
[null,null,"Bremen","Esso",1,112536,92]
[null,null,"Bremen","Esso",3,111525,89]
[null,null,"Bremen","Esso",4,124978,96]
[null,null,"Bremen","Esso",2,131845,90]
[null,null,"Hamburg","Shell",1,78176,66]
[null,null,"Hamburg","Shell",3,88111,68]
[null,null,"Hamburg","Shell",2,82789,63]
[null,null,"Hamburg","Shell",4,94512,59]
[null,null,"Hamburg","Esso",3,213999,119]
[null,null,"Hamburg","Esso",2,224924,122]
[null,null,"Hamburg","Aral",3,35712,19]
[null,null,"Hamburg","Esso",1,243890,123]
[null,null,"Hamburg","Aral",1,38523,19]
[null,null,"Hamburg","Aral",4,32677,15]
[null,null,"Hamburg","Aral",2,39467,17]
[null,null,"Oldenburg","Shell",2,112967,92]
[null,null,"Oldenburg","Shell",3,121210,98]
[null,null,"Oldenburg","Aral",1,31243,25]
[null,null,"Oldenburg","Shell",4,119891,94]
[null,null,"Oldenburg","Shell",1,123124,88]
[null,null,"Oldenburg","Aral",2,33756,24]
[null,null,"Oldenburg","Aral",3,38299,21]
[null,null,"Oldenburg","Aral",4,35900,19]
[]
[]
[0]

{"sheet":"04 SUMMEWENN_","index":12,"n_rows":8,"n_cols":8,"rows_kept":8,"cut":false,"hidden":true,"merged":[]}
[null,2,2,2,1,1,1,0]
[1,"04 SUMIF_",null,null,null,{"$f":"B2","v":"04 SUMIF_"}]
[2,"04 SUMMEWENN_"]
[0]
[null,1,"Eine weitere Möglichkeit zur Verdichtung einer unübersichtlich großen Datenmenge ist die Funktion SUMMEWENN(). Sie hat drei Argumente:\n\n- \"Bereich\": Das wird in einer Liste i.A. eine Spalte der Liste sein. Beachten Sie, dass im Beispiel einfach \"C:C\" steht statt \"C19:C45\" - also ohne Angabe der Zeilen. Damit ist dann die gesamte Spalte C gemeint. Das hat den Vorteil, dass Sie die Liste ggf. um weitere Zeilen ergänzen können, ohne die Formel ändern zu müssen. Es darf natürlich nicht passieren, dass der Suchwert noch irgendwo außerhalb der Liste in Spalte C auftaucht.\n\n",null,1,"Another possibility for the compression of an unclearly large amount of data is the function SUMIF(). It has three arguments:\n\n- \"range\": In a list, this will generally be one column of the list. Note that the example simply says \"C:C\" instead of \"C19:C45\" - that is, without specifying the rows. This means that the entire column C is meant. This has the advantage that you can add more rows to the list without having to change the formula. Of course it must not happen that the search value appears somewhere outside the list in column C.\n\n\n\n"]
[null,{"$f":"IF(C6<>\"\",B5+1,\"\")","v":2},"- \"Suchkriterien\": Nach diesem Wert soll im \"Bereich\" gesucht werden. Das kann ein Wert sein (\"Bremen\", 32), ein Ausdruck (\">30.000\"), ein Zellbezug (J18) oder eine Formel (HEUTE()). Hier dürfen Sie auch die beiden Platzhalter (engl. \"wildcards\") * (für beliebig viele beliebige Zeichen) und ? (für ein beliebiges Zeichen) benutzen.",null,{"$f":"IF(F6<>\"\",E5+1,\"\")","v":2},"- \"search criteria\": This value is to be searched for in the \"range\". This can be a value (\"Bremen\", 32), an expression (\">30,000\"), a cell reference (J18) or a formula (TODAY()). Here you can also use the two wildcards * (for any number of arbitrary characters) and ? (for one arbitrary character)"]
[null,{"$f":"IF(C7<>\"\",B6+1,\"\")","v":3},"- \"[Summe_Bereich]\": Wenn in \"Bereich\" das \"Suchkriterium\" gefunden wurde, sollen die Werte aus diesem Bereich aufaddiert werden. \n\nACHTUNG: Dieses Argument ist optional! Wenn Sie es weglassen, werden die Werte aus \"Bereich\" aufaddiert!",null,{"$f":"IF(F7<>\"\",E6+1,\"\")","v":3},"- \"[sum_range]\" If the \"search criterion\" was found in \"range\", the values from this range should be added up. \n\nATTENTION: This argument is optional! If you omit it, the values from \"range\" are added up!"]
[null,{"$f":"IF(C8<>\"\",B7+1,\"\")","v":4},"Addieren Sie jetzt bitte als Übung alle Umsätze mit Aral bzw. alle Umsätze im ersten Quartal auf!",null,{"$f":"IF(F8<>\"\",E7+1,\"\")","v":4},"As an exercise, please add up all sales with Aral or all sales in the first quarter!"]

{"sheet":"05 Daten für SUMMEWENNS","index":13,"n_rows":413,"n_cols":12,"rows_kept":413,"cut":false,"hidden":false,"merged":[[1,1,1,4],[2,1,2,4]]}
[null,null,null,null,null,null,null,null,null,null,null,0]
[1,"05 Data for SUMIFS",null,null,null,"Back to Start"]
[2,"05 Daten für SUMMEWENNS",null,null,null,"Startseite"]
[]
[2,"Werk"," Liefer-menge","Mengen-einheit"," Brutto-gewicht","Gewichts-einheit","PLZ","PLZ zweistellig","Ort","Produktions-standort"]
[1,"factory","quantity delivered","quantity \nunit","gross\nweight","weight\nunit","ZIP code","ZIP code\n(2 digits)","city","production\nlocation"]
[null,1400,64,"TR",817.92,"KG",90411,90,"Nürnberg","S"]
[0,1400,64,"TR",1562.4,"KG",90411,90,"Nürnberg","S"]
[null,1400,192,"TR",2453.7600000000002,"KG",90411,90,"Nürnberg","S"]
[null,1400,60,"TR",744.48,"KG",90411,90,"Nürnberg","S"]
[null,1400,120,"TR",1488.96,"KG",90411,90,"Nürnberg","S"]
[null,1400,60,"TR",744.48,"KG",90411,90,"Nürnberg","S"]
[null,1400,64,"TR",817.92,"KG",90411,90,"Nürnberg","S"]
[null,1400,384,"TR",4907.5200000000004,"KG",90411,90,"Nürnberg","S"]
[null,1400,64,"TR",817.92,"KG",90411,90,"Nürnberg","S"]
[null,1400,60,"TR",744.48,"KG",90411,90,"Nürnberg","S"]
[null,1400,240,"TR",2977.92,"KG",90411,90,"Nürnberg","S"]
[null,1400,60,"TR",744.48,"KG",90411,90,"Nürnberg","S"]
[null,1400,128,"TR",1635.84,"KG",90411,90,"Nürnberg","S"]
[null,1400,120,"TR",1488.96,"KG",90411,90,"Nürnberg","S"]
[null,1400,64,"TR",817.92,"KG",90411,90,"Nürnberg","S"]
[null,1400,64,"TR",817.92,"KG",90411,90,"Nürnberg","S"]
[null,1400,64,"TR",817.92,"KG",90411,90,"Nürnberg","S"]
[null,1400,120,"ST",1488.96,"KG",90411,90,"Nürnberg","S"]
[null,1400,60,"ST",744.48,"KG",90411,90,"Nürnberg","S"]
[null,1400,64,"TR",817.92,"KG",90411,90,"Nürnberg","S"]
[null,1400,128,"TR",1635.84,"KG",90411,90,"Nürnberg","S"]
[null,1400,64,"TR",817.92,"KG",90411,90,"Nürnberg","S"]
[null,1400,120,"ST",1488.96,"KG",90411,90,"Nürnberg","S"]
[null,1400,120,"ST",1488.96,"KG",90411,90,"Nürnberg","S"]
[null,1400,60,"ST",744.48,"KG",90411,90,"Nürnberg","S"]
[null,1400,64,"TR",1562.4,"KG",90411,90,"Nürnberg","S"]
[null,1400,128,"TR",1635.84,"KG",90411,90,"Nürnberg","S"]
[null,1400,64,"TR",817.92,"KG",90411,90,"Nürnberg","S"]
[null,1400,64,"TR",817.92,"KG",90411,90,"Nürnberg","S"]
[null,1400,128,"TR",1635.84,"KG",90411,90,"Nürnberg","S"]
[null,1400,2,"KA",17.295999999999999,"KG",59423,59,"Unna","B"]
[null,1400,5,"KA",36.68,"KG",59423,59,"Unna","B"]
[null,1400,140,"ST",1456,"KG",59423,59,"Unna","S"]
[null,1400,5,"ST",52,"KG",59423,59,"Unna","S"]
[null,1400,5,"KA",35.56,"KG",59423,59,"Unna","ST"]
[null,1400,3,"ST",31.5,"KG",59423,59,"Unna","ST"]
[null,1400,5,"KA",51.1,"KG",59423,59,"Unna","ST"]
[null,1400,1,"TR",2.9039999999999999,"KG",59423,59,"Unna","B"]
[null,1400,2,"TR",5.556,"KG",59423,59,"Unna","B"]
[null,1400,1,"TR",2.9159999999999999,"KG",59423,59,"Unna","B"]
[null,1400,1,"TR",2.9220000000000002,"KG",59423,59,"Unna","B"]
[null,1400,2,"TR",5.8440000000000003,"KG",59423,59,"Unna","B"]
[null,1400,2,"TR",5.46,"KG",59423,59,"Unna","B"]
[null,1400,2,"TR",5.3879999999999999,"KG",59423,59,"Unna","B"]
[null,1400,2,"TR",5.508,"KG",59423,59,"Unna","B"]
[null,1400,3,"TR",25.632000000000001,"KG",59423,59,"Unna","B"]
[null,1400,3,"TR",25.632000000000001,"KG",59423,59,"Unna","B"]
[null,1400,20,"ST",208,"KG",59423,59,"Unna","S"]
[null,1400,5,"KA",35.64,"KG",59423,59,"Unna","ST"]
[null,1400,10,"ST",53,"KG",59423,59,"Unna","ST"]
[null,1400,1,"KA",14.1,"KG",59423,59,"Unna","ST"]
[null,1400,5,"KA",34.32,"KG",59423,59,"Unna","ST"]
[null,1400,6,"TR",87.96,"KG",59423,59,"Unna","ST"]
[null,1400,3,"TR",25.2,"KG",59423,59,"Unna","ST"]
[null,1400,5,"KA",43.24,"KG",59423,59,"Unna","B"]
[null,1400,15,"KA",110.04,"KG",59423,59,"Unna","B"]
[null,1400,8,"ST",83.2,"KG",59423,59,"Unna","S"]
[null,1400,60,"ST",624,"KG",59423,59,"Unna","S"]
[null,1400,5,"ST",52,"KG",59423,59,"Unna","S"]
[null,1400,1,"TR",12.432,"KG",59423,59,"Unna","ST"]
[null,1400,6,"KA",42.671999999999997,"KG",59423,59,"Unna","ST"]
[null,1400,12,"ST",126,"KG",59423,59,"Unna","ST"]
[null,1400,10,"KA",102.2,"KG",59423,59,"Unna","ST"]
[null,1400,12,"ST",125.4,"KG",59423,59,"Unna","B"]
[null,1400,1,"KA",10.5,"KG",59423,59,"Unna","B"]
[null,1400,2,"TR",5.8319999999999999,"KG",59423,59,"Unna","B"]
[null,1400,1,"TR",2.9220000000000002,"KG",59423,59,"Unna","B"]
[null,1400,2,"TR",5.46,"KG",59423,59,"Unna","B"]
[null,1400,2,"TR",5.508,"KG",59423,59,"Unna","B"]
[null,1400,1,"TR",8.5440000000000005,"KG",59423,59,"Unna","B"]
[null,1400,1,"KA",6.5940000000000003,"KG",59423,59,"Unna","F"]
[null,1400,2,"TR",13.56,"KG",59423,59,"Unna","F"]
[null,1400,1,"TR",12.587999999999999,"KG",59423,59,"Unna","F"]
[null,1400,2,"TR",29.32,"KG",59423,59,"Unna","F"]
[null,1400,2,"TR",11.84,"KG",59423,59,"Unna","F"]
[null,1400,2,"TR",27.72,"KG",59423,59,"Unna","S"]
[null,1400,3,"TR",17.262,"KG",59423,59,"Unna","S"]
[null,1400,1,"TR",12.407999999999999,"KG",59423,59,"Unna","S"]
[null,1400,5,"ST",17.5,"KG",59423,59,"Unna","S"]
[null,1400,4,"ST",14,"KG",59423,59,"Unna","S"]
[null,1400,1,"TR",13.704000000000001,"KG",59423,59,"Unna","S"]
[null,1400,1,"TR",12.96,"KG",59423,59,"Unna","S"]
[null,1400,3,"TR",43.98,"KG",59423,59,"Unna","S"]
[null,1400,1,"TR",10.284000000000001,"KG",59423,59,"Unna","S"]
[null,1400,1,"TR",14.66,"KG",59423,59,"Unna","S"]
[null,1400,3,"TR",45.204000000000001,"KG",59423,59,"Unna","S"]
[null,1400,6,"KA",42.768000000000001,"KG",59423,59,"Unna","ST"]
[null,1400,2,"KA",5.0880000000000001,"KG",59423,59,"Unna","ST"]
[null,1400,5,"KA",34.32,"KG",59423,59,"Unna","ST"]
[null,1400,2,"TR",29.32,"KG",59423,59,"Unna","ST"]
[null,1400,1,"TR",14.66,"KG",59423,59,"Unna","ST"]
[null,1400,10,"KA",73.36,"KG",59423,59,"Unna","B"]
[null,1400,4,"ST",41.6,"KG",59423,59,"Unna","S"]
[null,1400,4,"ST",41.6,"KG",59423,59,"Unna","S"]
[null,1400,10,"ST",104,"KG",59423,59,"Unna","S"]
[null,1400,60,"ST",624,"KG",59423,59,"Unna","S"]
[null,1400,2,"KA",14.224,"KG",59423,59,"Unna","ST"]
[null,1400,16,"KA",163.52000000000001,"KG",59423,59,"Unna","ST"]
[null,1400,15,"ST",79.5,"KG",59423,59,"Unna","B"]
[null,1400,4,"TR",11.112,"KG",59423,59,"Unna","B"]
[null,1400,4,"TR",34.176000000000002,"KG",59423,59,"Unna","B"]
[null,1400,1,"TR",8.5440000000000005,"KG",59423,59,"Unna","B"]
[null,1400,2,"TR",17.088000000000001,"KG",59423,59,"Unna","B"]
[null,1400,2,"TR",29.32,"KG",59423,59,"Unna","F"]
[null,1400,1,"TR",5.92,"KG",59423,59,"Unna","F"]
[null,1400,1,"TR",12.407999999999999,"KG",59423,59,"Unna","S"]
[null,1400,4,"ST",41.6,"KG",59423,59,"Unna","S"]
[null,1400,45,"ST",738,"KG",59423,59,"Unna","S"]
[null,1400,10,"ST",104,"KG",59423,59,"Unna","S"]
[null,1400,10,"ST",53.26,"KG",59423,59,"Unna","S"]
[null,1400,5,"TR",75.34,"KG",59423,59,"Unna","S"]
[null,1400,2,"KA",20.440000000000001,"KG",59423,59,"Unna","ST"]
[null,1400,2,"TR",30.135999999999999,"KG",59423,59,"Unna","ST"]
[null,1400,1,"KA",8.6479999999999997,"KG",59423,59,"Unna","B"]
[null,1400,4,"KA",29.344000000000001,"KG",59423,59,"Unna","B"]
[null,1400,10,"ST",104,"KG",59423,59,"Unna","S"]
[null,1400,10,"ST",104,"KG",59423,59,"Unna","S"]
[null,1400,3,"KA",21.335999999999999,"KG",59423,59,"Unna","ST"]
[null,1400,4,"ST",42,"KG",59423,59,"Unna","ST"]
[null,1400,2,"KA",20.440000000000001,"KG",59423,59,"Unna","ST"]
[null,1400,1,"TR",8.3699999999999992,"KG",59423,59,"Unna","ST"]
[null,1400,1,"TR",2.9039999999999999,"KG",59423,59,"Unna","B"]
[null,1400,2,"TR",5.8440000000000003,"KG",59423,59,"Unna","B"]
[null,1400,1,"TR",2.694,"KG",59423,59,"Unna","B"]
[null,1400,1,"TR",2.754,"KG",59423,59,"Unna","B"]
[null,1400,1,"TR",2.9039999999999999,"KG",59423,59,"Unna","B"]
[null,1400,1,"TR",2.7,"KG",59423,59,"Unna","B"]
[null,1400,1,"TR",8.5440000000000005,"KG",59423,59,"Unna","B"]
[null,1400,1,"TR",8.5440000000000005,"KG",59423,59,"Unna","B"]
[null,1400,1,"TR",8.5440000000000005,"KG",59423,59,"Unna","B"]
[null,1400,1,"TR",8.5440000000000005,"KG",59423,59,"Unna","B"]
[null,1400,2,"TR",17.088000000000001,"KG",59423,59,"Unna","B"]
[null,1400,2,"TR",29.32,"KG",59423,59,"Unna","F"]
[null,1400,2,"ST",7,"KG",59423,59,"Unna","S"]
[null,1400,2,"ST",7,"KG",59423,59,"Unna","S"]
[null,1400,1,"TR",14.66,"KG",59423,59,"Unna","S"]
[null,1400,1,"TR",14.66,"KG",59423,59,"Unna","S"]
[null,1400,4,"ST",44,"KG",59423,59,"Unna","S"]
[null,1400,25,"ST",115,"KG",59423,59,"Unna","S"]
[null,1400,3,"TR",38.340000000000003,"KG",59423,59,"Unna","S"]
[null,1400,1,"TR",4.72,"KG",59423,59,"Unna","ST"]
[null,1400,1,"TR",14.66,"KG",59423,59,"Unna","ST"]
[null,1400,1,"TR",2.9039999999999999,"KG",59423,59,"Unna","B"]
[null,1400,4,"TR",10.92,"KG",59423,59,"Unna","B"]
[null,1400,50,"KA",107.5,"KG",59423,59,"Unna","B"]
[null,1400,30,"KA",64.5,"KG",59423,59,"Unna","B"]
[null,1400,4,"TR",58.64,"KG",59423,59,"Unna","F"]
[null,1400,1,"TR",14.66,"KG",59423,59,"Unna","S"]
[null,1400,1,"TR",14.66,"KG",59423,59,"Unna","ST"]
[null,1400,216,"TR",1362.3119999999999,"KG",4639,4,"Ponitz","B"]
[null,1400,432,"TR",2724.6239999999998,"KG",4639,4,"Ponitz","B"]
[null,1400,72,"TR",454.10399999999998,"KG",4639,4,"Ponitz","B"]
[null,1400,720,"TR",4541.04,"KG",4639,4,"Ponitz","B"]
[null,1400,180,"TR",495.72,"KG",4639,4,"Ponitz","B"]
[null,1400,180,"TR",525.96,"KG",4639,4,"Ponitz","B"]
[null,1400,180,"TR",495.72,"KG",4639,4,"Ponitz","B"]
[null,1400,75,"TR",431.55,"KG",4639,4,"Ponitz","S"]
[null,1400,75,"TR",431.55,"KG",4639,4,"Ponitz","S"]
[null,1400,360,"TR",3127.68,"KG",4639,4,"Ponitz","S"]
[null,1400,432,"TR",3753.2159999999999,"KG",4639,4,"Ponitz","S"]
[null,1400,96,"TR",1011.456,"KG",4639,4,"Ponitz","ST"]
[null,1400,315,"TR",1782.9,"KG",4639,4,"Ponitz","ST"]
[null,1400,504,"TR",3417.12,"KG",4639,4,"Ponitz","ST"]
[null,1400,504,"ST",0,"KG",55411,55,"Bingen","B"]
[null,1400,1152,"ST",0,"KG",55411,55,"Bingen","B"]
[null,1400,504,"ST",0,"KG",55411,55,"Bingen","B"]
[null,1400,504,"ST",0,"KG",55411,55,"Bingen","B"]
[null,1400,864,"ST",0,"KG",55411,55,"Bingen","B"]
[null,1400,672,"ST",0,"KG",55411,55,"Bingen","B"]
[null,1400,1152,"ST",0,"KG",55411,55,"Bingen","B"]
[null,1400,864,"ST",0,"KG",55411,55,"Bingen","B"]
[null,1400,1176,"ST",0,"KG",55411,55,"Bingen","B"]
[null,1400,1728,"ST",0,"KG",55411,55,"Bingen","B"]
[null,1400,864,"ST",0,"KG",55411,55,"Bingen","B"]
[null,1400,504,"ST",0,"KG",55411,55,"Bingen","B"]
[null,1400,864,"ST",0,"KG",55411,55,"Bingen","B"]
[null,1400,1152,"ST",0,"KG",55411,55,"Bingen","B"]
[null,1400,864,"ST",0,"KG",55411,55,"Bingen","B"]
[null,1400,864,"ST",0,"KG",55411,55,"Bingen","B"]
[null,1400,672,"ST",0,"KG",55411,55,"Bingen","B"]
[null,1400,1728,"ST",0,"KG",55411,55,"Bingen","B"]
[null,1400,28,"ST",2356.3679999999999,"KG",55411,55,"Bingen","B"]
[null,1400,16,"ST",5721.6,"KG",55411,55,"Bingen","B"]
[null,1400,24,"ST",0,"KG",55411,55,"Bingen","F"]
[null,1400,16,"ST",0,"KG",55411,55,"Bingen","F"]
[null,1400,12,"ST",0,"KG",55411,55,"Bingen","F"]
[null,1400,28,"ST",0,"KG",55411,55,"Bingen","F"]
[null,1400,2880,"ST",0,"KG",55411,55,"Bingen","S"]
[null,1400,9216,"ST",0,"KG",55411,55,"Bingen","S"]
[null,1400,24,"ST",10500,"KG",55411,55,"Bingen","S"]
[null,1400,12,"ST",3270,"KG",55411,55,"Bingen","S"]
[null,1400,200,"TR",547.20000000000005,"KG",55411,55,"Bingen","B"]
[null,1400,128,"TR",500.73599999999999,"KG",55411,55,"Bingen","B"]
[null,1400,64,"TR",250.36799999999999,"KG",55411,55,"Bingen","B"]
[null,1400,72,"TR",439.99200000000002,"KG",55411,55,"Bingen","B"]
[null,1400,12,"ST",0,"KG",55411,55,"Bingen","F"]
[null,1400,64,"TR",105.98399999999999,"KG",55411,55,"Bingen","F"]
[null,1400,162,"TR",660.96,"KG",55411,55,"Bingen","F"]
[null,1400,128,"TR",1316.3520000000001,"KG",55411,55,"Bingen","F"]
[null,1400,1440,"ST",0,"KG",55411,55,"Bingen","F"]
[null,1400,64,"TR",658.17600000000004,"KG",55411,55,"Bingen","F"]
[null,1400,1440,"ST",0,"KG",55411,55,"Bingen","F"]
[null,1400,105,"TR",594.29999999999995,"KG",55411,55,"Bingen","F"]
[null,1400,48,"TR",595.58399999999995,"KG",55411,55,"Bingen","F"]
[null,1400,128,"TR",1316.3520000000001,"KG",55411,55,"Bingen","F"]
[null,1400,2880,"ST",0,"KG",55411,55,"Bingen","F"]
[null,1400,12,"ST",5130,"KG",55411,55,"Bingen","F"]
[null,1400,216,"TR",689.47199999999998,"KG",55411,55,"Bingen","S"]
[null,1400,75,"TR",431.55,"KG",55411,55,"Bingen","S"]
[null,1400,164,"TR",483.14400000000001,"KG",55411,55,"Bingen","S"]
[null,1400,164,"TR",483.14400000000001,"KG",55411,55,"Bingen","S"]
[null,1400,75,"TR",431.55,"KG",55411,55,"Bingen","S"]
[null,1400,72,"TR",933.12,"KG",55411,55,"Bingen","S"]
[null,1400,72,"TR",895.10400000000004,"KG",55411,55,"Bingen","S"]
[null,1400,27,"TR",338.25599999999997,"KG",55411,55,"Bingen","S"]
[null,1400,75,"TR",431.55,"KG",55411,55,"Bingen","S"]
[null,1400,48,"TR",622.08000000000004,"KG",55411,55,"Bingen","S"]
[null,1400,192,"TR",1974.528,"KG",55411,55,"Bingen","S"]
[null,1400,48,"TR",613.44000000000005,"KG",55411,55,"Bingen","S"]
[null,1400,48,"TR",613.44000000000005,"KG",55411,55,"Bingen","S"]
[null,1400,18,"KA",253.8,"KG",55411,55,"Bingen","ST"]
[null,1400,120,"TR",560.4,"KG",55411,55,"Bingen","ST"]
[null,1400,48,"KA",495.36,"KG",55411,55,"Bingen","ST"]
[null,1400,45,"KA",308.88,"KG",55411,55,"Bingen","ST"]
[null,1400,30,"TR",137.1,"KG",55411,55,"Bingen","ST"]
[null,1400,105,"TR",594.29999999999995,"KG",55411,55,"Bingen","ST"]
[null,1400,96,"TR",1208.4480000000001,"KG",55411,55,"Bingen","ST"]
[null,1400,30,"TR",169.8,"KG",55411,55,"Bingen","ST"]
[null,1400,175,"ST",805,"KG",95145,95,"Oberkotzau","S"]
[null,1400,12,"ST",370.8,"KG",95145,95,"Oberkotzau","ST"]
[null,1400,280,"KA",4182.08,"KG",95659,95,"Oberkotzau","B"]
[null,1400,160,"KA",2485.6,"KG",95659,95,"Oberkotzau","ST"]
[null,1400,60,"ST",624,"KG",1127,1,"Dresden","S"]
[null,1400,104,"ST",1086.8,"KG",1127,1,"Dresden","B"]
[null,1400,72,"ST",381.6,"KG",1127,1,"Dresden","B"]
[null,1400,35,"ST",161,"KG",1127,1,"Dresden","S"]
[null,1400,144,"ST",2174.4,"KG",9569,9,"Falkenau","S"]
[null,1400,3,"TR",20.34,"KG",36043,36,"Fulda","F"]
[null,1400,3,"TR",19.097999999999999,"KG",36043,36,"Fulda","S"]
[null,1400,2,"TR",5.0759999999999996,"KG",36043,36,"Fulda","S"]
[null,1400,48,"KA",552,"KG",36043,36,"Fulda","S"]
[null,1400,8,"KA",76.927999999999997,"KG",36043,36,"Fulda","B"]
[null,1400,40,"KA",384.64,"KG",36043,36,"Fulda","B"]
[null,1400,35,"ST",122.5,"KG",36043,36,"Fulda","S"]
[null,1400,6,"KA",17.135999999999999,"KG",36043,36,"Fulda","ST"]
[null,1400,45,"KA",308.88,"KG",36043,36,"Fulda","ST"]
[null,1400,3,"ST",198,"KG",36041,36,"Fulda","F"]
[null,1400,3000,"L",3045,"KG",36041,36,"Fulda","S"]
[null,1400,2,"KA",21.36,"KG",63546,63,"Hammersbach","B"]
[null,1400,32,"ST",0,"KG",63546,63,"Hammersbach","B"]
[null,1400,48,"ST",0,"KG",63546,63,"Hammersbach","B"]
[null,1400,24,"ST",0,"KG",63546,63,"Hammersbach","B"]
[null,1400,24,"ST",0,"KG",63546,63,"Hammersbach","B"]
[null,1400,18,"ST",0,"KG",63546,63,"Hammersbach","B"]
[null,1400,18,"ST",0,"KG",63546,63,"Hammersbach","B"]
[null,1400,18,"ST",0,"KG",63546,63,"Hammersbach","B"]
[null,1400,24,"ST",0,"KG",63546,63,"Hammersbach","B"]
[null,1400,3,"TR",8.766,"KG",63546,63,"Hammersbach","B"]
[null,1400,42,"ST",0,"KG",63546,63,"Hammersbach","B"]
[null,1400,2,"TR",5.46,"KG",63546,63,"Hammersbach","B"]
[null,1400,18,"ST",0,"KG",63546,63,"Hammersbach","B"]
[null,1400,1,"TR",2.754,"KG",63546,63,"Hammersbach","B"]
[null,1400,24,"ST",0,"KG",63546,63,"Hammersbach","B"]
[null,1400,1,"TR",6.1390000000000002,"KG",63546,63,"Hammersbach","B"]
[null,1400,168,"ST",0,"KG",63546,63,"Hammersbach","B"]
[null,1400,3,"TR",11.736000000000001,"KG",63546,63,"Hammersbach","B"]
[null,1400,2,"TR",7.8239999999999998,"KG",63546,63,"Hammersbach","B"]
[null,1400,2,"TR",7.8239999999999998,"KG",63546,63,"Hammersbach","B"]
[null,1400,2,"TR",7.8239999999999998,"KG",63546,63,"Hammersbach","B"]
[null,1400,2,"TR",7.8239999999999998,"KG",63546,63,"Hammersbach","B"]
[null,1400,2,"TR",7.8239999999999998,"KG",63546,63,"Hammersbach","B"]
[null,1400,1,"ST",152.80000000000001,"KG",63546,63,"Hammersbach","B"]
[null,1400,1,"ST",84.156000000000006,"KG",63546,63,"Hammersbach","B"]
[null,1400,1,"ST",46.74,"KG",63546,63,"Hammersbach","B"]
[null,1400,1,"ST",0,"KG",63546,63,"Hammersbach","F"]
[null,1400,1,"ST",0,"KG",63546,63,"Hammersbach","F"]
[null,1400,1,"ST",0,"KG",63546,63,"Hammersbach","F"]
[null,1400,3,"TR",5.5439999999999996,"KG",63546,63,"Hammersbach","F"]
[null,1400,4,"TR",7.3920000000000003,"KG",63546,63,"Hammersbach","F"]
[null,1400,4,"TR",7.3920000000000003,"KG",63546,63,"Hammersbach","F"]
[null,1400,2,"TR",3.3119999999999998,"KG",63546,63,"Hammersbach","F"]
[null,1400,2,"TR",13.56,"KG",63546,63,"Hammersbach","F"]
[null,1400,2,"TR",13.56,"KG",63546,63,"Hammersbach","F"]
[null,1400,2,"TR",25.175999999999998,"KG",63546,63,"Hammersbach","F"]
[null,1400,2,"TR",8.16,"KG",63546,63,"Hammersbach","F"]
[null,1400,1,"TR",5.66,"KG",63546,63,"Hammersbach","F"]
[null,1400,1,"TR",5.66,"KG",63546,63,"Hammersbach","F"]
[null,1400,1,"TR",12.407999999999999,"KG",63546,63,"Hammersbach","F"]
[null,1400,1,"TR",12.587999999999999,"KG",63546,63,"Hammersbach","F"]
[null,1400,15,"ST",79.5,"KG",63546,63,"Hammersbach","S"]
[null,1400,1,"TR",3.1920000000000002,"KG",63546,63,"Hammersbach","S"]
[null,1400,2,"TR",6.3840000000000003,"KG",63546,63,"Hammersbach","S"]
[null,1400,1,"TR",3.1920000000000002,"KG",63546,63,"Hammersbach","S"]
[null,1400,2,"TR",5.8920000000000003,"KG",63546,63,"Hammersbach","S"]
[null,1400,1,"TR",2.9460000000000002,"KG",63546,63,"Hammersbach","S"]
[null,1400,2,"TR",5.8920000000000003,"KG",63546,63,"Hammersbach","S"]
[null,1400,3,"TR",8.8379999999999992,"KG",63546,63,"Hammersbach","S"]
[null,1400,1,"TR",2.9460000000000002,"KG",63546,63,"Hammersbach","S"]
[null,1400,2,"TR",5.8920000000000003,"KG",63546,63,"Hammersbach","S"]
[null,1400,2,"TR",11.507999999999999,"KG",63546,63,"Hammersbach","S"]
[null,1400,1,"TR",5.7539999999999996,"KG",63546,63,"Hammersbach","S"]
[null,1400,1,"TR",6.3659999999999997,"KG",63546,63,"Hammersbach","S"]
[null,1400,1,"KA",1.7549999999999999,"KG",63546,63,"Hammersbach","S"]
[null,1400,1,"TR",2.5379999999999998,"KG",63546,63,"Hammersbach","S"]
[null,1400,2,"KA",3.51,"KG",63546,63,"Hammersbach","S"]
[null,1400,2,"TR",27.408000000000001,"KG",63546,63,"Hammersbach","S"]
[null,1400,1,"TR",12.587999999999999,"KG",63546,63,"Hammersbach","S"]
[null,1400,1,"TR",6.78,"KG",63546,63,"Hammersbach","S"]
[null,1400,1,"TR",10.284000000000001,"KG",63546,63,"Hammersbach","S"]
[null,1400,1,"TR",5.66,"KG",63546,63,"Hammersbach","S"]
[null,1400,1,"TR",6.78,"KG",63546,63,"Hammersbach","S"]
[null,1400,2,"TR",25.56,"KG",63546,63,"Hammersbach","S"]
[null,1400,1,"TR",4.67,"KG",63546,63,"Hammersbach","ST"]
[null,1400,1,"KA",2.8559999999999999,"KG",63546,63,"Hammersbach","ST"]
[null,1400,1,"TR",4.72,"KG",63546,63,"Hammersbach","ST"]
[null,1400,1,"TR",4.57,"KG",63546,63,"Hammersbach","ST"]
[null,1400,2,"TR",25.175999999999998,"KG",63546,63,"Hammersbach","ST"]
[null,1400,1,"TR",12.587999999999999,"KG",63546,63,"Hammersbach","ST"]
[null,1400,1,"TR",4.08,"KG",63546,63,"Hammersbach","ST"]
[null,1400,1,"TR",5.66,"KG",63546,63,"Hammersbach","ST"]
[null,1400,1,"TR",10.284000000000001,"KG",63546,63,"Hammersbach","ST"]
[null,1400,1,"TR",5.66,"KG",63546,63,"Hammersbach","ST"]
[null,1400,1,"TR",5.66,"KG",63546,63,"Hammersbach","ST"]
[null,1400,1,"TR",10.284000000000001,"KG",63546,63,"Hammersbach","ST"]
[null,1400,1,"TR",5.66,"KG",63546,63,"Hammersbach","ST"]
[null,1400,1,"TR",5.66,"KG",63546,63,"Hammersbach","ST"]
[null,1400,1,"TR",5.66,"KG",63546,63,"Hammersbach","ST"]
[null,1400,1,"TR",6.78,"KG",63546,63,"Hammersbach","ST"]
[null,1400,1,"KA",1.7549999999999999,"KG",63599,63,"Biebergemünd","B"]
[null,1400,1,"KA",2.8079999999999998,"KG",63599,63,"Biebergemünd","B"]
[null,1400,1,"KA",10.68,"KG",63599,63,"Biebergemünd","B"]
[null,1400,3,"KA",33.479999999999997,"KG",63599,63,"Biebergemünd","B"]
[null,1400,2,"KA",5.4720000000000004,"KG",63599,63,"Biebergemünd","B"]
[null,1400,3,"TR",8.7119999999999997,"KG",63599,63,"Biebergemünd","B"]
[null,1400,2,"TR",5.8079999999999998,"KG",63599,63,"Biebergemünd","B"]
[null,1400,2,"TR",5.8440000000000003,"KG",63599,63,"Biebergemünd","B"]
[null,1400,2,"TR",5.508,"KG",63599,63,"Biebergemünd","B"]
[null,1400,1,"TR",2.8260000000000001,"KG",63599,63,"Biebergemünd","B"]
[null,1400,1,"TR",2.7,"KG",63599,63,"Biebergemünd","B"]
[null,1400,1,"TR",6.1390000000000002,"KG",63599,63,"Biebergemünd","B"]
[null,1400,1,"TR",6.0410000000000004,"KG",63599,63,"Biebergemünd","B"]
[null,1400,1,"TR",6.09,"KG",63599,63,"Biebergemünd","B"]
[null,1400,2,"TR",3.6960000000000002,"KG",63599,63,"Biebergemünd","F"]
[null,1400,2,"TR",3.6960000000000002,"KG",63599,63,"Biebergemünd","F"]
[null,1400,1,"TR",6.45,"KG",63599,63,"Biebergemünd","F"]
[null,1400,1,"TR",6.4640000000000004,"KG",63599,63,"Biebergemünd","F"]
[null,1400,1,"TR",6.4640000000000004,"KG",63599,63,"Biebergemünd","F"]
[null,1400,4,"TR",27.12,"KG",63599,63,"Biebergemünd","F"]
[null,1400,4,"TR",27.12,"KG",63599,63,"Biebergemünd","F"]
[null,1400,3,"TR",37.764000000000003,"KG",63599,63,"Biebergemünd","F"]
[null,1400,1,"TR",5.66,"KG",63599,63,"Biebergemünd","F"]
[null,1400,3,"TR",37.223999999999997,"KG",63599,63,"Biebergemünd","F"]
[null,1400,3,"TR",9.5760000000000005,"KG",63599,63,"Biebergemünd","S"]
[null,1400,2,"TR",6.3840000000000003,"KG",63599,63,"Biebergemünd","S"]
[null,1400,1,"TR",2.9460000000000002,"KG",63599,63,"Biebergemünd","S"]
[null,1400,2,"TR",5.8920000000000003,"KG",63599,63,"Biebergemünd","S"]
[null,1400,1,"TR",2.9460000000000002,"KG",63599,63,"Biebergemünd","S"]
[null,1400,1,"TR",2.9460000000000002,"KG",63599,63,"Biebergemünd","S"]
[null,1400,1,"TR",5.7539999999999996,"KG",63599,63,"Biebergemünd","S"]
[null,1400,1,"TR",12.528,"KG",63599,63,"Biebergemünd","S"]
[null,1400,1,"TR",5.7539999999999996,"KG",63599,63,"Biebergemünd","S"]
[null,1400,1,"KA",1.7549999999999999,"KG",63599,63,"Biebergemünd","S"]
[null,1400,1,"TR",2.5379999999999998,"KG",63599,63,"Biebergemünd","S"]
[null,1400,1,"TR",13.704000000000001,"KG",63599,63,"Biebergemünd","S"]
[null,1400,16,"TR",201.40799999999999,"KG",63599,63,"Biebergemünd","S"]
[null,1400,2,"TR",25.92,"KG",63599,63,"Biebergemünd","S"]
[null,1400,1,"TR",10.284000000000001,"KG",63599,63,"Biebergemünd","S"]
[null,1400,1,"TR",5.66,"KG",63599,63,"Biebergemünd","S"]
[null,1400,1,"TR",6.78,"KG",63599,63,"Biebergemünd","S"]
[null,1400,1,"KA",14.1,"KG",63599,63,"Biebergemünd","ST"]
[null,1400,1,"TR",4.67,"KG",63599,63,"Biebergemünd","ST"]
[null,1400,1,"KA",2.544,"KG",63599,63,"Biebergemünd","ST"]
[null,1400,1,"KA",2.8559999999999999,"KG",63599,63,"Biebergemünd","ST"]
[null,1400,1,"KA",10.32,"KG",63599,63,"Biebergemünd","ST"]
[null,1400,1,"TR",12.587999999999999,"KG",63599,63,"Biebergemünd","ST"]
[null,1400,1,"TR",12.587999999999999,"KG",63599,63,"Biebergemünd","ST"]
[null,1400,2,"TR",11.32,"KG",63599,63,"Biebergemünd","ST"]
[null,1400,1,"TR",5.66,"KG",63599,63,"Biebergemünd","ST"]
[null,1400,1,"TR",5.66,"KG",63599,63,"Biebergemünd","ST"]
[null,1400,1,"TR",6.78,"KG",63599,63,"Biebergemünd","ST"]
[null,1400,1,"TR",12.587999999999999,"KG",63599,63,"Biebergemünd","ST"]
[null,1400,1,"TR",6.78,"KG",63599,63,"Biebergemünd","ST"]
[null,1400,1,"TR",6.78,"KG",63599,63,"Biebergemünd","ST"]
[null,1400,1,"TR",3.84,"KG",63599,63,"Biebergemünd","ST"]
[null,1400,48,"ST",1247.28,"KG",65232,65,"Taunusstein","S"]
[null,1400,180,"TR",1291.68,"KG",67550,67,"Worms","B"]
[null,1400,192,"KA",548.35199999999998,"KG",67550,67,"Worms","ST"]
[null,1400,39,"ST",407.55,"KG",73037,73,"Göppingen","B"]
[null,1400,1,"TR",6.24,"KG",73037,73,"Göppingen","F"]
[null,1400,3,"TR",45.204000000000001,"KG",73037,73,"Göppingen","F"]
[null,1400,60,"ST",624,"KG",73037,73,"Göppingen","S"]
[null,1400,11,"TR",165.74799999999999,"KG",73037,73,"Göppingen","S"]
[null,1400,26,"ST",273,"KG",73037,73,"Göppingen","ST"]
[null,1400,1,"KA",14.1,"KG",73037,73,"Göppingen","ST"]
[null,1400,3,"KA",21.384,"KG",73037,73,"Göppingen","ST"]
[null,1400,3,"KA",30.66,"KG",73037,73,"Göppingen","ST"]
[null,1400,15,"TR",41.04,"KG",76829,76,"Ranschbach","B"]
[null,1400,15,"TR",41.04,"KG",76829,76,"Ranschbach","B"]
[null,1400,18,"TR",49.14,"KG",76829,76,"Ranschbach","B"]
[null,1400,8,"TR",22.032,"KG",76829,76,"Ranschbach","B"]
[null,1400,16,"TR",62.591999999999999,"KG",76829,76,"Ranschbach","B"]
[null,1400,12,"TR",73.331999999999994,"KG",76829,76,"Ranschbach","B"]
[null,1400,3,"TR",5.5439999999999996,"KG",76829,76,"Ranschbach","F"]
[null,1400,8,"TR",13.247999999999999,"KG",76829,76,"Ranschbach","F"]
[null,1400,5,"TR",20.399999999999999,"KG",76829,76,"Ranschbach","F"]
[null,1400,8,"TR",82.272000000000006,"KG",76829,76,"Ranschbach","F"]
[null,1400,10,"TR",29.46,"KG",76829,76,"Ranschbach","S"]

{"sheet":"05 SUMMEWENNS","index":14,"n_rows":105,"n_cols":19,"rows_kept":105,"cut":false,"hidden":false,"merged":[[1,1,1,4],[2,1,2,4],[9,10,13,13],[9,14,13,17]]}
[null,null,null,null,null,null,null,null,null,null,2,2,2,2,1,1,1,1,0]
[1,"05 SUMIFS",null,null,null,"Back to Start"]
[2,"05 SUMMEWENNS",null,null,null,"Startseite"]
[]
[2,"PLZ","B","ST","H","S","F","C"]
[1,"ZIP","B","ST","H","S","F","C"]
[null,1,{"$f":"SUMIFS('05 Daten für SUMMEWENNS'!$E$5:$E$505,'05 Daten für SUMMEWENNS'!$H$5:$H$505,$B7,'05 Daten für SUMMEWENNS'!$J$5:$J$505,C$5)","v":1468.4},{"$f":"SUMIFS('05 Daten für SUMMEWENNS'!$E$5:$E$505,'05 Daten für SUMMEWENNS'!$H$5:$H$505,$B7,'05 Daten für SUMMEWENNS'!$J$5:$J$505,D$5)","v":0},{"$f":"SUMIFS('05 Daten für SUMMEWENNS'!$E$5:$E$505,'05 Daten für SUMMEWENNS'!$H$5:$H$505,$B7,'05 Daten für SUMMEWENNS'!$J$5:$J$505,E$5)","v":0},{"$f":"SUMIFS('05 Daten für SUMMEWENNS'!$E$5:$E$505,'05 Daten für SUMMEWENNS'!$H$5:$H$505,$B7,'05 Daten für SUMMEWENNS'!$J$5:$J$505,F$5)","v":785},{"$f":"SUMIFS('05 Daten für SUMMEWENNS'!$E$5:$E$505,'05 Daten für SUMMEWENNS'!$H$5:$H$505,$B7,'05 Daten für SUMMEWENNS'!$J$5:$J$505,G$5)","v":0},{"$f":"SUMIFS('05 Daten für SUMMEWENNS'!$E$5:$E$505,'05 Daten für SUMMEWENNS'!$H$5:$H$505,$B7,'05 Daten für SUMMEWENNS'!$J$5:$J$505,H$5)","v":0}]
[null,2,{"$f":"SUMIFS('05 Daten für SUMMEWENNS'!$E$5:$E$505,'05 Daten für SUMMEWENNS'!$H$5:$H$505,$B8,'05 Daten für SUMMEWENNS'!$J$5:$J$505,C$5)","v":0},{"$f":"SUMIFS('05 Daten für SUMMEWENNS'!$E$5:$E$505,'05 Daten für SUMMEWENNS'!$H$5:$H$505,$B8,'05 Daten für SUMMEWENNS'!$J$5:$J$505,D$5)","v":0},{"$f":"SUMIFS('05 Daten für SUMMEWENNS'!$E$5:$E$505,'05 Daten für SUMMEWENNS'!$H$5:$H$505,$B8,'05 Daten für SUMMEWENNS'!$J$5:$J$505,E$5)","v":0},{"$f":"SUMIFS('05 Daten für SUMMEWENNS'!$E$5:$E$505,'05 Daten für SUMMEWENNS'!$H$5:$H$505,$B8,'05 Daten für SUMMEWENNS'!$J$5:$J$505,F$5)","v":0},{"$f":"SUMIFS('05 Daten für SUMMEWENNS'!$E$5:$E$505,'05 Daten für SUMMEWENNS'!$H$5:$H$505,$B8,'05 Daten für SUMMEWENNS'!$J$5:$J$505,G$5)","v":0},{"$f":"SUMIFS('05 Daten für SUMMEWENNS'!$E$5:$E$505,'05 Daten für SUMMEWENNS'!$H$5:$H$505,$B8,'05 Daten für SUMMEWENNS'!$J$5:$J$505,H$5)","v":0}]
[0,3,{"$f":"SUMIFS('05 Daten für SUMMEWENNS'!$E$5:$E$505,'05 Daten für SUMMEWENNS'!$H$5:$H$505,$B9,'05 Daten für SUMMEWENNS'!$J$5:$J$505,C$5)","v":0},{"$f":"SUMIFS('05 Daten für SUMMEWENNS'!$E$5:$E$505,'05 Daten für SUMMEWENNS'!$H$5:$H$505,$B9,'05 Daten für SUMMEWENNS'!$J$5:$J$505,D$5)","v":0},{"$f":"SUMIFS('05 Daten für SUMMEWENNS'!$E$5:$E$505,'05 Daten für SUMMEWENNS'!$H$5:$H$505,$B9,'05 Daten für SUMMEWENNS'!$J$5:$J$505,E$5)","v":0},{"$f":"SUMIFS('05 Daten für SUMMEWENNS'!$E$5:$E$505,'05 Daten für SUMMEWENNS'!$H$5:$H$505,$B9,'05 Daten für SUMMEWENNS'!$J$5:$J$505,F$5)","v":0},{"$f":"SUMIFS('05 Daten für SUMMEWENNS'!$E$5:$E$505,'05 Daten für SUMMEWENNS'!$H$5:$H$505,$B9,'05 Daten für SUMMEWENNS'!$J$5:$J$505,G$5)","v":0},{"$f":"SUMIFS('05 Daten für SUMMEWENNS'!$E$5:$E$505,'05 Daten für SUMMEWENNS'!$H$5:$H$505,$B9,'05 Daten für SUMMEWENNS'!$J$5:$J$505,H$5)","v":0}]
[null,4,{"$f":"SUMIFS('05 Daten für SUMMEWENNS'!$E$5:$E$505,'05 Daten für SUMMEWENNS'!$H$5:$H$505,$B10,'05 Daten für SUMMEWENNS'!$J$5:$J$505,C$5)","v":10599.479999999998},{"$f":"SUMIFS('05 Daten für SUMMEWENNS'!$E$5:$E$505,'05 Daten für SUMMEWENNS'!$H$5:$H$505,$B10,'05 Daten für SUMMEWENNS'!$J$5:$J$505,D$5)","v":6211.4760000000006},{"$f":"SUMIFS('05 Daten für SUMMEWENNS'!$E$5:$E$505,'05 Daten für SUMMEWENNS'!$H$5:$H$505,$B10,'05 Daten für SUMMEWENNS'!$J$5:$J$505,E$5)","v":0},{"$f":"SUMIFS('05 Daten für SUMMEWENNS'!$E$5:$E$505,'05 Daten für SUMMEWENNS'!$H$5:$H$505,$B10,'05 Daten für SUMMEWENNS'!$J$5:$J$505,F$5)","v":7743.9959999999992},{"$f":"SUMIFS('05 Daten für SUMMEWENNS'!$E$5:$E$505,'05 Daten für SUMMEWENNS'!$H$5:$H$505,$B10,'05 Daten für SUMMEWENNS'!$J$5:$J$505,G$5)","v":0},{"$f":"SUMIFS('05 Daten für SUMMEWENNS'!$E$5:$E$505,'05 Daten für SUMMEWENNS'!$H$5:$H$505,$B10,'05 Daten für SUMMEWENNS'!$J$5:$J$505,H$5)","v":0},null,null,"Summe aller Werte in Spalte E auf dem Blatt \"Daten für SUMMEWENNS\", für die in Spalte H eine \"1\" steht und in Spalte J ein \"B\"",null,null,null,"Sum of all values in column E on worksheet \"Data for SUMIF\", where there is a \"1\" in column H and a \"B\" in column J."]
[null,5,{"$f":"SUMIFS('05 Daten für SUMMEWENNS'!$E$5:$E$505,'05 Daten für SUMMEWENNS'!$H$5:$H$505,$B11,'05 Daten für SUMMEWENNS'!$J$5:$J$505,C$5)","v":0},{"$f":"SUMIFS('05 Daten für SUMMEWENNS'!$E$5:$E$505,'05 Daten für SUMMEWENNS'!$H$5:$H$505,$B11,'05 Daten für SUMMEWENNS'!$J$5:$J$505,D$5)","v":0},{"$f":"SUMIFS('05 Daten für SUMMEWENNS'!$E$5:$E$505,'05 Daten für SUMMEWENNS'!$H$5:$H$505,$B11,'05 Daten für SUMMEWENNS'!$J$5:$J$505,E$5)","v":0},{"$f":"SUMIFS('05 Daten für SUMMEWENNS'!$E$5:$E$505,'05 Daten für SUMMEWENNS'!$H$5:$H$505,$B11,'05 Daten für SUMMEWENNS'!$J$5:$J$505,F$5)","v":0},{"$f":"SUMIFS('05 Daten für SUMMEWENNS'!$E$5:$E$505,'05 Daten für SUMMEWENNS'!$H$5:$H$505,$B11,'05 Daten für SUMMEWENNS'!$J$5:$J$505,G$5)","v":0},{"$f":"SUMIFS('05 Daten für SUMMEWENNS'!$E$5:$E$505,'05 Daten für SUMMEWENNS'!$H$5:$H$505,$B11,'05 Daten für SUMMEWENNS'!$J$5:$J$505,H$5)","v":0}]
[null,6,{"$f":"SUMIFS('05 Daten für SUMMEWENNS'!$E$5:$E$505,'05 Daten für SUMMEWENNS'!$H$5:$H$505,$B12,'05 Daten für SUMMEWENNS'!$J$5:$J$505,C$5)","v":0},{"$f":"SUMIFS('05 Daten für SUMMEWENNS'!$E$5:$E$505,'05 Daten für SUMMEWENNS'!$H$5:$H$505,$B12,'05 Daten für SUMMEWENNS'!$J$5:$J$505,D$5)","v":0},{"$f":"SUMIFS('05 Daten für SUMMEWENNS'!$E$5:$E$505,'05 Daten für SUMMEWENNS'!$H$5:$H$505,$B12,'05 Daten für SUMMEWENNS'!$J$5:$J$505,E$5)","v":0},{"$f":"SUMIFS('05 Daten für SUMMEWENNS'!$E$5:$E$505,'05 Daten für SUMMEWENNS'!$H$5:$H$505,$B12,'05 Daten für SUMMEWENNS'!$J$5:$J$505,F$5)","v":0},{"$f":"SUMIFS('05 Daten für SUMMEWENNS'!$E$5:$E$505,'05 Daten für SUMMEWENNS'!$H$5:$H$505,$B12,'05 Daten für SUMMEWENNS'!$J$5:$J$505,G$5)","v":0},{"$f":"SUMIFS('05 Daten für SUMMEWENNS'!$E$5:$E$505,'05 Daten für SUMMEWENNS'!$H$5:$H$505,$B12,'05 Daten für SUMMEWENNS'!$J$5:$J$505,H$5)","v":0}]
[null,7,{"$f":"SUMIFS('05 Daten für SUMMEWENNS'!$E$5:$E$505,'05 Daten für SUMMEWENNS'!$H$5:$H$505,$B13,'05 Daten für SUMMEWENNS'!$J$5:$J$505,C$5)","v":0},{"$f":"SUMIFS('05 Daten für SUMMEWENNS'!$E$5:$E$505,'05 Daten für SUMMEWENNS'!$H$5:$H$505,$B13,'05 Daten für SUMMEWENNS'!$J$5:$J$505,D$5)","v":0},{"$f":"SUMIFS('05 Daten für SUMMEWENNS'!$E$5:$E$505,'05 Daten für SUMMEWENNS'!$H$5:$H$505,$B13,'05 Daten für SUMMEWENNS'!$J$5:$J$505,E$5)","v":0},{"$f":"SUMIFS('05 Daten für SUMMEWENNS'!$E$5:$E$505,'05 Daten für SUMMEWENNS'!$H$5:$H$505,$B13,'05 Daten für SUMMEWENNS'!$J$5:$J$505,F$5)","v":0},{"$f":"SUMIFS('05 Daten für SUMMEWENNS'!$E$5:$E$505,'05 Daten für SUMMEWENNS'!$H$5:$H$505,$B13,'05 Daten für SUMMEWENNS'!$J$5:$J$505,G$5)","v":0},{"$f":"SUMIFS('05 Daten für SUMMEWENNS'!$E$5:$E$505,'05 Daten für SUMMEWENNS'!$H$5:$H$505,$B13,'05 Daten für SUMMEWENNS'!$J$5:$J$505,H$5)","v":0}]
[null,8,{"$f":"SUMIFS('05 Daten für SUMMEWENNS'!$E$5:$E$505,'05 Daten für SUMMEWENNS'!$H$5:$H$505,$B14,'05 Daten für SUMMEWENNS'!$J$5:$J$505,C$5)","v":0},{"$f":"SUMIFS('05 Daten für SUMMEWENNS'!$E$5:$E$505,'05 Daten für SUMMEWENNS'!$H$5:$H$505,$B14,'05 Daten für SUMMEWENNS'!$J$5:$J$505,D$5)","v":0},{"$f":"SUMIFS('05 Daten für SUMMEWENNS'!$E$5:$E$505,'05 Daten für SUMMEWENNS'!$H$5:$H$505,$B14,'05 Daten für SUMMEWENNS'!$J$5:$J$505,E$5)","v":0},{"$f":"SUMIFS('05 Daten für SUMMEWENNS'!$E$5:$E$505,'05 Daten für SUMMEWENNS'!$H$5:$H$505,$B14,'05 Daten für SUMMEWENNS'!$J$5:$J$505,F$5)","v":0},{"$f":"SUMIFS('05 Daten für SUMMEWENNS'!$E$5:$E$505,'05 Daten für SUMMEWENNS'!$H$5:$H$505,$B14,'05 Daten für SUMMEWENNS'!$J$5:$J$505,G$5)","v":0},{"$f":"SUMIFS('05 Daten für SUMMEWENNS'!$E$5:$E$505,'05 Daten für SUMMEWENNS'!$H$5:$H$505,$B14,'05 Daten für SUMMEWENNS'!$J$5:$J$505,H$5)","v":0}]
[null,9,{"$f":"SUMIFS('05 Daten für SUMMEWENNS'!$E$5:$E$505,'05 Daten für SUMMEWENNS'!$H$5:$H$505,$B15,'05 Daten für SUMMEWENNS'!$J$5:$J$505,C$5)","v":0},{"$f":"SUMIFS('05 Daten für SUMMEWENNS'!$E$5:$E$505,'05 Daten für SUMMEWENNS'!$H$5:$H$505,$B15,'05 Daten für SUMMEWENNS'!$J$5:$J$505,D$5)","v":0},{"$f":"SUMIFS('05 Daten für SUMMEWENNS'!$E$5:$E$505,'05 Daten für SUMMEWENNS'!$H$5:$H$505,$B15,'05 Daten für SUMMEWENNS'!$J$5:$J$505,E$5)","v":0},{"$f":"SUMIFS('05 Daten für SUMMEWENNS'!$E$5:$E$505,'05 Daten für SUMMEWENNS'!$H$5:$H$505,$B15,'05 Daten für SUMMEWENNS'!$J$5:$J$505,F$5)","v":2174.4},{"$f":"SUMIFS('05 Daten für SUMMEWENNS'!$E$5:$E$505,'05 Daten für SUMMEWENNS'!$H$5:$H$505,$B15,'05 Daten für SUMMEWENNS'!$J$5:$J$505,G$5)","v":0},{"$f":"SUMIFS('05 Daten für SUMMEWENNS'!$E$5:$E$505,'05 Daten für SUMMEWENNS'!$H$5:$H$505,$B15,'05 Daten für SUMMEWENNS'!$J$5:$J$505,H$5)","v":0}]
[null,10,{"$f":"SUMIFS('05 Daten für SUMMEWENNS'!$E$5:$E$505,'05 Daten für SUMMEWENNS'!$H$5:$H$505,$B16,'05 Daten für SUMMEWENNS'!$J$5:$J$505,C$5)","v":0},{"$f":"SUMIFS('05 Daten für SUMMEWENNS'!$E$5:$E$505,'05 Daten für SUMMEWENNS'!$H$5:$H$505,$B16,'05 Daten für SUMMEWENNS'!$J$5:$J$505,D$5)","v":0},{"$f":"SUMIFS('05 Daten für SUMMEWENNS'!$E$5:$E$505,'05 Daten für SUMMEWENNS'!$H$5:$H$505,$B16,'05 Daten für SUMMEWENNS'!$J$5:$J$505,E$5)","v":0},{"$f":"SUMIFS('05 Daten für SUMMEWENNS'!$E$5:$E$505,'05 Daten für SUMMEWENNS'!$H$5:$H$505,$B16,'05 Daten für SUMMEWENNS'!$J$5:$J$505,F$5)","v":0},{"$f":"SUMIFS('05 Daten für SUMMEWENNS'!$E$5:$E$505,'05 Daten für SUMMEWENNS'!$H$5:$H$505,$B16,'05 Daten für SUMMEWENNS'!$J$5:$J$505,G$5)","v":0},{"$f":"SUMIFS('05 Daten für SUMMEWENNS'!$E$5:$E$505,'05 Daten für SUMMEWENNS'!$H$5:$H$505,$B16,'05 Daten für SUMMEWENNS'!$J$5:$J$505,H$5)","v":0}]
[null,11,{"$f":"SUMIFS('05 Daten für SUMMEWENNS'!$E$5:$E$505,'05 Daten für SUMMEWENNS'!$H$5:$H$505,$B17,'05 Daten für SUMMEWENNS'!$J$5:$J$505,C$5)","v":0},{"$f":"SUMIFS('05 Daten für SUMMEWENNS'!$E$5:$E$505,'05 Daten für SUMMEWENNS'!$H$5:$H$505,$B17,'05 Daten für SUMMEWENNS'!$J$5:$J$505,D$5)","v":0},{"$f":"SUMIFS('05 Daten für SUMMEWENNS'!$E$5:$E$505,'05 Daten für SUMMEWENNS'!$H$5:$H$505,$B17,'05 Daten für SUMMEWENNS'!$J$5:$J$505,E$5)","v":0},{"$f":"SUMIFS('05 Daten für SUMMEWENNS'!$E$5:$E$505,'05 Daten für SUMMEWENNS'!$H$5:$H$505,$B17,'05 Daten für SUMMEWENNS'!$J$5:$J$505,F$5)","v":0},{"$f":"SUMIFS('05 Daten für SUMMEWENNS'!$E$5:$E$505,'05 Daten für SUMMEWENNS'!$H$5:$H$505,$B17,'05 Daten für SUMMEWENNS'!$J$5:$J$505,G$5)","v":0},{"$f":"SUMIFS('05 Daten für SUMMEWENNS'!$E$5:$E$505,'05 Daten für SUMMEWENNS'!$H$5:$H$505,$B17,'05 Daten für SUMMEWENNS'!$J$5:$J$505,H$5)","v":0},null,{"$f":"_xlfn.FORMULATEXT(C7)","v":"=SUMIFS('05 Daten für SUMMEWENNS'!$E$5:$E$505,'05 Daten für SUMMEWENNS'!$H$5:$H$505,$B7,'05 Daten für SUMMEWENNS'!$J$5:$J$505,C$5)"}]
[null,12,{"$f":"SUMIFS('05 Daten für SUMMEWENNS'!$E$5:$E$505,'05 Daten für SUMMEWENNS'!$H$5:$H$505,$B18,'05 Daten für SUMMEWENNS'!$J$5:$J$505,C$5)","v":0},{"$f":"SUMIFS('05 Daten für SUMMEWENNS'!$E$5:$E$505,'05 Daten für SUMMEWENNS'!$H$5:$H$505,$B18,'05 Daten für SUMMEWENNS'!$J$5:$J$505,D$5)","v":0},{"$f":"SUMIFS('05 Daten für SUMMEWENNS'!$E$5:$E$505,'05 Daten für SUMMEWENNS'!$H$5:$H$505,$B18,'05 Daten für SUMMEWENNS'!$J$5:$J$505,E$5)","v":0},{"$f":"SUMIFS('05 Daten für SUMMEWENNS'!$E$5:$E$505,'05 Daten für SUMMEWENNS'!$H$5:$H$505,$B18,'05 Daten für SUMMEWENNS'!$J$5:$J$505,F$5)","v":0},{"$f":"SUMIFS('05 Daten für SUMMEWENNS'!$E$5:$E$505,'05 Daten für SUMMEWENNS'!$H$5:$H$505,$B18,'05 Daten für SUMMEWENNS'!$J$5:$J$505,G$5)","v":0},{"$f":"SUMIFS('05 Daten für SUMMEWENNS'!$E$5:$E$505,'05 Daten für SUMMEWENNS'!$H$5:$H$505,$B18,'05 Daten für SUMMEWENNS'!$J$5:$J$505,H$5)","v":0}]
[null,13,{"$f":"SUMIFS('05 Daten für SUMMEWENNS'!$E$5:$E$505,'05 Daten für SUMMEWENNS'!$H$5:$H$505,$B19,'05 Daten für SUMMEWENNS'!$J$5:$J$505,C$5)","v":0},{"$f":"SUMIFS('05 Daten für SUMMEWENNS'!$E$5:$E$505,'05 Daten für SUMMEWENNS'!$H$5:$H$505,$B19,'05 Daten für SUMMEWENNS'!$J$5:$J$505,D$5)","v":0},{"$f":"SUMIFS('05 Daten für SUMMEWENNS'!$E$5:$E$505,'05 Daten für SUMMEWENNS'!$H$5:$H$505,$B19,'05 Daten für SUMMEWENNS'!$J$5:$J$505,E$5)","v":0},{"$f":"SUMIFS('05 Daten für SUMMEWENNS'!$E$5:$E$505,'05 Daten für SUMMEWENNS'!$H$5:$H$505,$B19,'05 Daten für SUMMEWENNS'!$J$5:$J$505,F$5)","v":0},{"$f":"SUMIFS('05 Daten für SUMMEWENNS'!$E$5:$E$505,'05 Daten für SUMMEWENNS'!$H$5:$H$505,$B19,'05 Daten für SUMMEWENNS'!$J$5:$J$505,G$5)","v":0},{"$f":"SUMIFS('05 Daten für SUMMEWENNS'!$E$5:$E$505,'05 Daten für SUMMEWENNS'!$H$5:$H$505,$B19,'05 Daten für SUMMEWENNS'!$J$5:$J$505,H$5)","v":0}]
[null,14,{"$f":"SUMIFS('05 Daten für SUMMEWENNS'!$E$5:$E$505,'05 Daten für SUMMEWENNS'!$H$5:$H$505,$B20,'05 Daten für SUMMEWENNS'!$J$5:$J$505,C$5)","v":0},{"$f":"SUMIFS('05 Daten für SUMMEWENNS'!$E$5:$E$505,'05 Daten für SUMMEWENNS'!$H$5:$H$505,$B20,'05 Daten für SUMMEWENNS'!$J$5:$J$505,D$5)","v":0},{"$f":"SUMIFS('05 Daten für SUMMEWENNS'!$E$5:$E$505,'05 Daten für SUMMEWENNS'!$H$5:$H$505,$B20,'05 Daten für SUMMEWENNS'!$J$5:$J$505,E$5)","v":0},{"$f":"SUMIFS('05 Daten für SUMMEWENNS'!$E$5:$E$505,'05 Daten für SUMMEWENNS'!$H$5:$H$505,$B20,'05 Daten für SUMMEWENNS'!$J$5:$J$505,F$5)","v":0},{"$f":"SUMIFS('05 Daten für SUMMEWENNS'!$E$5:$E$505,'05 Daten für SUMMEWENNS'!$H$5:$H$505,$B20,'05 Daten für SUMMEWENNS'!$J$5:$J$505,G$5)","v":0},{"$f":"SUMIFS('05 Daten für SUMMEWENNS'!$E$5:$E$505,'05 Daten für SUMMEWENNS'!$H$5:$H$505,$B20,'05 Daten für SUMMEWENNS'!$J$5:$J$505,H$5)","v":0}]
[null,15,{"$f":"SUMIFS('05 Daten für SUMMEWENNS'!$E$5:$E$505,'05 Daten für SUMMEWENNS'!$H$5:$H$505,$B21,'05 Daten für SUMMEWENNS'!$J$5:$J$505,C$5)","v":0},{"$f":"SUMIFS('05 Daten für SUMMEWENNS'!$E$5:$E$505,'05 Daten für SUMMEWENNS'!$H$5:$H$505,$B21,'05 Daten für SUMMEWENNS'!$J$5:$J$505,D$5)","v":0},{"$f":"SUMIFS('05 Daten für SUMMEWENNS'!$E$5:$E$505,'05 Daten für SUMMEWENNS'!$H$5:$H$505,$B21,'05 Daten für SUMMEWENNS'!$J$5:$J$505,E$5)","v":0},{"$f":"SUMIFS('05 Daten für SUMMEWENNS'!$E$5:$E$505,'05 Daten für SUMMEWENNS'!$H$5:$H$505,$B21,'05 Daten für SUMMEWENNS'!$J$5:$J$505,F$5)","v":0},{"$f":"SUMIFS('05 Daten für SUMMEWENNS'!$E$5:$E$505,'05 Daten für SUMMEWENNS'!$H$5:$H$505,$B21,'05 Daten für SUMMEWENNS'!$J$5:$J$505,G$5)","v":0},{"$f":"SUMIFS('05 Daten für SUMMEWENNS'!$E$5:$E$505,'05 Daten für SUMMEWENNS'!$H$5:$H$505,$B21,'05 Daten für SUMMEWENNS'!$J$5:$J$505,H$5)","v":0}]
[null,16,{"$f":"SUMIFS('05 Daten für SUMMEWENNS'!$E$5:$E$505,'05 Daten für SUMMEWENNS'!$H$5:$H$505,$B22,'05 Daten für SUMMEWENNS'!$J$5:$J$505,C$5)","v":0},{"$f":"SUMIFS('05 Daten für SUMMEWENNS'!$E$5:$E$505,'05 Daten für SUMMEWENNS'!$H$5:$H$505,$B22,'05 Daten für SUMMEWENNS'!$J$5:$J$505,D$5)","v":0},{"$f":"SUMIFS('05 Daten für SUMMEWENNS'!$E$5:$E$505,'05 Daten für SUMMEWENNS'!$H$5:$H$505,$B22,'05 Daten für SUMMEWENNS'!$J$5:$J$505,E$5)","v":0},{"$f":"SUMIFS('05 Daten für SUMMEWENNS'!$E$5:$E$505,'05 Daten für SUMMEWENNS'!$H$5:$H$505,$B22,'05 Daten für SUMMEWENNS'!$J$5:$J$505,F$5)","v":0},{"$f":"SUMIFS('05 Daten für SUMMEWENNS'!$E$5:$E$505,'05 Daten für SUMMEWENNS'!$H$5:$H$505,$B22,'05 Daten für SUMMEWENNS'!$J$5:$J$505,G$5)","v":0},{"$f":"SUMIFS('05 Daten für SUMMEWENNS'!$E$5:$E$505,'05 Daten für SUMMEWENNS'!$H$5:$H$505,$B22,'05 Daten für SUMMEWENNS'!$J$5:$J$505,H$5)","v":0}]
[null,17,{"$f":"SUMIFS('05 Daten für SUMMEWENNS'!$E$5:$E$505,'05 Daten für SUMMEWENNS'!$H$5:$H$505,$B23,'05 Daten für SUMMEWENNS'!$J$5:$J$505,C$5)","v":0},{"$f":"SUMIFS('05 Daten für SUMMEWENNS'!$E$5:$E$505,'05 Daten für SUMMEWENNS'!$H$5:$H$505,$B23,'05 Daten für SUMMEWENNS'!$J$5:$J$505,D$5)","v":0},{"$f":"SUMIFS('05 Daten für SUMMEWENNS'!$E$5:$E$505,'05 Daten für SUMMEWENNS'!$H$5:$H$505,$B23,'05 Daten für SUMMEWENNS'!$J$5:$J$505,E$5)","v":0},{"$f":"SUMIFS('05 Daten für SUMMEWENNS'!$E$5:$E$505,'05 Daten für SUMMEWENNS'!$H$5:$H$505,$B23,'05 Daten für SUMMEWENNS'!$J$5:$J$505,F$5)","v":0},{"$f":"SUMIFS('05 Daten für SUMMEWENNS'!$E$5:$E$505,'05 Daten für SUMMEWENNS'!$H$5:$H$505,$B23,'05 Daten für SUMMEWENNS'!$J$5:$J$505,G$5)","v":0},{"$f":"SUMIFS('05 Daten für SUMMEWENNS'!$E$5:$E$505,'05 Daten für SUMMEWENNS'!$H$5:$H$505,$B23,'05 Daten für SUMMEWENNS'!$J$5:$J$505,H$5)","v":0}]
[null,18,{"$f":"SUMIFS('05 Daten für SUMMEWENNS'!$E$5:$E$505,'05 Daten für SUMMEWENNS'!$H$5:$H$505,$B24,'05 Daten für SUMMEWENNS'!$J$5:$J$505,C$5)","v":0},{"$f":"SUMIFS('05 Daten für SUMMEWENNS'!$E$5:$E$505,'05 Daten für SUMMEWENNS'!$H$5:$H$505,$B24,'05 Daten für SUMMEWENNS'!$J$5:$J$505,D$5)","v":0},{"$f":"SUMIFS('05 Daten für SUMMEWENNS'!$E$5:$E$505,'05 Daten für SUMMEWENNS'!$H$5:$H$505,$B24,'05 Daten für SUMMEWENNS'!$J$5:$J$505,E$5)","v":0},{"$f":"SUMIFS('05 Daten für SUMMEWENNS'!$E$5:$E$505,'05 Daten für SUMMEWENNS'!$H$5:$H$505,$B24,'05 Daten für SUMMEWENNS'!$J$5:$J$505,F$5)","v":0},{"$f":"SUMIFS('05 Daten für SUMMEWENNS'!$E$5:$E$505,'05 Daten für SUMMEWENNS'!$H$5:$H$505,$B24,'05 Daten für SUMMEWENNS'!$J$5:$J$505,G$5)","v":0},{"$f":"SUMIFS('05 Daten für SUMMEWENNS'!$E$5:$E$505,'05 Daten für SUMMEWENNS'!$H$5:$H$505,$B24,'05 Daten für SUMMEWENNS'!$J$5:$J$505,H$5)","v":0}]
[null,19,{"$f":"SUMIFS('05 Daten für SUMMEWENNS'!$E$5:$E$505,'05 Daten für SUMMEWENNS'!$H$5:$H$505,$B25,'05 Daten für SUMMEWENNS'!$J$5:$J$505,C$5)","v":0},{"$f":"SUMIFS('05 Daten für SUMMEWENNS'!$E$5:$E$505,'05 Daten für SUMMEWENNS'!$H$5:$H$505,$B25,'05 Daten für SUMMEWENNS'!$J$5:$J$505,D$5)","v":0},{"$f":"SUMIFS('05 Daten für SUMMEWENNS'!$E$5:$E$505,'05 Daten für SUMMEWENNS'!$H$5:$H$505,$B25,'05 Daten für SUMMEWENNS'!$J$5:$J$505,E$5)","v":0},{"$f":"SUMIFS('05 Daten für SUMMEWENNS'!$E$5:$E$505,'05 Daten für SUMMEWENNS'!$H$5:$H$505,$B25,'05 Daten für SUMMEWENNS'!$J$5:$J$505,F$5)","v":0},{"$f":"SUMIFS('05 Daten für SUMMEWENNS'!$E$5:$E$505,'05 Daten für SUMMEWENNS'!$H$5:$H$505,$B25,'05 Daten für SUMMEWENNS'!$J$5:$J$505,G$5)","v":0},{"$f":"SUMIFS('05 Daten für SUMMEWENNS'!$E$5:$E$505,'05 Daten für SUMMEWENNS'!$H$5:$H$505,$B25,'05 Daten für SUMMEWENNS'!$J$5:$J$505,H$5)","v":0}]
[null,20,{"$f":"SUMIFS('05 Daten für SUMMEWENNS'!$E$5:$E$505,'05 Daten für SUMMEWENNS'!$H$5:$H$505,$B26,'05 Daten für SUMMEWENNS'!$J$5:$J$505,C$5)","v":0},{"$f":"SUMIFS('05 Daten für SUMMEWENNS'!$E$5:$E$505,'05 Daten für SUMMEWENNS'!$H$5:$H$505,$B26,'05 Daten für SUMMEWENNS'!$J$5:$J$505,D$5)","v":0},{"$f":"SUMIFS('05 Daten für SUMMEWENNS'!$E$5:$E$505,'05 Daten für SUMMEWENNS'!$H$5:$H$505,$B26,'05 Daten für SUMMEWENNS'!$J$5:$J$505,E$5)","v":0},{"$f":"SUMIFS('05 Daten für SUMMEWENNS'!$E$5:$E$505,'05 Daten für SUMMEWENNS'!$H$5:$H$505,$B26,'05 Daten für SUMMEWENNS'!$J$5:$J$505,F$5)","v":0},{"$f":"SUMIFS('05 Daten für SUMMEWENNS'!$E$5:$E$505,'05 Daten für SUMMEWENNS'!$H$5:$H$505,$B26,'05 Daten für SUMMEWENNS'!$J$5:$J$505,G$5)","v":0},{"$f":"SUMIFS('05 Daten für SUMMEWENNS'!$E$5:$E$505,'05 Daten für SUMMEWENNS'!$H$5:$H$505,$B26,'05 Daten für SUMMEWENNS'!$J$5:$J$505,H$5)","v":0}]
[null,21,{"$f":"SUMIFS('05 Daten für SUMMEWENNS'!$E$5:$E$505,'05 Daten für SUMMEWENNS'!$H$5:$H$505,$B27,'05 Daten für SUMMEWENNS'!$J$5:$J$505,C$5)","v":0},{"$f":"SUMIFS('05 Daten für SUMMEWENNS'!$E$5:$E$505,'05 Daten für SUMMEWENNS'!$H$5:$H$505,$B27,'05 Daten für SUMMEWENNS'!$J$5:$J$505,D$5)","v":0},{"$f":"SUMIFS('05 Daten für SUMMEWENNS'!$E$5:$E$505,'05 Daten für SUMMEWENNS'!$H$5:$H$505,$B27,'05 Daten für SUMMEWENNS'!$J$5:$J$505,E$5)","v":0},{"$f":"SUMIFS('05 Daten für SUMMEWENNS'!$E$5:$E$505,'05 Daten für SUMMEWENNS'!$H$5:$H$505,$B27,'05 Daten für SUMMEWENNS'!$J$5:$J$505,F$5)","v":0},{"$f":"SUMIFS('05 Daten für SUMMEWENNS'!$E$5:$E$505,'05 Daten für SUMMEWENNS'!$H$5:$H$505,$B27,'05 Daten für SUMMEWENNS'!$J$5:$J$505,G$5)","v":0},{"$f":"SUMIFS('05 Daten für SUMMEWENNS'!$E$5:$E$505,'05 Daten für SUMMEWENNS'!$H$5:$H$505,$B27,'05 Daten für SUMMEWENNS'!$J$5:$J$505,H$5)","v":0}]
[null,22,{"$f":"SUMIFS('05 Daten für SUMMEWENNS'!$E$5:$E$505,'05 Daten für SUMMEWENNS'!$H$5:$H$505,$B28,'05 Daten für SUMMEWENNS'!$J$5:$J$505,C$5)","v":0},{"$f":"SUMIFS('05 Daten für SUMMEWENNS'!$E$5:$E$505,'05 Daten für SUMMEWENNS'!$H$5:$H$505,$B28,'05 Daten für SUMMEWENNS'!$J$5:$J$505,D$5)","v":0},{"$f":"SUMIFS('05 Daten für SUMMEWENNS'!$E$5:$E$505,'05 Daten für SUMMEWENNS'!$H$5:$H$505,$B28,'05 Daten für SUMMEWENNS'!$J$5:$J$505,E$5)","v":0},{"$f":"SUMIFS('05 Daten für SUMMEWENNS'!$E$5:$E$505,'05 Daten für SUMMEWENNS'!$H$5:$H$505,$B28,'05 Daten für SUMMEWENNS'!$J$5:$J$505,F$5)","v":0},{"$f":"SUMIFS('05 Daten für SUMMEWENNS'!$E$5:$E$505,'05 Daten für SUMMEWENNS'!$H$5:$H$505,$B28,'05 Daten für SUMMEWENNS'!$J$5:$J$505,G$5)","v":0},{"$f":"SUMIFS('05 Daten für SUMMEWENNS'!$E$5:$E$505,'05 Daten für SUMMEWENNS'!$H$5:$H$505,$B28,'05 Daten für SUMMEWENNS'!$J$5:$J$505,H$5)","v":0}]
[null,23,{"$f":"SUMIFS('05 Daten für SUMMEWENNS'!$E$5:$E$505,'05 Daten für SUMMEWENNS'!$H$5:$H$505,$B29,'05 Daten für SUMMEWENNS'!$J$5:$J$505,C$5)","v":0},{"$f":"SUMIFS('05 Daten für SUMMEWENNS'!$E$5:$E$505,'05 Daten für SUMMEWENNS'!$H$5:$H$505,$B29,'05 Daten für SUMMEWENNS'!$J$5:$J$505,D$5)","v":0},{"$f":"SUMIFS('05 Daten für SUMMEWENNS'!$E$5:$E$505,'05 Daten für SUMMEWENNS'!$H$5:$H$505,$B29,'05 Daten für SUMMEWENNS'!$J$5:$J$505,E$5)","v":0},{"$f":"SUMIFS('05 Daten für SUMMEWENNS'!$E$5:$E$505,'05 Daten für SUMMEWENNS'!$H$5:$H$505,$B29,'05 Daten für SUMMEWENNS'!$J$5:$J$505,F$5)","v":0},{"$f":"SUMIFS('05 Daten für SUMMEWENNS'!$E$5:$E$505,'05 Daten für SUMMEWENNS'!$H$5:$H$505,$B29,'05 Daten für SUMMEWENNS'!$J$5:$J$505,G$5)","v":0},{"$f":"SUMIFS('05 Daten für SUMMEWENNS'!$E$5:$E$505,'05 Daten für SUMMEWENNS'!$H$5:$H$505,$B29,'05 Daten für SUMMEWENNS'!$J$5:$J$505,H$5)","v":0}]
[null,24,{"$f":"SUMIFS('05 Daten für SUMMEWENNS'!$E$5:$E$505,'05 Daten für SUMMEWENNS'!$H$5:$H$505,$B30,'05 Daten für SUMMEWENNS'!$J$5:$J$505,C$5)","v":0},{"$f":"SUMIFS('05 Daten für SUMMEWENNS'!$E$5:$E$505,'05 Daten für SUMMEWENNS'!$H$5:$H$505,$B30,'05 Daten für SUMMEWENNS'!$J$5:$J$505,D$5)","v":0},{"$f":"SUMIFS('05 Daten für SUMMEWENNS'!$E$5:$E$505,'05 Daten für SUMMEWENNS'!$H$5:$H$505,$B30,'05 Daten für SUMMEWENNS'!$J$5:$J$505,E$5)","v":0},{"$f":"SUMIFS('05 Daten für SUMMEWENNS'!$E$5:$E$505,'05 Daten für SUMMEWENNS'!$H$5:$H$505,$B30,'05 Daten für SUMMEWENNS'!$J$5:$J$505,F$5)","v":0},{"$f":"SUMIFS('05 Daten für SUMMEWENNS'!$E$5:$E$505,'05 Daten für SUMMEWENNS'!$H$5:$H$505,$B30,'05 Daten für SUMMEWENNS'!$J$5:$J$505,G$5)","v":0},{"$f":"SUMIFS('05 Daten für SUMMEWENNS'!$E$5:$E$505,'05 Daten für SUMMEWENNS'!$H$5:$H$505,$B30,'05 Daten für SUMMEWENNS'!$J$5:$J$505,H$5)","v":0}]
[null,25,{"$f":"SUMIFS('05 Daten für SUMMEWENNS'!$E$5:$E$505,'05 Daten für SUMMEWENNS'!$H$5:$H$505,$B31,'05 Daten für SUMMEWENNS'!$J$5:$J$505,C$5)","v":0},{"$f":"SUMIFS('05 Daten für SUMMEWENNS'!$E$5:$E$505,'05 Daten für SUMMEWENNS'!$H$5:$H$505,$B31,'05 Daten für SUMMEWENNS'!$J$5:$J$505,D$5)","v":0},{"$f":"SUMIFS('05 Daten für SUMMEWENNS'!$E$5:$E$505,'05 Daten für SUMMEWENNS'!$H$5:$H$505,$B31,'05 Daten für SUMMEWENNS'!$J$5:$J$505,E$5)","v":0},{"$f":"SUMIFS('05 Daten für SUMMEWENNS'!$E$5:$E$505,'05 Daten für SUMMEWENNS'!$H$5:$H$505,$B31,'05 Daten für SUMMEWENNS'!$J$5:$J$505,F$5)","v":0},{"$f":"SUMIFS('05 Daten für SUMMEWENNS'!$E$5:$E$505,'05 Daten für SUMMEWENNS'!$H$5:$H$505,$B31,'05 Daten für SUMMEWENNS'!$J$5:$J$505,G$5)","v":0},{"$f":"SUMIFS('05 Daten für SUMMEWENNS'!$E$5:$E$505,'05 Daten für SUMMEWENNS'!$H$5:$H$505,$B31,'05 Daten für SUMMEWENNS'!$J$5:$J$505,H$5)","v":0}]
[null,26,{"$f":"SUMIFS('05 Daten für SUMMEWENNS'!$E$5:$E$505,'05 Daten für SUMMEWENNS'!$H$5:$H$505,$B32,'05 Daten für SUMMEWENNS'!$J$5:$J$505,C$5)","v":0},{"$f":"SUMIFS('05 Daten für SUMMEWENNS'!$E$5:$E$505,'05 Daten für SUMMEWENNS'!$H$5:$H$505,$B32,'05 Daten für SUMMEWENNS'!$J$5:$J$505,D$5)","v":0},{"$f":"SUMIFS('05 Daten für SUMMEWENNS'!$E$5:$E$505,'05 Daten für SUMMEWENNS'!$H$5:$H$505,$B32,'05 Daten für SUMMEWENNS'!$J$5:$J$505,E$5)","v":0},{"$f":"SUMIFS('05 Daten für SUMMEWENNS'!$E$5:$E$505,'05 Daten für SUMMEWENNS'!$H$5:$H$505,$B32,'05 Daten für SUMMEWENNS'!$J$5:$J$505,F$5)","v":0},{"$f":"SUMIFS('05 Daten für SUMMEWENNS'!$E$5:$E$505,'05 Daten für SUMMEWENNS'!$H$5:$H$505,$B32,'05 Daten für SUMMEWENNS'!$J$5:$J$505,G$5)","v":0},{"$f":"SUMIFS('05 Daten für SUMMEWENNS'!$E$5:$E$505,'05 Daten für SUMMEWENNS'!$H$5:$H$505,$B32,'05 Daten für SUMMEWENNS'!$J$5:$J$505,H$5)","v":0}]
[null,27,{"$f":"SUMIFS('05 Daten für SUMMEWENNS'!$E$5:$E$505,'05 Daten für SUMMEWENNS'!$H$5:$H$505,$B33,'05 Daten für SUMMEWENNS'!$J$5:$J$505,C$5)","v":0},{"$f":"SUMIFS('05 Daten für SUMMEWENNS'!$E$5:$E$505,'05 Daten für SUMMEWENNS'!$H$5:$H$505,$B33,'05 Daten für SUMMEWENNS'!$J$5:$J$505,D$5)","v":0},{"$f":"SUMIFS('05 Daten für SUMMEWENNS'!$E$5:$E$505,'05 Daten für SUMMEWENNS'!$H$5:$H$505,$B33,'05 Daten für SUMMEWENNS'!$J$5:$J$505,E$5)","v":0},{"$f":"SUMIFS('05 Daten für SUMMEWENNS'!$E$5:$E$505,'05 Daten für SUMMEWENNS'!$H$5:$H$505,$B33,'05 Daten für SUMMEWENNS'!$J$5:$J$505,F$5)","v":0},{"$f":"SUMIFS('05 Daten für SUMMEWENNS'!$E$5:$E$505,'05 Daten für SUMMEWENNS'!$H$5:$H$505,$B33,'05 Daten für SUMMEWENNS'!$J$5:$J$505,G$5)","v":0},{"$f":"SUMIFS('05 Daten für SUMMEWENNS'!$E$5:$E$505,'05 Daten für SUMMEWENNS'!$H$5:$H$505,$B33,'05 Daten für SUMMEWENNS'!$J$5:$J$505,H$5)","v":0}]
[null,28,{"$f":"SUMIFS('05 Daten für SUMMEWENNS'!$E$5:$E$505,'05 Daten für SUMMEWENNS'!$H$5:$H$505,$B34,'05 Daten für SUMMEWENNS'!$J$5:$J$505,C$5)","v":0},{"$f":"SUMIFS('05 Daten für SUMMEWENNS'!$E$5:$E$505,'05 Daten für SUMMEWENNS'!$H$5:$H$505,$B34,'05 Daten für SUMMEWENNS'!$J$5:$J$505,D$5)","v":0},{"$f":"SUMIFS('05 Daten für SUMMEWENNS'!$E$5:$E$505,'05 Daten für SUMMEWENNS'!$H$5:$H$505,$B34,'05 Daten für SUMMEWENNS'!$J$5:$J$505,E$5)","v":0},{"$f":"SUMIFS('05 Daten für SUMMEWENNS'!$E$5:$E$505,'05 Daten für SUMMEWENNS'!$H$5:$H$505,$B34,'05 Daten für SUMMEWENNS'!$J$5:$J$505,F$5)","v":0},{"$f":"SUMIFS('05 Daten für SUMMEWENNS'!$E$5:$E$505,'05 Daten für SUMMEWENNS'!$H$5:$H$505,$B34,'05 Daten für SUMMEWENNS'!$J$5:$J$505,G$5)","v":0},{"$f":"SUMIFS('05 Daten für SUMMEWENNS'!$E$5:$E$505,'05 Daten für SUMMEWENNS'!$H$5:$H$505,$B34,'05 Daten für SUMMEWENNS'!$J$5:$J$505,H$5)","v":0}]
[null,29,{"$f":"SUMIFS('05 Daten für SUMMEWENNS'!$E$5:$E$505,'05 Daten für SUMMEWENNS'!$H$5:$H$505,$B35,'05 Daten für SUMMEWENNS'!$J$5:$J$505,C$5)","v":0},{"$f":"SUMIFS('05 Daten für SUMMEWENNS'!$E$5:$E$505,'05 Daten für SUMMEWENNS'!$H$5:$H$505,$B35,'05 Daten für SUMMEWENNS'!$J$5:$J$505,D$5)","v":0},{"$f":"SUMIFS('05 Daten für SUMMEWENNS'!$E$5:$E$505,'05 Daten für SUMMEWENNS'!$H$5:$H$505,$B35,'05 Daten für SUMMEWENNS'!$J$5:$J$505,E$5)","v":0},{"$f":"SUMIFS('05 Daten für SUMMEWENNS'!$E$5:$E$505,'05 Daten für SUMMEWENNS'!$H$5:$H$505,$B35,'05 Daten für SUMMEWENNS'!$J$5:$J$505,F$5)","v":0},{"$f":"SUMIFS('05 Daten für SUMMEWENNS'!$E$5:$E$505,'05 Daten für SUMMEWENNS'!$H$5:$H$505,$B35,'05 Daten für SUMMEWENNS'!$J$5:$J$505,G$5)","v":0},{"$f":"SUMIFS('05 Daten für SUMMEWENNS'!$E$5:$E$505,'05 Daten für SUMMEWENNS'!$H$5:$H$505,$B35,'05 Daten für SUMMEWENNS'!$J$5:$J$505,H$5)","v":0}]
[null,30,{"$f":"SUMIFS('05 Daten für SUMMEWENNS'!$E$5:$E$505,'05 Daten für SUMMEWENNS'!$H$5:$H$505,$B36,'05 Daten für SUMMEWENNS'!$J$5:$J$505,C$5)","v":0},{"$f":"SUMIFS('05 Daten für SUMMEWENNS'!$E$5:$E$505,'05 Daten für SUMMEWENNS'!$H$5:$H$505,$B36,'05 Daten für SUMMEWENNS'!$J$5:$J$505,D$5)","v":0},{"$f":"SUMIFS('05 Daten für SUMMEWENNS'!$E$5:$E$505,'05 Daten für SUMMEWENNS'!$H$5:$H$505,$B36,'05 Daten für SUMMEWENNS'!$J$5:$J$505,E$5)","v":0},{"$f":"SUMIFS('05 Daten für SUMMEWENNS'!$E$5:$E$505,'05 Daten für SUMMEWENNS'!$H$5:$H$505,$B36,'05 Daten für SUMMEWENNS'!$J$5:$J$505,F$5)","v":0},{"$f":"SUMIFS('05 Daten für SUMMEWENNS'!$E$5:$E$505,'05 Daten für SUMMEWENNS'!$H$5:$H$505,$B36,'05 Daten für SUMMEWENNS'!$J$5:$J$505,G$5)","v":0},{"$f":"SUMIFS('05 Daten für SUMMEWENNS'!$E$5:$E$505,'05 Daten für SUMMEWENNS'!$H$5:$H$505,$B36,'05 Daten für SUMMEWENNS'!$J$5:$J$505,H$5)","v":0}]
[null,31,{"$f":"SUMIFS('05 Daten für SUMMEWENNS'!$E$5:$E$505,'05 Daten für SUMMEWENNS'!$H$5:$H$505,$B37,'05 Daten für SUMMEWENNS'!$J$5:$J$505,C$5)","v":0},{"$f":"SUMIFS('05 Daten für SUMMEWENNS'!$E$5:$E$505,'05 Daten für SUMMEWENNS'!$H$5:$H$505,$B37,'05 Daten für SUMMEWENNS'!$J$5:$J$505,D$5)","v":0},{"$f":"SUMIFS('05 Daten für SUMMEWENNS'!$E$5:$E$505,'05 Daten für SUMMEWENNS'!$H$5:$H$505,$B37,'05 Daten für SUMMEWENNS'!$J$5:$J$505,E$5)","v":0},{"$f":"SUMIFS('05 Daten für SUMMEWENNS'!$E$5:$E$505,'05 Daten für SUMMEWENNS'!$H$5:$H$505,$B37,'05 Daten für SUMMEWENNS'!$J$5:$J$505,F$5)","v":0},{"$f":"SUMIFS('05 Daten für SUMMEWENNS'!$E$5:$E$505,'05 Daten für SUMMEWENNS'!$H$5:$H$505,$B37,'05 Daten für SUMMEWENNS'!$J$5:$J$505,G$5)","v":0},{"$f":"SUMIFS('05 Daten für SUMMEWENNS'!$E$5:$E$505,'05 Daten für SUMMEWENNS'!$H$5:$H$505,$B37,'05 Daten für SUMMEWENNS'!$J$5:$J$505,H$5)","v":0}]
[null,32,{"$f":"SUMIFS('05 Daten für SUMMEWENNS'!$E$5:$E$505,'05 Daten für SUMMEWENNS'!$H$5:$H$505,$B38,'05 Daten für SUMMEWENNS'!$J$5:$J$505,C$5)","v":0},{"$f":"SUMIFS('05 Daten für SUMMEWENNS'!$E$5:$E$505,'05 Daten für SUMMEWENNS'!$H$5:$H$505,$B38,'05 Daten für SUMMEWENNS'!$J$5:$J$505,D$5)","v":0},{"$f":"SUMIFS('05 Daten für SUMMEWENNS'!$E$5:$E$505,'05 Daten für SUMMEWENNS'!$H$5:$H$505,$B38,'05 Daten für SUMMEWENNS'!$J$5:$J$505,E$5)","v":0},{"$f":"SUMIFS('05 Daten für SUMMEWENNS'!$E$5:$E$505,'05 Daten für SUMMEWENNS'!$H$5:$H$505,$B38,'05 Daten für SUMMEWENNS'!$J$5:$J$505,F$5)","v":0},{"$f":"SUMIFS('05 Daten für SUMMEWENNS'!$E$5:$E$505,'05 Daten für SUMMEWENNS'!$H$5:$H$505,$B38,'05 Daten für SUMMEWENNS'!$J$5:$J$505,G$5)","v":0},{"$f":"SUMIFS('05 Daten für SUMMEWENNS'!$E$5:$E$505,'05 Daten für SUMMEWENNS'!$H$5:$H$505,$B38,'05 Daten für SUMMEWENNS'!$J$5:$J$505,H$5)","v":0}]
[null,33,{"$f":"SUMIFS('05 Daten für SUMMEWENNS'!$E$5:$E$505,'05 Daten für SUMMEWENNS'!$H$5:$H$505,$B39,'05 Daten für SUMMEWENNS'!$J$5:$J$505,C$5)","v":0},{"$f":"SUMIFS('05 Daten für SUMMEWENNS'!$E$5:$E$505,'05 Daten für SUMMEWENNS'!$H$5:$H$505,$B39,'05 Daten für SUMMEWENNS'!$J$5:$J$505,D$5)","v":0},{"$f":"SUMIFS('05 Daten für SUMMEWENNS'!$E$5:$E$505,'05 Daten für SUMMEWENNS'!$H$5:$H$505,$B39,'05 Daten für SUMMEWENNS'!$J$5:$J$505,E$5)","v":0},{"$f":"SUMIFS('05 Daten für SUMMEWENNS'!$E$5:$E$505,'05 Daten für SUMMEWENNS'!$H$5:$H$505,$B39,'05 Daten für SUMMEWENNS'!$J$5:$J$505,F$5)","v":0},{"$f":"SUMIFS('05 Daten für SUMMEWENNS'!$E$5:$E$505,'05 Daten für SUMMEWENNS'!$H$5:$H$505,$B39,'05 Daten für SUMMEWENNS'!$J$5:$J$505,G$5)","v":0},{"$f":"SUMIFS('05 Daten für SUMMEWENNS'!$E$5:$E$505,'05 Daten für SUMMEWENNS'!$H$5:$H$505,$B39,'05 Daten für SUMMEWENNS'!$J$5:$J$505,H$5)","v":0}]
[null,34,{"$f":"SUMIFS('05 Daten für SUMMEWENNS'!$E$5:$E$505,'05 Daten für SUMMEWENNS'!$H$5:$H$505,$B40,'05 Daten für SUMMEWENNS'!$J$5:$J$505,C$5)","v":0},{"$f":"SUMIFS('05 Daten für SUMMEWENNS'!$E$5:$E$505,'05 Daten für SUMMEWENNS'!$H$5:$H$505,$B40,'05 Daten für SUMMEWENNS'!$J$5:$J$505,D$5)","v":0},{"$f":"SUMIFS('05 Daten für SUMMEWENNS'!$E$5:$E$505,'05 Daten für SUMMEWENNS'!$H$5:$H$505,$B40,'05 Daten für SUMMEWENNS'!$J$5:$J$505,E$5)","v":0},{"$f":"SUMIFS('05 Daten für SUMMEWENNS'!$E$5:$E$505,'05 Daten für SUMMEWENNS'!$H$5:$H$505,$B40,'05 Daten für SUMMEWENNS'!$J$5:$J$505,F$5)","v":0},{"$f":"SUMIFS('05 Daten für SUMMEWENNS'!$E$5:$E$505,'05 Daten für SUMMEWENNS'!$H$5:$H$505,$B40,'05 Daten für SUMMEWENNS'!$J$5:$J$505,G$5)","v":0},{"$f":"SUMIFS('05 Daten für SUMMEWENNS'!$E$5:$E$505,'05 Daten für SUMMEWENNS'!$H$5:$H$505,$B40,'05 Daten für SUMMEWENNS'!$J$5:$J$505,H$5)","v":0}]
[null,35,{"$f":"SUMIFS('05 Daten für SUMMEWENNS'!$E$5:$E$505,'05 Daten für SUMMEWENNS'!$H$5:$H$505,$B41,'05 Daten für SUMMEWENNS'!$J$5:$J$505,C$5)","v":0},{"$f":"SUMIFS('05 Daten für SUMMEWENNS'!$E$5:$E$505,'05 Daten für SUMMEWENNS'!$H$5:$H$505,$B41,'05 Daten für SUMMEWENNS'!$J$5:$J$505,D$5)","v":0},{"$f":"SUMIFS('05 Daten für SUMMEWENNS'!$E$5:$E$505,'05 Daten für SUMMEWENNS'!$H$5:$H$505,$B41,'05 Daten für SUMMEWENNS'!$J$5:$J$505,E$5)","v":0},{"$f":"SUMIFS('05 Daten für SUMMEWENNS'!$E$5:$E$505,'05 Daten für SUMMEWENNS'!$H$5:$H$505,$B41,'05 Daten für SUMMEWENNS'!$J$5:$J$505,F$5)","v":0},{"$f":"SUMIFS('05 Daten für SUMMEWENNS'!$E$5:$E$505,'05 Daten für SUMMEWENNS'!$H$5:$H$505,$B41,'05 Daten für SUMMEWENNS'!$J$5:$J$505,G$5)","v":0},{"$f":"SUMIFS('05 Daten für SUMMEWENNS'!$E$5:$E$505,'05 Daten für SUMMEWENNS'!$H$5:$H$505,$B41,'05 Daten für SUMMEWENNS'!$J$5:$J$505,H$5)","v":0}]
[null,36,{"$f":"SUMIFS('05 Daten für SUMMEWENNS'!$E$5:$E$505,'05 Daten für SUMMEWENNS'!$H$5:$H$505,$B42,'05 Daten für SUMMEWENNS'!$J$5:$J$505,C$5)","v":461.56799999999998},{"$f":"SUMIFS('05 Daten für SUMMEWENNS'!$E$5:$E$505,'05 Daten für SUMMEWENNS'!$H$5:$H$505,$B42,'05 Daten für SUMMEWENNS'!$J$5:$J$505,D$5)","v":326.01600000000002},{"$f":"SUMIFS('05 Daten für SUMMEWENNS'!$E$5:$E$505,'05 Daten für SUMMEWENNS'!$H$5:$H$505,$B42,'05 Daten für SUMMEWENNS'!$J$5:$J$505,E$5)","v":0},{"$f":"SUMIFS('05 Daten für SUMMEWENNS'!$E$5:$E$505,'05 Daten für SUMMEWENNS'!$H$5:$H$505,$B42,'05 Daten für SUMMEWENNS'!$J$5:$J$505,F$5)","v":3743.674},{"$f":"SUMIFS('05 Daten für SUMMEWENNS'!$E$5:$E$505,'05 Daten für SUMMEWENNS'!$H$5:$H$505,$B42,'05 Daten für SUMMEWENNS'!$J$5:$J$505,G$5)","v":218.34},{"$f":"SUMIFS('05 Daten für SUMMEWENNS'!$E$5:$E$505,'05 Daten für SUMMEWENNS'!$H$5:$H$505,$B42,'05 Daten für SUMMEWENNS'!$J$5:$J$505,H$5)","v":0}]
[null,37,{"$f":"SUMIFS('05 Daten für SUMMEWENNS'!$E$5:$E$505,'05 Daten für SUMMEWENNS'!$H$5:$H$505,$B43,'05 Daten für SUMMEWENNS'!$J$5:$J$505,C$5)","v":0},{"$f":"SUMIFS('05 Daten für SUMMEWENNS'!$E$5:$E$505,'05 Daten für SUMMEWENNS'!$H$5:$H$505,$B43,'05 Daten für SUMMEWENNS'!$J$5:$J$505,D$5)","v":0},{"$f":"SUMIFS('05 Daten für SUMMEWENNS'!$E$5:$E$505,'05 Daten für SUMMEWENNS'!$H$5:$H$505,$B43,'05 Daten für SUMMEWENNS'!$J$5:$J$505,E$5)","v":0},{"$f":"SUMIFS('05 Daten für SUMMEWENNS'!$E$5:$E$505,'05 Daten für SUMMEWENNS'!$H$5:$H$505,$B43,'05 Daten für SUMMEWENNS'!$J$5:$J$505,F$5)","v":0},{"$f":"SUMIFS('05 Daten für SUMMEWENNS'!$E$5:$E$505,'05 Daten für SUMMEWENNS'!$H$5:$H$505,$B43,'05 Daten für SUMMEWENNS'!$J$5:$J$505,G$5)","v":0},{"$f":"SUMIFS('05 Daten für SUMMEWENNS'!$E$5:$E$505,'05 Daten für SUMMEWENNS'!$H$5:$H$505,$B43,'05 Daten für SUMMEWENNS'!$J$5:$J$505,H$5)","v":0}]
[null,38,{"$f":"SUMIFS('05 Daten für SUMMEWENNS'!$E$5:$E$505,'05 Daten für SUMMEWENNS'!$H$5:$H$505,$B44,'05 Daten für SUMMEWENNS'!$J$5:$J$505,C$5)","v":0},{"$f":"SUMIFS('05 Daten für SUMMEWENNS'!$E$5:$E$505,'05 Daten für SUMMEWENNS'!$H$5:$H$505,$B44,'05 Daten für SUMMEWENNS'!$J$5:$J$505,D$5)","v":0},{"$f":"SUMIFS('05 Daten für SUMMEWENNS'!$E$5:$E$505,'05 Daten für SUMMEWENNS'!$H$5:$H$505,$B44,'05 Daten für SUMMEWENNS'!$J$5:$J$505,E$5)","v":0},{"$f":"SUMIFS('05 Daten für SUMMEWENNS'!$E$5:$E$505,'05 Daten für SUMMEWENNS'!$H$5:$H$505,$B44,'05 Daten für SUMMEWENNS'!$J$5:$J$505,F$5)","v":0},{"$f":"SUMIFS('05 Daten für SUMMEWENNS'!$E$5:$E$505,'05 Daten für SUMMEWENNS'!$H$5:$H$505,$B44,'05 Daten für SUMMEWENNS'!$J$5:$J$505,G$5)","v":0},{"$f":"SUMIFS('05 Daten für SUMMEWENNS'!$E$5:$E$505,'05 Daten für SUMMEWENNS'!$H$5:$H$505,$B44,'05 Daten für SUMMEWENNS'!$J$5:$J$505,H$5)","v":0}]
[null,39,{"$f":"SUMIFS('05 Daten für SUMMEWENNS'!$E$5:$E$505,'05 Daten für SUMMEWENNS'!$H$5:$H$505,$B45,'05 Daten für SUMMEWENNS'!$J$5:$J$505,C$5)","v":0},{"$f":"SUMIFS('05 Daten für SUMMEWENNS'!$E$5:$E$505,'05 Daten für SUMMEWENNS'!$H$5:$H$505,$B45,'05 Daten für SUMMEWENNS'!$J$5:$J$505,D$5)","v":0},{"$f":"SUMIFS('05 Daten für SUMMEWENNS'!$E$5:$E$505,'05 Daten für SUMMEWENNS'!$H$5:$H$505,$B45,'05 Daten für SUMMEWENNS'!$J$5:$J$505,E$5)","v":0},{"$f":"SUMIFS('05 Daten für SUMMEWENNS'!$E$5:$E$505,'05 Daten für SUMMEWENNS'!$H$5:$H$505,$B45,'05 Daten für SUMMEWENNS'!$J$5:$J$505,F$5)","v":0},{"$f":"SUMIFS('05 Daten für SUMMEWENNS'!$E$5:$E$505,'05 Daten für SUMMEWENNS'!$H$5:$H$505,$B45,'05 Daten für SUMMEWENNS'!$J$5:$J$505,G$5)","v":0},{"$f":"SUMIFS('05 Daten für SUMMEWENNS'!$E$5:$E$505,'05 Daten für SUMMEWENNS'!$H$5:$H$505,$B45,'05 Daten für SUMMEWENNS'!$J$5:$J$505,H$5)","v":0}]
[null,40,{"$f":"SUMIFS('05 Daten für SUMMEWENNS'!$E$5:$E$505,'05 Daten für SUMMEWENNS'!$H$5:$H$505,$B46,'05 Daten für SUMMEWENNS'!$J$5:$J$505,C$5)","v":0},{"$f":"SUMIFS('05 Daten für SUMMEWENNS'!$E$5:$E$505,'05 Daten für SUMMEWENNS'!$H$5:$H$505,$B46,'05 Daten für SUMMEWENNS'!$J$5:$J$505,D$5)","v":0},{"$f":"SUMIFS('05 Daten für SUMMEWENNS'!$E$5:$E$505,'05 Daten für SUMMEWENNS'!$H$5:$H$505,$B46,'05 Daten für SUMMEWENNS'!$J$5:$J$505,E$5)","v":0},{"$f":"SUMIFS('05 Daten für SUMMEWENNS'!$E$5:$E$505,'05 Daten für SUMMEWENNS'!$H$5:$H$505,$B46,'05 Daten für SUMMEWENNS'!$J$5:$J$505,F$5)","v":0},{"$f":"SUMIFS('05 Daten für SUMMEWENNS'!$E$5:$E$505,'05 Daten für SUMMEWENNS'!$H$5:$H$505,$B46,'05 Daten für SUMMEWENNS'!$J$5:$J$505,G$5)","v":0},{"$f":"SUMIFS('05 Daten für SUMMEWENNS'!$E$5:$E$505,'05 Daten für SUMMEWENNS'!$H$5:$H$505,$B46,'05 Daten für SUMMEWENNS'!$J$5:$J$505,H$5)","v":0}]
[null,41,{"$f":"SUMIFS('05 Daten für SUMMEWENNS'!$E$5:$E$505,'05 Daten für SUMMEWENNS'!$H$5:$H$505,$B47,'05 Daten für SUMMEWENNS'!$J$5:$J$505,C$5)","v":0},{"$f":"SUMIFS('05 Daten für SUMMEWENNS'!$E$5:$E$505,'05 Daten für SUMMEWENNS'!$H$5:$H$505,$B47,'05 Daten für SUMMEWENNS'!$J$5:$J$505,D$5)","v":0},{"$f":"SUMIFS('05 Daten für SUMMEWENNS'!$E$5:$E$505,'05 Daten für SUMMEWENNS'!$H$5:$H$505,$B47,'05 Daten für SUMMEWENNS'!$J$5:$J$505,E$5)","v":0},{"$f":"SUMIFS('05 Daten für SUMMEWENNS'!$E$5:$E$505,'05 Daten für SUMMEWENNS'!$H$5:$H$505,$B47,'05 Daten für SUMMEWENNS'!$J$5:$J$505,F$5)","v":0},{"$f":"SUMIFS('05 Daten für SUMMEWENNS'!$E$5:$E$505,'05 Daten für SUMMEWENNS'!$H$5:$H$505,$B47,'05 Daten für SUMMEWENNS'!$J$5:$J$505,G$5)","v":0},{"$f":"SUMIFS('05 Daten für SUMMEWENNS'!$E$5:$E$505,'05 Daten für SUMMEWENNS'!$H$5:$H$505,$B47,'05 Daten für SUMMEWENNS'!$J$5:$J$505,H$5)","v":0}]
[null,42,{"$f":"SUMIFS('05 Daten für SUMMEWENNS'!$E$5:$E$505,'05 Daten für SUMMEWENNS'!$H$5:$H$505,$B48,'05 Daten für SUMMEWENNS'!$J$5:$J$505,C$5)","v":0},{"$f":"SUMIFS('05 Daten für SUMMEWENNS'!$E$5:$E$505,'05 Daten für SUMMEWENNS'!$H$5:$H$505,$B48,'05 Daten für SUMMEWENNS'!$J$5:$J$505,D$5)","v":0},{"$f":"SUMIFS('05 Daten für SUMMEWENNS'!$E$5:$E$505,'05 Daten für SUMMEWENNS'!$H$5:$H$505,$B48,'05 Daten für SUMMEWENNS'!$J$5:$J$505,E$5)","v":0},{"$f":"SUMIFS('05 Daten für SUMMEWENNS'!$E$5:$E$505,'05 Daten für SUMMEWENNS'!$H$5:$H$505,$B48,'05 Daten für SUMMEWENNS'!$J$5:$J$505,F$5)","v":0},{"$f":"SUMIFS('05 Daten für SUMMEWENNS'!$E$5:$E$505,'05 Daten für SUMMEWENNS'!$H$5:$H$505,$B48,'05 Daten für SUMMEWENNS'!$J$5:$J$505,G$5)","v":0},{"$f":"SUMIFS('05 Daten für SUMMEWENNS'!$E$5:$E$505,'05 Daten für SUMMEWENNS'!$H$5:$H$505,$B48,'05 Daten für SUMMEWENNS'!$J$5:$J$505,H$5)","v":0}]
[null,43,{"$f":"SUMIFS('05 Daten für SUMMEWENNS'!$E$5:$E$505,'05 Daten für SUMMEWENNS'!$H$5:$H$505,$B49,'05 Daten für SUMMEWENNS'!$J$5:$J$505,C$5)","v":0},{"$f":"SUMIFS('05 Daten für SUMMEWENNS'!$E$5:$E$505,'05 Daten für SUMMEWENNS'!$H$5:$H$505,$B49,'05 Daten für SUMMEWENNS'!$J$5:$J$505,D$5)","v":0},{"$f":"SUMIFS('05 Daten für SUMMEWENNS'!$E$5:$E$505,'05 Daten für SUMMEWENNS'!$H$5:$H$505,$B49,'05 Daten für SUMMEWENNS'!$J$5:$J$505,E$5)","v":0},{"$f":"SUMIFS('05 Daten für SUMMEWENNS'!$E$5:$E$505,'05 Daten für SUMMEWENNS'!$H$5:$H$505,$B49,'05 Daten für SUMMEWENNS'!$J$5:$J$505,F$5)","v":0},{"$f":"SUMIFS('05 Daten für SUMMEWENNS'!$E$5:$E$505,'05 Daten für SUMMEWENNS'!$H$5:$H$505,$B49,'05 Daten für SUMMEWENNS'!$J$5:$J$505,G$5)","v":0},{"$f":"SUMIFS('05 Daten für SUMMEWENNS'!$E$5:$E$505,'05 Daten für SUMMEWENNS'!$H$5:$H$505,$B49,'05 Daten für SUMMEWENNS'!$J$5:$J$505,H$5)","v":0}]
[null,44,{"$f":"SUMIFS('05 Daten für SUMMEWENNS'!$E$5:$E$505,'05 Daten für SUMMEWENNS'!$H$5:$H$505,$B50,'05 Daten für SUMMEWENNS'!$J$5:$J$505,C$5)","v":0},{"$f":"SUMIFS('05 Daten für SUMMEWENNS'!$E$5:$E$505,'05 Daten für SUMMEWENNS'!$H$5:$H$505,$B50,'05 Daten für SUMMEWENNS'!$J$5:$J$505,D$5)","v":0},{"$f":"SUMIFS('05 Daten für SUMMEWENNS'!$E$5:$E$505,'05 Daten für SUMMEWENNS'!$H$5:$H$505,$B50,'05 Daten für SUMMEWENNS'!$J$5:$J$505,E$5)","v":0},{"$f":"SUMIFS('05 Daten für SUMMEWENNS'!$E$5:$E$505,'05 Daten für SUMMEWENNS'!$H$5:$H$505,$B50,'05 Daten für SUMMEWENNS'!$J$5:$J$505,F$5)","v":0},{"$f":"SUMIFS('05 Daten für SUMMEWENNS'!$E$5:$E$505,'05 Daten für SUMMEWENNS'!$H$5:$H$505,$B50,'05 Daten für SUMMEWENNS'!$J$5:$J$505,G$5)","v":0},{"$f":"SUMIFS('05 Daten für SUMMEWENNS'!$E$5:$E$505,'05 Daten für SUMMEWENNS'!$H$5:$H$505,$B50,'05 Daten für SUMMEWENNS'!$J$5:$J$505,H$5)","v":0}]
[null,45,{"$f":"SUMIFS('05 Daten für SUMMEWENNS'!$E$5:$E$505,'05 Daten für SUMMEWENNS'!$H$5:$H$505,$B51,'05 Daten für SUMMEWENNS'!$J$5:$J$505,C$5)","v":0},{"$f":"SUMIFS('05 Daten für SUMMEWENNS'!$E$5:$E$505,'05 Daten für SUMMEWENNS'!$H$5:$H$505,$B51,'05 Daten für SUMMEWENNS'!$J$5:$J$505,D$5)","v":0},{"$f":"SUMIFS('05 Daten für SUMMEWENNS'!$E$5:$E$505,'05 Daten für SUMMEWENNS'!$H$5:$H$505,$B51,'05 Daten für SUMMEWENNS'!$J$5:$J$505,E$5)","v":0},{"$f":"SUMIFS('05 Daten für SUMMEWENNS'!$E$5:$E$505,'05 Daten für SUMMEWENNS'!$H$5:$H$505,$B51,'05 Daten für SUMMEWENNS'!$J$5:$J$505,F$5)","v":0},{"$f":"SUMIFS('05 Daten für SUMMEWENNS'!$E$5:$E$505,'05 Daten für SUMMEWENNS'!$H$5:$H$505,$B51,'05 Daten für SUMMEWENNS'!$J$5:$J$505,G$5)","v":0},{"$f":"SUMIFS('05 Daten für SUMMEWENNS'!$E$5:$E$505,'05 Daten für SUMMEWENNS'!$H$5:$H$505,$B51,'05 Daten für SUMMEWENNS'!$J$5:$J$505,H$5)","v":0}]
[null,46,{"$f":"SUMIFS('05 Daten für SUMMEWENNS'!$E$5:$E$505,'05 Daten für SUMMEWENNS'!$H$5:$H$505,$B52,'05 Daten für SUMMEWENNS'!$J$5:$J$505,C$5)","v":0},{"$f":"SUMIFS('05 Daten für SUMMEWENNS'!$E$5:$E$505,'05 Daten für SUMMEWENNS'!$H$5:$H$505,$B52,'05 Daten für SUMMEWENNS'!$J$5:$J$505,D$5)","v":0},{"$f":"SUMIFS('05 Daten für SUMMEWENNS'!$E$5:$E$505,'05 Daten für SUMMEWENNS'!$H$5:$H$505,$B52,'05 Daten für SUMMEWENNS'!$J$5:$J$505,E$5)","v":0},{"$f":"SUMIFS('05 Daten für SUMMEWENNS'!$E$5:$E$505,'05 Daten für SUMMEWENNS'!$H$5:$H$505,$B52,'05 Daten für SUMMEWENNS'!$J$5:$J$505,F$5)","v":0},{"$f":"SUMIFS('05 Daten für SUMMEWENNS'!$E$5:$E$505,'05 Daten für SUMMEWENNS'!$H$5:$H$505,$B52,'05 Daten für SUMMEWENNS'!$J$5:$J$505,G$5)","v":0},{"$f":"SUMIFS('05 Daten für SUMMEWENNS'!$E$5:$E$505,'05 Daten für SUMMEWENNS'!$H$5:$H$505,$B52,'05 Daten für SUMMEWENNS'!$J$5:$J$505,H$5)","v":0}]
[null,47,{"$f":"SUMIFS('05 Daten für SUMMEWENNS'!$E$5:$E$505,'05 Daten für SUMMEWENNS'!$H$5:$H$505,$B53,'05 Daten für SUMMEWENNS'!$J$5:$J$505,C$5)","v":0},{"$f":"SUMIFS('05 Daten für SUMMEWENNS'!$E$5:$E$505,'05 Daten für SUMMEWENNS'!$H$5:$H$505,$B53,'05 Daten für SUMMEWENNS'!$J$5:$J$505,D$5)","v":0},{"$f":"SUMIFS('05 Daten für SUMMEWENNS'!$E$5:$E$505,'05 Daten für SUMMEWENNS'!$H$5:$H$505,$B53,'05 Daten für SUMMEWENNS'!$J$5:$J$505,E$5)","v":0},{"$f":"SUMIFS('05 Daten für SUMMEWENNS'!$E$5:$E$505,'05 Daten für SUMMEWENNS'!$H$5:$H$505,$B53,'05 Daten für SUMMEWENNS'!$J$5:$J$505,F$5)","v":0},{"$f":"SUMIFS('05 Daten für SUMMEWENNS'!$E$5:$E$505,'05 Daten für SUMMEWENNS'!$H$5:$H$505,$B53,'05 Daten für SUMMEWENNS'!$J$5:$J$505,G$5)","v":0},{"$f":"SUMIFS('05 Daten für SUMMEWENNS'!$E$5:$E$505,'05 Daten für SUMMEWENNS'!$H$5:$H$505,$B53,'05 Daten für SUMMEWENNS'!$J$5:$J$505,H$5)","v":0}]
[null,48,{"$f":"SUMIFS('05 Daten für SUMMEWENNS'!$E$5:$E$505,'05 Daten für SUMMEWENNS'!$H$5:$H$505,$B54,'05 Daten für SUMMEWENNS'!$J$5:$J$505,C$5)","v":0},{"$f":"SUMIFS('05 Daten für SUMMEWENNS'!$E$5:$E$505,'05 Daten für SUMMEWENNS'!$H$5:$H$505,$B54,'05 Daten für SUMMEWENNS'!$J$5:$J$505,D$5)","v":0},{"$f":"SUMIFS('05 Daten für SUMMEWENNS'!$E$5:$E$505,'05 Daten für SUMMEWENNS'!$H$5:$H$505,$B54,'05 Daten für SUMMEWENNS'!$J$5:$J$505,E$5)","v":0},{"$f":"SUMIFS('05 Daten für SUMMEWENNS'!$E$5:$E$505,'05 Daten für SUMMEWENNS'!$H$5:$H$505,$B54,'05 Daten für SUMMEWENNS'!$J$5:$J$505,F$5)","v":0},{"$f":"SUMIFS('05 Daten für SUMMEWENNS'!$E$5:$E$505,'05 Daten für SUMMEWENNS'!$H$5:$H$505,$B54,'05 Daten für SUMMEWENNS'!$J$5:$J$505,G$5)","v":0},{"$f":"SUMIFS('05 Daten für SUMMEWENNS'!$E$5:$E$505,'05 Daten für SUMMEWENNS'!$H$5:$H$505,$B54,'05 Daten für SUMMEWENNS'!$J$5:$J$505,H$5)","v":0}]
[null,49,{"$f":"SUMIFS('05 Daten für SUMMEWENNS'!$E$5:$E$505,'05 Daten für SUMMEWENNS'!$H$5:$H$505,$B55,'05 Daten für SUMMEWENNS'!$J$5:$J$505,C$5)","v":0},{"$f":"SUMIFS('05 Daten für SUMMEWENNS'!$E$5:$E$505,'05 Daten für SUMMEWENNS'!$H$5:$H$505,$B55,'05 Daten für SUMMEWENNS'!$J$5:$J$505,D$5)","v":0},{"$f":"SUMIFS('05 Daten für SUMMEWENNS'!$E$5:$E$505,'05 Daten für SUMMEWENNS'!$H$5:$H$505,$B55,'05 Daten für SUMMEWENNS'!$J$5:$J$505,E$5)","v":0},{"$f":"SUMIFS('05 Daten für SUMMEWENNS'!$E$5:$E$505,'05 Daten für SUMMEWENNS'!$H$5:$H$505,$B55,'05 Daten für SUMMEWENNS'!$J$5:$J$505,F$5)","v":0},{"$f":"SUMIFS('05 Daten für SUMMEWENNS'!$E$5:$E$505,'05 Daten für SUMMEWENNS'!$H$5:$H$505,$B55,'05 Daten für SUMMEWENNS'!$J$5:$J$505,G$5)","v":0},{"$f":"SUMIFS('05 Daten für SUMMEWENNS'!$E$5:$E$505,'05 Daten für SUMMEWENNS'!$H$5:$H$505,$B55,'05 Daten für SUMMEWENNS'!$J$5:$J$505,H$5)","v":0}]
[null,50,{"$f":"SUMIFS('05 Daten für SUMMEWENNS'!$E$5:$E$505,'05 Daten für SUMMEWENNS'!$H$5:$H$505,$B56,'05 Daten für SUMMEWENNS'!$J$5:$J$505,C$5)","v":0},{"$f":"SUMIFS('05 Daten für SUMMEWENNS'!$E$5:$E$505,'05 Daten für SUMMEWENNS'!$H$5:$H$505,$B56,'05 Daten für SUMMEWENNS'!$J$5:$J$505,D$5)","v":0},{"$f":"SUMIFS('05 Daten für SUMMEWENNS'!$E$5:$E$505,'05 Daten für SUMMEWENNS'!$H$5:$H$505,$B56,'05 Daten für SUMMEWENNS'!$J$5:$J$505,E$5)","v":0},{"$f":"SUMIFS('05 Daten für SUMMEWENNS'!$E$5:$E$505,'05 Daten für SUMMEWENNS'!$H$5:$H$505,$B56,'05 Daten für SUMMEWENNS'!$J$5:$J$505,F$5)","v":0},{"$f":"SUMIFS('05 Daten für SUMMEWENNS'!$E$5:$E$505,'05 Daten für SUMMEWENNS'!$H$5:$H$505,$B56,'05 Daten für SUMMEWENNS'!$J$5:$J$505,G$5)","v":0},{"$f":"SUMIFS('05 Daten für SUMMEWENNS'!$E$5:$E$505,'05 Daten für SUMMEWENNS'!$H$5:$H$505,$B56,'05 Daten für SUMMEWENNS'!$J$5:$J$505,H$5)","v":0}]
[null,51,{"$f":"SUMIFS('05 Daten für SUMMEWENNS'!$E$5:$E$505,'05 Daten für SUMMEWENNS'!$H$5:$H$505,$B57,'05 Daten für SUMMEWENNS'!$J$5:$J$505,C$5)","v":0},{"$f":"SUMIFS('05 Daten für SUMMEWENNS'!$E$5:$E$505,'05 Daten für SUMMEWENNS'!$H$5:$H$505,$B57,'05 Daten für SUMMEWENNS'!$J$5:$J$505,D$5)","v":0},{"$f":"SUMIFS('05 Daten für SUMMEWENNS'!$E$5:$E$505,'05 Daten für SUMMEWENNS'!$H$5:$H$505,$B57,'05 Daten für SUMMEWENNS'!$J$5:$J$505,E$5)","v":0},{"$f":"SUMIFS('05 Daten für SUMMEWENNS'!$E$5:$E$505,'05 Daten für SUMMEWENNS'!$H$5:$H$505,$B57,'05 Daten für SUMMEWENNS'!$J$5:$J$505,F$5)","v":0},{"$f":"SUMIFS('05 Daten für SUMMEWENNS'!$E$5:$E$505,'05 Daten für SUMMEWENNS'!$H$5:$H$505,$B57,'05 Daten für SUMMEWENNS'!$J$5:$J$505,G$5)","v":0},{"$f":"SUMIFS('05 Daten für SUMMEWENNS'!$E$5:$E$505,'05 Daten für SUMMEWENNS'!$H$5:$H$505,$B57,'05 Daten für SUMMEWENNS'!$J$5:$J$505,H$5)","v":0}]
[null,52,{"$f":"SUMIFS('05 Daten für SUMMEWENNS'!$E$5:$E$505,'05 Daten für SUMMEWENNS'!$H$5:$H$505,$B58,'05 Daten für SUMMEWENNS'!$J$5:$J$505,C$5)","v":0},{"$f":"SUMIFS('05 Daten für SUMMEWENNS'!$E$5:$E$505,'05 Daten für SUMMEWENNS'!$H$5:$H$505,$B58,'05 Daten für SUMMEWENNS'!$J$5:$J$505,D$5)","v":0},{"$f":"SUMIFS('05 Daten für SUMMEWENNS'!$E$5:$E$505,'05 Daten für SUMMEWENNS'!$H$5:$H$505,$B58,'05 Daten für SUMMEWENNS'!$J$5:$J$505,E$5)","v":0},{"$f":"SUMIFS('05 Daten für SUMMEWENNS'!$E$5:$E$505,'05 Daten für SUMMEWENNS'!$H$5:$H$505,$B58,'05 Daten für SUMMEWENNS'!$J$5:$J$505,F$5)","v":0},{"$f":"SUMIFS('05 Daten für SUMMEWENNS'!$E$5:$E$505,'05 Daten für SUMMEWENNS'!$H$5:$H$505,$B58,'05 Daten für SUMMEWENNS'!$J$5:$J$505,G$5)","v":0},{"$f":"SUMIFS('05 Daten für SUMMEWENNS'!$E$5:$E$505,'05 Daten für SUMMEWENNS'!$H$5:$H$505,$B58,'05 Daten für SUMMEWENNS'!$J$5:$J$505,H$5)","v":0}]
[null,53,{"$f":"SUMIFS('05 Daten für SUMMEWENNS'!$E$5:$E$505,'05 Daten für SUMMEWENNS'!$H$5:$H$505,$B59,'05 Daten für SUMMEWENNS'!$J$5:$J$505,C$5)","v":0},{"$f":"SUMIFS('05 Daten für SUMMEWENNS'!$E$5:$E$505,'05 Daten für SUMMEWENNS'!$H$5:$H$505,$B59,'05 Daten für SUMMEWENNS'!$J$5:$J$505,D$5)","v":0},{"$f":"SUMIFS('05 Daten für SUMMEWENNS'!$E$5:$E$505,'05 Daten für SUMMEWENNS'!$H$5:$H$505,$B59,'05 Daten für SUMMEWENNS'!$J$5:$J$505,E$5)","v":0},{"$f":"SUMIFS('05 Daten für SUMMEWENNS'!$E$5:$E$505,'05 Daten für SUMMEWENNS'!$H$5:$H$505,$B59,'05 Daten für SUMMEWENNS'!$J$5:$J$505,F$5)","v":0},{"$f":"SUMIFS('05 Daten für SUMMEWENNS'!$E$5:$E$505,'05 Daten für SUMMEWENNS'!$H$5:$H$505,$B59,'05 Daten für SUMMEWENNS'!$J$5:$J$505,G$5)","v":0},{"$f":"SUMIFS('05 Daten für SUMMEWENNS'!$E$5:$E$505,'05 Daten für SUMMEWENNS'!$H$5:$H$505,$B59,'05 Daten für SUMMEWENNS'!$J$5:$J$505,H$5)","v":0}]
[null,54,{"$f":"SUMIFS('05 Daten für SUMMEWENNS'!$E$5:$E$505,'05 Daten für SUMMEWENNS'!$H$5:$H$505,$B60,'05 Daten für SUMMEWENNS'!$J$5:$J$505,C$5)","v":0},{"$f":"SUMIFS('05 Daten für SUMMEWENNS'!$E$5:$E$505,'05 Daten für SUMMEWENNS'!$H$5:$H$505,$B60,'05 Daten für SUMMEWENNS'!$J$5:$J$505,D$5)","v":0},{"$f":"SUMIFS('05 Daten für SUMMEWENNS'!$E$5:$E$505,'05 Daten für SUMMEWENNS'!$H$5:$H$505,$B60,'05 Daten für SUMMEWENNS'!$J$5:$J$505,E$5)","v":0},{"$f":"SUMIFS('05 Daten für SUMMEWENNS'!$E$5:$E$505,'05 Daten für SUMMEWENNS'!$H$5:$H$505,$B60,'05 Daten für SUMMEWENNS'!$J$5:$J$505,F$5)","v":0},{"$f":"SUMIFS('05 Daten für SUMMEWENNS'!$E$5:$E$505,'05 Daten für SUMMEWENNS'!$H$5:$H$505,$B60,'05 Daten für SUMMEWENNS'!$J$5:$J$505,G$5)","v":0},{"$f":"SUMIFS('05 Daten für SUMMEWENNS'!$E$5:$E$505,'05 Daten für SUMMEWENNS'!$H$5:$H$505,$B60,'05 Daten für SUMMEWENNS'!$J$5:$J$505,H$5)","v":0}]
[null,55,{"$f":"SUMIFS('05 Daten für SUMMEWENNS'!$E$5:$E$505,'05 Daten für SUMMEWENNS'!$H$5:$H$505,$B61,'05 Daten für SUMMEWENNS'!$J$5:$J$505,C$5)","v":9816.2640000000029},{"$f":"SUMIFS('05 Daten für SUMMEWENNS'!$E$5:$E$505,'05 Daten für SUMMEWENNS'!$H$5:$H$505,$B61,'05 Daten für SUMMEWENNS'!$J$5:$J$505,D$5)","v":3728.0880000000006},{"$f":"SUMIFS('05 Daten für SUMMEWENNS'!$E$5:$E$505,'05 Daten für SUMMEWENNS'!$H$5:$H$505,$B61,'05 Daten für SUMMEWENNS'!$J$5:$J$505,E$5)","v":0},{"$f":"SUMIFS('05 Daten für SUMMEWENNS'!$E$5:$E$505,'05 Daten für SUMMEWENNS'!$H$5:$H$505,$B61,'05 Daten für SUMMEWENNS'!$J$5:$J$505,F$5)","v":22710.377999999997},{"$f":"SUMIFS('05 Daten für SUMMEWENNS'!$E$5:$E$505,'05 Daten für SUMMEWENNS'!$H$5:$H$505,$B61,'05 Daten für SUMMEWENNS'!$J$5:$J$505,G$5)","v":10377.707999999999},{"$f":"SUMIFS('05 Daten für SUMMEWENNS'!$E$5:$E$505,'05 Daten für SUMMEWENNS'!$H$5:$H$505,$B61,'05 Daten für SUMMEWENNS'!$J$5:$J$505,H$5)","v":0}]
[null,56,{"$f":"SUMIFS('05 Daten für SUMMEWENNS'!$E$5:$E$505,'05 Daten für SUMMEWENNS'!$H$5:$H$505,$B62,'05 Daten für SUMMEWENNS'!$J$5:$J$505,C$5)","v":0},{"$f":"SUMIFS('05 Daten für SUMMEWENNS'!$E$5:$E$505,'05 Daten für SUMMEWENNS'!$H$5:$H$505,$B62,'05 Daten für SUMMEWENNS'!$J$5:$J$505,D$5)","v":0},{"$f":"SUMIFS('05 Daten für SUMMEWENNS'!$E$5:$E$505,'05 Daten für SUMMEWENNS'!$H$5:$H$505,$B62,'05 Daten für SUMMEWENNS'!$J$5:$J$505,E$5)","v":0},{"$f":"SUMIFS('05 Daten für SUMMEWENNS'!$E$5:$E$505,'05 Daten für SUMMEWENNS'!$H$5:$H$505,$B62,'05 Daten für SUMMEWENNS'!$J$5:$J$505,F$5)","v":0},{"$f":"SUMIFS('05 Daten für SUMMEWENNS'!$E$5:$E$505,'05 Daten für SUMMEWENNS'!$H$5:$H$505,$B62,'05 Daten für SUMMEWENNS'!$J$5:$J$505,G$5)","v":0},{"$f":"SUMIFS('05 Daten für SUMMEWENNS'!$E$5:$E$505,'05 Daten für SUMMEWENNS'!$H$5:$H$505,$B62,'05 Daten für SUMMEWENNS'!$J$5:$J$505,H$5)","v":0}]
[null,57,{"$f":"SUMIFS('05 Daten für SUMMEWENNS'!$E$5:$E$505,'05 Daten für SUMMEWENNS'!$H$5:$H$505,$B63,'05 Daten für SUMMEWENNS'!$J$5:$J$505,C$5)","v":0},{"$f":"SUMIFS('05 Daten für SUMMEWENNS'!$E$5:$E$505,'05 Daten für SUMMEWENNS'!$H$5:$H$505,$B63,'05 Daten für SUMMEWENNS'!$J$5:$J$505,D$5)","v":0},{"$f":"SUMIFS('05 Daten für SUMMEWENNS'!$E$5:$E$505,'05 Daten für SUMMEWENNS'!$H$5:$H$505,$B63,'05 Daten für SUMMEWENNS'!$J$5:$J$505,E$5)","v":0},{"$f":"SUMIFS('05 Daten für SUMMEWENNS'!$E$5:$E$505,'05 Daten für SUMMEWENNS'!$H$5:$H$505,$B63,'05 Daten für SUMMEWENNS'!$J$5:$J$505,F$5)","v":0},{"$f":"SUMIFS('05 Daten für SUMMEWENNS'!$E$5:$E$505,'05 Daten für SUMMEWENNS'!$H$5:$H$505,$B63,'05 Daten für SUMMEWENNS'!$J$5:$J$505,G$5)","v":0},{"$f":"SUMIFS('05 Daten für SUMMEWENNS'!$E$5:$E$505,'05 Daten für SUMMEWENNS'!$H$5:$H$505,$B63,'05 Daten für SUMMEWENNS'!$J$5:$J$505,H$5)","v":0}]
[null,58,{"$f":"SUMIFS('05 Daten für SUMMEWENNS'!$E$5:$E$505,'05 Daten für SUMMEWENNS'!$H$5:$H$505,$B64,'05 Daten für SUMMEWENNS'!$J$5:$J$505,C$5)","v":0},{"$f":"SUMIFS('05 Daten für SUMMEWENNS'!$E$5:$E$505,'05 Daten für SUMMEWENNS'!$H$5:$H$505,$B64,'05 Daten für SUMMEWENNS'!$J$5:$J$505,D$5)","v":0},{"$f":"SUMIFS('05 Daten für SUMMEWENNS'!$E$5:$E$505,'05 Daten für SUMMEWENNS'!$H$5:$H$505,$B64,'05 Daten für SUMMEWENNS'!$J$5:$J$505,E$5)","v":0},{"$f":"SUMIFS('05 Daten für SUMMEWENNS'!$E$5:$E$505,'05 Daten für SUMMEWENNS'!$H$5:$H$505,$B64,'05 Daten für SUMMEWENNS'!$J$5:$J$505,F$5)","v":0},{"$f":"SUMIFS('05 Daten für SUMMEWENNS'!$E$5:$E$505,'05 Daten für SUMMEWENNS'!$H$5:$H$505,$B64,'05 Daten für SUMMEWENNS'!$J$5:$J$505,G$5)","v":0},{"$f":"SUMIFS('05 Daten für SUMMEWENNS'!$E$5:$E$505,'05 Daten für SUMMEWENNS'!$H$5:$H$505,$B64,'05 Daten für SUMMEWENNS'!$J$5:$J$505,H$5)","v":0}]
[null,59,{"$f":"SUMIFS('05 Daten für SUMMEWENNS'!$E$5:$E$505,'05 Daten für SUMMEWENNS'!$H$5:$H$505,$B65,'05 Daten für SUMMEWENNS'!$J$5:$J$505,C$5)","v":977.84399999999994},{"$f":"SUMIFS('05 Daten für SUMMEWENNS'!$E$5:$E$505,'05 Daten für SUMMEWENNS'!$H$5:$H$505,$B65,'05 Daten für SUMMEWENNS'!$J$5:$J$505,D$5)","v":1132.3460000000002},{"$f":"SUMIFS('05 Daten für SUMMEWENNS'!$E$5:$E$505,'05 Daten für SUMMEWENNS'!$H$5:$H$505,$B65,'05 Daten für SUMMEWENNS'!$J$5:$J$505,E$5)","v":0},{"$f":"SUMIFS('05 Daten für SUMMEWENNS'!$E$5:$E$505,'05 Daten für SUMMEWENNS'!$H$5:$H$505,$B65,'05 Daten für SUMMEWENNS'!$J$5:$J$505,F$5)","v":5004.01},{"$f":"SUMIFS('05 Daten für SUMMEWENNS'!$E$5:$E$505,'05 Daten für SUMMEWENNS'!$H$5:$H$505,$B65,'05 Daten für SUMMEWENNS'!$J$5:$J$505,G$5)","v":197.10200000000003},{"$f":"SUMIFS('05 Daten für SUMMEWENNS'!$E$5:$E$505,'05 Daten für SUMMEWENNS'!$H$5:$H$505,$B65,'05 Daten für SUMMEWENNS'!$J$5:$J$505,H$5)","v":0}]
[null,60,{"$f":"SUMIFS('05 Daten für SUMMEWENNS'!$E$5:$E$505,'05 Daten für SUMMEWENNS'!$H$5:$H$505,$B66,'05 Daten für SUMMEWENNS'!$J$5:$J$505,C$5)","v":0},{"$f":"SUMIFS('05 Daten für SUMMEWENNS'!$E$5:$E$505,'05 Daten für SUMMEWENNS'!$H$5:$H$505,$B66,'05 Daten für SUMMEWENNS'!$J$5:$J$505,D$5)","v":0},{"$f":"SUMIFS('05 Daten für SUMMEWENNS'!$E$5:$E$505,'05 Daten für SUMMEWENNS'!$H$5:$H$505,$B66,'05 Daten für SUMMEWENNS'!$J$5:$J$505,E$5)","v":0},{"$f":"SUMIFS('05 Daten für SUMMEWENNS'!$E$5:$E$505,'05 Daten für SUMMEWENNS'!$H$5:$H$505,$B66,'05 Daten für SUMMEWENNS'!$J$5:$J$505,F$5)","v":0},{"$f":"SUMIFS('05 Daten für SUMMEWENNS'!$E$5:$E$505,'05 Daten für SUMMEWENNS'!$H$5:$H$505,$B66,'05 Daten für SUMMEWENNS'!$J$5:$J$505,G$5)","v":0},{"$f":"SUMIFS('05 Daten für SUMMEWENNS'!$E$5:$E$505,'05 Daten für SUMMEWENNS'!$H$5:$H$505,$B66,'05 Daten für SUMMEWENNS'!$J$5:$J$505,H$5)","v":0}]
[null,61,{"$f":"SUMIFS('05 Daten für SUMMEWENNS'!$E$5:$E$505,'05 Daten für SUMMEWENNS'!$H$5:$H$505,$B67,'05 Daten für SUMMEWENNS'!$J$5:$J$505,C$5)","v":0},{"$f":"SUMIFS('05 Daten für SUMMEWENNS'!$E$5:$E$505,'05 Daten für SUMMEWENNS'!$H$5:$H$505,$B67,'05 Daten für SUMMEWENNS'!$J$5:$J$505,D$5)","v":0},{"$f":"SUMIFS('05 Daten für SUMMEWENNS'!$E$5:$E$505,'05 Daten für SUMMEWENNS'!$H$5:$H$505,$B67,'05 Daten für SUMMEWENNS'!$J$5:$J$505,E$5)","v":0},{"$f":"SUMIFS('05 Daten für SUMMEWENNS'!$E$5:$E$505,'05 Daten für SUMMEWENNS'!$H$5:$H$505,$B67,'05 Daten für SUMMEWENNS'!$J$5:$J$505,F$5)","v":0},{"$f":"SUMIFS('05 Daten für SUMMEWENNS'!$E$5:$E$505,'05 Daten für SUMMEWENNS'!$H$5:$H$505,$B67,'05 Daten für SUMMEWENNS'!$J$5:$J$505,G$5)","v":0},{"$f":"SUMIFS('05 Daten für SUMMEWENNS'!$E$5:$E$505,'05 Daten für SUMMEWENNS'!$H$5:$H$505,$B67,'05 Daten für SUMMEWENNS'!$J$5:$J$505,H$5)","v":0}]
[null,62,{"$f":"SUMIFS('05 Daten für SUMMEWENNS'!$E$5:$E$505,'05 Daten für SUMMEWENNS'!$H$5:$H$505,$B68,'05 Daten für SUMMEWENNS'!$J$5:$J$505,C$5)","v":0},{"$f":"SUMIFS('05 Daten für SUMMEWENNS'!$E$5:$E$505,'05 Daten für SUMMEWENNS'!$H$5:$H$505,$B68,'05 Daten für SUMMEWENNS'!$J$5:$J$505,D$5)","v":0},{"$f":"SUMIFS('05 Daten für SUMMEWENNS'!$E$5:$E$505,'05 Daten für SUMMEWENNS'!$H$5:$H$505,$B68,'05 Daten für SUMMEWENNS'!$J$5:$J$505,E$5)","v":0},{"$f":"SUMIFS('05 Daten für SUMMEWENNS'!$E$5:$E$505,'05 Daten für SUMMEWENNS'!$H$5:$H$505,$B68,'05 Daten für SUMMEWENNS'!$J$5:$J$505,F$5)","v":0},{"$f":"SUMIFS('05 Daten für SUMMEWENNS'!$E$5:$E$505,'05 Daten für SUMMEWENNS'!$H$5:$H$505,$B68,'05 Daten für SUMMEWENNS'!$J$5:$J$505,G$5)","v":0},{"$f":"SUMIFS('05 Daten für SUMMEWENNS'!$E$5:$E$505,'05 Daten für SUMMEWENNS'!$H$5:$H$505,$B68,'05 Daten für SUMMEWENNS'!$J$5:$J$505,H$5)","v":0}]
[null,63,{"$f":"SUMIFS('05 Daten für SUMMEWENNS'!$E$5:$E$505,'05 Daten für SUMMEWENNS'!$H$5:$H$505,$B69,'05 Daten für SUMMEWENNS'!$J$5:$J$505,C$5)","v":482.89399999999995},{"$f":"SUMIFS('05 Daten für SUMMEWENNS'!$E$5:$E$505,'05 Daten für SUMMEWENNS'!$H$5:$H$505,$B69,'05 Daten für SUMMEWENNS'!$J$5:$J$505,D$5)","v":239.04199999999994},{"$f":"SUMIFS('05 Daten für SUMMEWENNS'!$E$5:$E$505,'05 Daten für SUMMEWENNS'!$H$5:$H$505,$B69,'05 Daten für SUMMEWENNS'!$J$5:$J$505,E$5)","v":0},{"$f":"SUMIFS('05 Daten für SUMMEWENNS'!$E$5:$E$505,'05 Daten für SUMMEWENNS'!$H$5:$H$505,$B69,'05 Daten für SUMMEWENNS'!$J$5:$J$505,F$5)","v":573.94000000000005},{"$f":"SUMIFS('05 Daten für SUMMEWENNS'!$E$5:$E$505,'05 Daten für SUMMEWENNS'!$H$5:$H$505,$B69,'05 Daten für SUMMEWENNS'!$J$5:$J$505,G$5)","v":282.07},{"$f":"SUMIFS('05 Daten für SUMMEWENNS'!$E$5:$E$505,'05 Daten für SUMMEWENNS'!$H$5:$H$505,$B69,'05 Daten für SUMMEWENNS'!$J$5:$J$505,H$5)","v":0}]
[null,64,{"$f":"SUMIFS('05 Daten für SUMMEWENNS'!$E$5:$E$505,'05 Daten für SUMMEWENNS'!$H$5:$H$505,$B70,'05 Daten für SUMMEWENNS'!$J$5:$J$505,C$5)","v":0},{"$f":"SUMIFS('05 Daten für SUMMEWENNS'!$E$5:$E$505,'05 Daten für SUMMEWENNS'!$H$5:$H$505,$B70,'05 Daten für SUMMEWENNS'!$J$5:$J$505,D$5)","v":0},{"$f":"SUMIFS('05 Daten für SUMMEWENNS'!$E$5:$E$505,'05 Daten für SUMMEWENNS'!$H$5:$H$505,$B70,'05 Daten für SUMMEWENNS'!$J$5:$J$505,E$5)","v":0},{"$f":"SUMIFS('05 Daten für SUMMEWENNS'!$E$5:$E$505,'05 Daten für SUMMEWENNS'!$H$5:$H$505,$B70,'05 Daten für SUMMEWENNS'!$J$5:$J$505,F$5)","v":0},{"$f":"SUMIFS('05 Daten für SUMMEWENNS'!$E$5:$E$505,'05 Daten für SUMMEWENNS'!$H$5:$H$505,$B70,'05 Daten für SUMMEWENNS'!$J$5:$J$505,G$5)","v":0},{"$f":"SUMIFS('05 Daten für SUMMEWENNS'!$E$5:$E$505,'05 Daten für SUMMEWENNS'!$H$5:$H$505,$B70,'05 Daten für SUMMEWENNS'!$J$5:$J$505,H$5)","v":0}]
[null,65,{"$f":"SUMIFS('05 Daten für SUMMEWENNS'!$E$5:$E$505,'05 Daten für SUMMEWENNS'!$H$5:$H$505,$B71,'05 Daten für SUMMEWENNS'!$J$5:$J$505,C$5)","v":0},{"$f":"SUMIFS('05 Daten für SUMMEWENNS'!$E$5:$E$505,'05 Daten für SUMMEWENNS'!$H$5:$H$505,$B71,'05 Daten für SUMMEWENNS'!$J$5:$J$505,D$5)","v":0},{"$f":"SUMIFS('05 Daten für SUMMEWENNS'!$E$5:$E$505,'05 Daten für SUMMEWENNS'!$H$5:$H$505,$B71,'05 Daten für SUMMEWENNS'!$J$5:$J$505,E$5)","v":0},{"$f":"SUMIFS('05 Daten für SUMMEWENNS'!$E$5:$E$505,'05 Daten für SUMMEWENNS'!$H$5:$H$505,$B71,'05 Daten für SUMMEWENNS'!$J$5:$J$505,F$5)","v":1247.28},{"$f":"SUMIFS('05 Daten für SUMMEWENNS'!$E$5:$E$505,'05 Daten für SUMMEWENNS'!$H$5:$H$505,$B71,'05 Daten für SUMMEWENNS'!$J$5:$J$505,G$5)","v":0},{"$f":"SUMIFS('05 Daten für SUMMEWENNS'!$E$5:$E$505,'05 Daten für SUMMEWENNS'!$H$5:$H$505,$B71,'05 Daten für SUMMEWENNS'!$J$5:$J$505,H$5)","v":0}]
[null,66,{"$f":"SUMIFS('05 Daten für SUMMEWENNS'!$E$5:$E$505,'05 Daten für SUMMEWENNS'!$H$5:$H$505,$B72,'05 Daten für SUMMEWENNS'!$J$5:$J$505,C$5)","v":0},{"$f":"SUMIFS('05 Daten für SUMMEWENNS'!$E$5:$E$505,'05 Daten für SUMMEWENNS'!$H$5:$H$505,$B72,'05 Daten für SUMMEWENNS'!$J$5:$J$505,D$5)","v":0},{"$f":"SUMIFS('05 Daten für SUMMEWENNS'!$E$5:$E$505,'05 Daten für SUMMEWENNS'!$H$5:$H$505,$B72,'05 Daten für SUMMEWENNS'!$J$5:$J$505,E$5)","v":0},{"$f":"SUMIFS('05 Daten für SUMMEWENNS'!$E$5:$E$505,'05 Daten für SUMMEWENNS'!$H$5:$H$505,$B72,'05 Daten für SUMMEWENNS'!$J$5:$J$505,F$5)","v":0},{"$f":"SUMIFS('05 Daten für SUMMEWENNS'!$E$5:$E$505,'05 Daten für SUMMEWENNS'!$H$5:$H$505,$B72,'05 Daten für SUMMEWENNS'!$J$5:$J$505,G$5)","v":0},{"$f":"SUMIFS('05 Daten für SUMMEWENNS'!$E$5:$E$505,'05 Daten für SUMMEWENNS'!$H$5:$H$505,$B72,'05 Daten für SUMMEWENNS'!$J$5:$J$505,H$5)","v":0}]
[null,67,{"$f":"SUMIFS('05 Daten für SUMMEWENNS'!$E$5:$E$505,'05 Daten für SUMMEWENNS'!$H$5:$H$505,$B73,'05 Daten für SUMMEWENNS'!$J$5:$J$505,C$5)","v":1291.68},{"$f":"SUMIFS('05 Daten für SUMMEWENNS'!$E$5:$E$505,'05 Daten für SUMMEWENNS'!$H$5:$H$505,$B73,'05 Daten für SUMMEWENNS'!$J$5:$J$505,D$5)","v":548.35199999999998},{"$f":"SUMIFS('05 Daten für SUMMEWENNS'!$E$5:$E$505,'05 Daten für SUMMEWENNS'!$H$5:$H$505,$B73,'05 Daten für SUMMEWENNS'!$J$5:$J$505,E$5)","v":0},{"$f":"SUMIFS('05 Daten für SUMMEWENNS'!$E$5:$E$505,'05 Daten für SUMMEWENNS'!$H$5:$H$505,$B73,'05 Daten für SUMMEWENNS'!$J$5:$J$505,F$5)","v":0},{"$f":"SUMIFS('05 Daten für SUMMEWENNS'!$E$5:$E$505,'05 Daten für SUMMEWENNS'!$H$5:$H$505,$B73,'05 Daten für SUMMEWENNS'!$J$5:$J$505,G$5)","v":0},{"$f":"SUMIFS('05 Daten für SUMMEWENNS'!$E$5:$E$505,'05 Daten für SUMMEWENNS'!$H$5:$H$505,$B73,'05 Daten für SUMMEWENNS'!$J$5:$J$505,H$5)","v":0}]
[null,68,{"$f":"SUMIFS('05 Daten für SUMMEWENNS'!$E$5:$E$505,'05 Daten für SUMMEWENNS'!$H$5:$H$505,$B74,'05 Daten für SUMMEWENNS'!$J$5:$J$505,C$5)","v":0},{"$f":"SUMIFS('05 Daten für SUMMEWENNS'!$E$5:$E$505,'05 Daten für SUMMEWENNS'!$H$5:$H$505,$B74,'05 Daten für SUMMEWENNS'!$J$5:$J$505,D$5)","v":0},{"$f":"SUMIFS('05 Daten für SUMMEWENNS'!$E$5:$E$505,'05 Daten für SUMMEWENNS'!$H$5:$H$505,$B74,'05 Daten für SUMMEWENNS'!$J$5:$J$505,E$5)","v":0},{"$f":"SUMIFS('05 Daten für SUMMEWENNS'!$E$5:$E$505,'05 Daten für SUMMEWENNS'!$H$5:$H$505,$B74,'05 Daten für SUMMEWENNS'!$J$5:$J$505,F$5)","v":0},{"$f":"SUMIFS('05 Daten für SUMMEWENNS'!$E$5:$E$505,'05 Daten für SUMMEWENNS'!$H$5:$H$505,$B74,'05 Daten für SUMMEWENNS'!$J$5:$J$505,G$5)","v":0},{"$f":"SUMIFS('05 Daten für SUMMEWENNS'!$E$5:$E$505,'05 Daten für SUMMEWENNS'!$H$5:$H$505,$B74,'05 Daten für SUMMEWENNS'!$J$5:$J$505,H$5)","v":0}]
[null,69,{"$f":"SUMIFS('05 Daten für SUMMEWENNS'!$E$5:$E$505,'05 Daten für SUMMEWENNS'!$H$5:$H$505,$B75,'05 Daten für SUMMEWENNS'!$J$5:$J$505,C$5)","v":0},{"$f":"SUMIFS('05 Daten für SUMMEWENNS'!$E$5:$E$505,'05 Daten für SUMMEWENNS'!$H$5:$H$505,$B75,'05 Daten für SUMMEWENNS'!$J$5:$J$505,D$5)","v":0},{"$f":"SUMIFS('05 Daten für SUMMEWENNS'!$E$5:$E$505,'05 Daten für SUMMEWENNS'!$H$5:$H$505,$B75,'05 Daten für SUMMEWENNS'!$J$5:$J$505,E$5)","v":0},{"$f":"SUMIFS('05 Daten für SUMMEWENNS'!$E$5:$E$505,'05 Daten für SUMMEWENNS'!$H$5:$H$505,$B75,'05 Daten für SUMMEWENNS'!$J$5:$J$505,F$5)","v":0},{"$f":"SUMIFS('05 Daten für SUMMEWENNS'!$E$5:$E$505,'05 Daten für SUMMEWENNS'!$H$5:$H$505,$B75,'05 Daten für SUMMEWENNS'!$J$5:$J$505,G$5)","v":0},{"$f":"SUMIFS('05 Daten für SUMMEWENNS'!$E$5:$E$505,'05 Daten für SUMMEWENNS'!$H$5:$H$505,$B75,'05 Daten für SUMMEWENNS'!$J$5:$J$505,H$5)","v":0}]
[null,70,{"$f":"SUMIFS('05 Daten für SUMMEWENNS'!$E$5:$E$505,'05 Daten für SUMMEWENNS'!$H$5:$H$505,$B76,'05 Daten für SUMMEWENNS'!$J$5:$J$505,C$5)","v":0},{"$f":"SUMIFS('05 Daten für SUMMEWENNS'!$E$5:$E$505,'05 Daten für SUMMEWENNS'!$H$5:$H$505,$B76,'05 Daten für SUMMEWENNS'!$J$5:$J$505,D$5)","v":0},{"$f":"SUMIFS('05 Daten für SUMMEWENNS'!$E$5:$E$505,'05 Daten für SUMMEWENNS'!$H$5:$H$505,$B76,'05 Daten für SUMMEWENNS'!$J$5:$J$505,E$5)","v":0},{"$f":"SUMIFS('05 Daten für SUMMEWENNS'!$E$5:$E$505,'05 Daten für SUMMEWENNS'!$H$5:$H$505,$B76,'05 Daten für SUMMEWENNS'!$J$5:$J$505,F$5)","v":0},{"$f":"SUMIFS('05 Daten für SUMMEWENNS'!$E$5:$E$505,'05 Daten für SUMMEWENNS'!$H$5:$H$505,$B76,'05 Daten für SUMMEWENNS'!$J$5:$J$505,G$5)","v":0},{"$f":"SUMIFS('05 Daten für SUMMEWENNS'!$E$5:$E$505,'05 Daten für SUMMEWENNS'!$H$5:$H$505,$B76,'05 Daten für SUMMEWENNS'!$J$5:$J$505,H$5)","v":0}]
[null,71,{"$f":"SUMIFS('05 Daten für SUMMEWENNS'!$E$5:$E$505,'05 Daten für SUMMEWENNS'!$H$5:$H$505,$B77,'05 Daten für SUMMEWENNS'!$J$5:$J$505,C$5)","v":0},{"$f":"SUMIFS('05 Daten für SUMMEWENNS'!$E$5:$E$505,'05 Daten für SUMMEWENNS'!$H$5:$H$505,$B77,'05 Daten für SUMMEWENNS'!$J$5:$J$505,D$5)","v":0},{"$f":"SUMIFS('05 Daten für SUMMEWENNS'!$E$5:$E$505,'05 Daten für SUMMEWENNS'!$H$5:$H$505,$B77,'05 Daten für SUMMEWENNS'!$J$5:$J$505,E$5)","v":0},{"$f":"SUMIFS('05 Daten für SUMMEWENNS'!$E$5:$E$505,'05 Daten für SUMMEWENNS'!$H$5:$H$505,$B77,'05 Daten für SUMMEWENNS'!$J$5:$J$505,F$5)","v":0},{"$f":"SUMIFS('05 Daten für SUMMEWENNS'!$E$5:$E$505,'05 Daten für SUMMEWENNS'!$H$5:$H$505,$B77,'05 Daten für SUMMEWENNS'!$J$5:$J$505,G$5)","v":0},{"$f":"SUMIFS('05 Daten für SUMMEWENNS'!$E$5:$E$505,'05 Daten für SUMMEWENNS'!$H$5:$H$505,$B77,'05 Daten für SUMMEWENNS'!$J$5:$J$505,H$5)","v":0}]
[null,72,{"$f":"SUMIFS('05 Daten für SUMMEWENNS'!$E$5:$E$505,'05 Daten für SUMMEWENNS'!$H$5:$H$505,$B78,'05 Daten für SUMMEWENNS'!$J$5:$J$505,C$5)","v":0},{"$f":"SUMIFS('05 Daten für SUMMEWENNS'!$E$5:$E$505,'05 Daten für SUMMEWENNS'!$H$5:$H$505,$B78,'05 Daten für SUMMEWENNS'!$J$5:$J$505,D$5)","v":0},{"$f":"SUMIFS('05 Daten für SUMMEWENNS'!$E$5:$E$505,'05 Daten für SUMMEWENNS'!$H$5:$H$505,$B78,'05 Daten für SUMMEWENNS'!$J$5:$J$505,E$5)","v":0},{"$f":"SUMIFS('05 Daten für SUMMEWENNS'!$E$5:$E$505,'05 Daten für SUMMEWENNS'!$H$5:$H$505,$B78,'05 Daten für SUMMEWENNS'!$J$5:$J$505,F$5)","v":0},{"$f":"SUMIFS('05 Daten für SUMMEWENNS'!$E$5:$E$505,'05 Daten für SUMMEWENNS'!$H$5:$H$505,$B78,'05 Daten für SUMMEWENNS'!$J$5:$J$505,G$5)","v":0},{"$f":"SUMIFS('05 Daten für SUMMEWENNS'!$E$5:$E$505,'05 Daten für SUMMEWENNS'!$H$5:$H$505,$B78,'05 Daten für SUMMEWENNS'!$J$5:$J$505,H$5)","v":0}]
[null,73,{"$f":"SUMIFS('05 Daten für SUMMEWENNS'!$E$5:$E$505,'05 Daten für SUMMEWENNS'!$H$5:$H$505,$B79,'05 Daten für SUMMEWENNS'!$J$5:$J$505,C$5)","v":407.55},{"$f":"SUMIFS('05 Daten für SUMMEWENNS'!$E$5:$E$505,'05 Daten für SUMMEWENNS'!$H$5:$H$505,$B79,'05 Daten für SUMMEWENNS'!$J$5:$J$505,D$5)","v":339.14400000000006},{"$f":"SUMIFS('05 Daten für SUMMEWENNS'!$E$5:$E$505,'05 Daten für SUMMEWENNS'!$H$5:$H$505,$B79,'05 Daten für SUMMEWENNS'!$J$5:$J$505,E$5)","v":0},{"$f":"SUMIFS('05 Daten für SUMMEWENNS'!$E$5:$E$505,'05 Daten für SUMMEWENNS'!$H$5:$H$505,$B79,'05 Daten für SUMMEWENNS'!$J$5:$J$505,F$5)","v":789.74800000000005},{"$f":"SUMIFS('05 Daten für SUMMEWENNS'!$E$5:$E$505,'05 Daten für SUMMEWENNS'!$H$5:$H$505,$B79,'05 Daten für SUMMEWENNS'!$J$5:$J$505,G$5)","v":51.444000000000003},{"$f":"SUMIFS('05 Daten für SUMMEWENNS'!$E$5:$E$505,'05 Daten für SUMMEWENNS'!$H$5:$H$505,$B79,'05 Daten für SUMMEWENNS'!$J$5:$J$505,H$5)","v":0}]
[null,74,{"$f":"SUMIFS('05 Daten für SUMMEWENNS'!$E$5:$E$505,'05 Daten für SUMMEWENNS'!$H$5:$H$505,$B80,'05 Daten für SUMMEWENNS'!$J$5:$J$505,C$5)","v":0},{"$f":"SUMIFS('05 Daten für SUMMEWENNS'!$E$5:$E$505,'05 Daten für SUMMEWENNS'!$H$5:$H$505,$B80,'05 Daten für SUMMEWENNS'!$J$5:$J$505,D$5)","v":0},{"$f":"SUMIFS('05 Daten für SUMMEWENNS'!$E$5:$E$505,'05 Daten für SUMMEWENNS'!$H$5:$H$505,$B80,'05 Daten für SUMMEWENNS'!$J$5:$J$505,E$5)","v":0},{"$f":"SUMIFS('05 Daten für SUMMEWENNS'!$E$5:$E$505,'05 Daten für SUMMEWENNS'!$H$5:$H$505,$B80,'05 Daten für SUMMEWENNS'!$J$5:$J$505,F$5)","v":0},{"$f":"SUMIFS('05 Daten für SUMMEWENNS'!$E$5:$E$505,'05 Daten für SUMMEWENNS'!$H$5:$H$505,$B80,'05 Daten für SUMMEWENNS'!$J$5:$J$505,G$5)","v":0},{"$f":"SUMIFS('05 Daten für SUMMEWENNS'!$E$5:$E$505,'05 Daten für SUMMEWENNS'!$H$5:$H$505,$B80,'05 Daten für SUMMEWENNS'!$J$5:$J$505,H$5)","v":0}]
[null,75,{"$f":"SUMIFS('05 Daten für SUMMEWENNS'!$E$5:$E$505,'05 Daten für SUMMEWENNS'!$H$5:$H$505,$B81,'05 Daten für SUMMEWENNS'!$J$5:$J$505,C$5)","v":0},{"$f":"SUMIFS('05 Daten für SUMMEWENNS'!$E$5:$E$505,'05 Daten für SUMMEWENNS'!$H$5:$H$505,$B81,'05 Daten für SUMMEWENNS'!$J$5:$J$505,D$5)","v":0},{"$f":"SUMIFS('05 Daten für SUMMEWENNS'!$E$5:$E$505,'05 Daten für SUMMEWENNS'!$H$5:$H$505,$B81,'05 Daten für SUMMEWENNS'!$J$5:$J$505,E$5)","v":0},{"$f":"SUMIFS('05 Daten für SUMMEWENNS'!$E$5:$E$505,'05 Daten für SUMMEWENNS'!$H$5:$H$505,$B81,'05 Daten für SUMMEWENNS'!$J$5:$J$505,F$5)","v":0},{"$f":"SUMIFS('05 Daten für SUMMEWENNS'!$E$5:$E$505,'05 Daten für SUMMEWENNS'!$H$5:$H$505,$B81,'05 Daten für SUMMEWENNS'!$J$5:$J$505,G$5)","v":0},{"$f":"SUMIFS('05 Daten für SUMMEWENNS'!$E$5:$E$505,'05 Daten für SUMMEWENNS'!$H$5:$H$505,$B81,'05 Daten für SUMMEWENNS'!$J$5:$J$505,H$5)","v":0}]
[null,76,{"$f":"SUMIFS('05 Daten für SUMMEWENNS'!$E$5:$E$505,'05 Daten für SUMMEWENNS'!$H$5:$H$505,$B82,'05 Daten für SUMMEWENNS'!$J$5:$J$505,C$5)","v":289.17599999999999},{"$f":"SUMIFS('05 Daten für SUMMEWENNS'!$E$5:$E$505,'05 Daten für SUMMEWENNS'!$H$5:$H$505,$B82,'05 Daten für SUMMEWENNS'!$J$5:$J$505,D$5)","v":0},{"$f":"SUMIFS('05 Daten für SUMMEWENNS'!$E$5:$E$505,'05 Daten für SUMMEWENNS'!$H$5:$H$505,$B82,'05 Daten für SUMMEWENNS'!$J$5:$J$505,E$5)","v":0},{"$f":"SUMIFS('05 Daten für SUMMEWENNS'!$E$5:$E$505,'05 Daten für SUMMEWENNS'!$H$5:$H$505,$B82,'05 Daten für SUMMEWENNS'!$J$5:$J$505,F$5)","v":29.46},{"$f":"SUMIFS('05 Daten für SUMMEWENNS'!$E$5:$E$505,'05 Daten für SUMMEWENNS'!$H$5:$H$505,$B82,'05 Daten für SUMMEWENNS'!$J$5:$J$505,G$5)","v":121.464},{"$f":"SUMIFS('05 Daten für SUMMEWENNS'!$E$5:$E$505,'05 Daten für SUMMEWENNS'!$H$5:$H$505,$B82,'05 Daten für SUMMEWENNS'!$J$5:$J$505,H$5)","v":0}]
[null,77,{"$f":"SUMIFS('05 Daten für SUMMEWENNS'!$E$5:$E$505,'05 Daten für SUMMEWENNS'!$H$5:$H$505,$B83,'05 Daten für SUMMEWENNS'!$J$5:$J$505,C$5)","v":0},{"$f":"SUMIFS('05 Daten für SUMMEWENNS'!$E$5:$E$505,'05 Daten für SUMMEWENNS'!$H$5:$H$505,$B83,'05 Daten für SUMMEWENNS'!$J$5:$J$505,D$5)","v":0},{"$f":"SUMIFS('05 Daten für SUMMEWENNS'!$E$5:$E$505,'05 Daten für SUMMEWENNS'!$H$5:$H$505,$B83,'05 Daten für SUMMEWENNS'!$J$5:$J$505,E$5)","v":0},{"$f":"SUMIFS('05 Daten für SUMMEWENNS'!$E$5:$E$505,'05 Daten für SUMMEWENNS'!$H$5:$H$505,$B83,'05 Daten für SUMMEWENNS'!$J$5:$J$505,F$5)","v":0},{"$f":"SUMIFS('05 Daten für SUMMEWENNS'!$E$5:$E$505,'05 Daten für SUMMEWENNS'!$H$5:$H$505,$B83,'05 Daten für SUMMEWENNS'!$J$5:$J$505,G$5)","v":0},{"$f":"SUMIFS('05 Daten für SUMMEWENNS'!$E$5:$E$505,'05 Daten für SUMMEWENNS'!$H$5:$H$505,$B83,'05 Daten für SUMMEWENNS'!$J$5:$J$505,H$5)","v":0}]
[null,78,{"$f":"SUMIFS('05 Daten für SUMMEWENNS'!$E$5:$E$505,'05 Daten für SUMMEWENNS'!$H$5:$H$505,$B84,'05 Daten für SUMMEWENNS'!$J$5:$J$505,C$5)","v":0},{"$f":"SUMIFS('05 Daten für SUMMEWENNS'!$E$5:$E$505,'05 Daten für SUMMEWENNS'!$H$5:$H$505,$B84,'05 Daten für SUMMEWENNS'!$J$5:$J$505,D$5)","v":0},{"$f":"SUMIFS('05 Daten für SUMMEWENNS'!$E$5:$E$505,'05 Daten für SUMMEWENNS'!$H$5:$H$505,$B84,'05 Daten für SUMMEWENNS'!$J$5:$J$505,E$5)","v":0},{"$f":"SUMIFS('05 Daten für SUMMEWENNS'!$E$5:$E$505,'05 Daten für SUMMEWENNS'!$H$5:$H$505,$B84,'05 Daten für SUMMEWENNS'!$J$5:$J$505,F$5)","v":0},{"$f":"SUMIFS('05 Daten für SUMMEWENNS'!$E$5:$E$505,'05 Daten für SUMMEWENNS'!$H$5:$H$505,$B84,'05 Daten für SUMMEWENNS'!$J$5:$J$505,G$5)","v":0},{"$f":"SUMIFS('05 Daten für SUMMEWENNS'!$E$5:$E$505,'05 Daten für SUMMEWENNS'!$H$5:$H$505,$B84,'05 Daten für SUMMEWENNS'!$J$5:$J$505,H$5)","v":0}]
[null,79,{"$f":"SUMIFS('05 Daten für SUMMEWENNS'!$E$5:$E$505,'05 Daten für SUMMEWENNS'!$H$5:$H$505,$B85,'05 Daten für SUMMEWENNS'!$J$5:$J$505,C$5)","v":0},{"$f":"SUMIFS('05 Daten für SUMMEWENNS'!$E$5:$E$505,'05 Daten für SUMMEWENNS'!$H$5:$H$505,$B85,'05 Daten für SUMMEWENNS'!$J$5:$J$505,D$5)","v":0},{"$f":"SUMIFS('05 Daten für SUMMEWENNS'!$E$5:$E$505,'05 Daten für SUMMEWENNS'!$H$5:$H$505,$B85,'05 Daten für SUMMEWENNS'!$J$5:$J$505,E$5)","v":0},{"$f":"SUMIFS('05 Daten für SUMMEWENNS'!$E$5:$E$505,'05 Daten für SUMMEWENNS'!$H$5:$H$505,$B85,'05 Daten für SUMMEWENNS'!$J$5:$J$505,F$5)","v":0},{"$f":"SUMIFS('05 Daten für SUMMEWENNS'!$E$5:$E$505,'05 Daten für SUMMEWENNS'!$H$5:$H$505,$B85,'05 Daten für SUMMEWENNS'!$J$5:$J$505,G$5)","v":0},{"$f":"SUMIFS('05 Daten für SUMMEWENNS'!$E$5:$E$505,'05 Daten für SUMMEWENNS'!$H$5:$H$505,$B85,'05 Daten für SUMMEWENNS'!$J$5:$J$505,H$5)","v":0}]
[null,80,{"$f":"SUMIFS('05 Daten für SUMMEWENNS'!$E$5:$E$505,'05 Daten für SUMMEWENNS'!$H$5:$H$505,$B86,'05 Daten für SUMMEWENNS'!$J$5:$J$505,C$5)","v":0},{"$f":"SUMIFS('05 Daten für SUMMEWENNS'!$E$5:$E$505,'05 Daten für SUMMEWENNS'!$H$5:$H$505,$B86,'05 Daten für SUMMEWENNS'!$J$5:$J$505,D$5)","v":0},{"$f":"SUMIFS('05 Daten für SUMMEWENNS'!$E$5:$E$505,'05 Daten für SUMMEWENNS'!$H$5:$H$505,$B86,'05 Daten für SUMMEWENNS'!$J$5:$J$505,E$5)","v":0},{"$f":"SUMIFS('05 Daten für SUMMEWENNS'!$E$5:$E$505,'05 Daten für SUMMEWENNS'!$H$5:$H$505,$B86,'05 Daten für SUMMEWENNS'!$J$5:$J$505,F$5)","v":0},{"$f":"SUMIFS('05 Daten für SUMMEWENNS'!$E$5:$E$505,'05 Daten für SUMMEWENNS'!$H$5:$H$505,$B86,'05 Daten für SUMMEWENNS'!$J$5:$J$505,G$5)","v":0},{"$f":"SUMIFS('05 Daten für SUMMEWENNS'!$E$5:$E$505,'05 Daten für SUMMEWENNS'!$H$5:$H$505,$B86,'05 Daten für SUMMEWENNS'!$J$5:$J$505,H$5)","v":0}]
[null,81,{"$f":"SUMIFS('05 Daten für SUMMEWENNS'!$E$5:$E$505,'05 Daten für SUMMEWENNS'!$H$5:$H$505,$B87,'05 Daten für SUMMEWENNS'!$J$5:$J$505,C$5)","v":0},{"$f":"SUMIFS('05 Daten für SUMMEWENNS'!$E$5:$E$505,'05 Daten für SUMMEWENNS'!$H$5:$H$505,$B87,'05 Daten für SUMMEWENNS'!$J$5:$J$505,D$5)","v":0},{"$f":"SUMIFS('05 Daten für SUMMEWENNS'!$E$5:$E$505,'05 Daten für SUMMEWENNS'!$H$5:$H$505,$B87,'05 Daten für SUMMEWENNS'!$J$5:$J$505,E$5)","v":0},{"$f":"SUMIFS('05 Daten für SUMMEWENNS'!$E$5:$E$505,'05 Daten für SUMMEWENNS'!$H$5:$H$505,$B87,'05 Daten für SUMMEWENNS'!$J$5:$J$505,F$5)","v":0},{"$f":"SUMIFS('05 Daten für SUMMEWENNS'!$E$5:$E$505,'05 Daten für SUMMEWENNS'!$H$5:$H$505,$B87,'05 Daten für SUMMEWENNS'!$J$5:$J$505,G$5)","v":0},{"$f":"SUMIFS('05 Daten für SUMMEWENNS'!$E$5:$E$505,'05 Daten für SUMMEWENNS'!$H$5:$H$505,$B87,'05 Daten für SUMMEWENNS'!$J$5:$J$505,H$5)","v":0}]
[null,82,{"$f":"SUMIFS('05 Daten für SUMMEWENNS'!$E$5:$E$505,'05 Daten für SUMMEWENNS'!$H$5:$H$505,$B88,'05 Daten für SUMMEWENNS'!$J$5:$J$505,C$5)","v":0},{"$f":"SUMIFS('05 Daten für SUMMEWENNS'!$E$5:$E$505,'05 Daten für SUMMEWENNS'!$H$5:$H$505,$B88,'05 Daten für SUMMEWENNS'!$J$5:$J$505,D$5)","v":0},{"$f":"SUMIFS('05 Daten für SUMMEWENNS'!$E$5:$E$505,'05 Daten für SUMMEWENNS'!$H$5:$H$505,$B88,'05 Daten für SUMMEWENNS'!$J$5:$J$505,E$5)","v":0},{"$f":"SUMIFS('05 Daten für SUMMEWENNS'!$E$5:$E$505,'05 Daten für SUMMEWENNS'!$H$5:$H$505,$B88,'05 Daten für SUMMEWENNS'!$J$5:$J$505,F$5)","v":0},{"$f":"SUMIFS('05 Daten für SUMMEWENNS'!$E$5:$E$505,'05 Daten für SUMMEWENNS'!$H$5:$H$505,$B88,'05 Daten für SUMMEWENNS'!$J$5:$J$505,G$5)","v":0},{"$f":"SUMIFS('05 Daten für SUMMEWENNS'!$E$5:$E$505,'05 Daten für SUMMEWENNS'!$H$5:$H$505,$B88,'05 Daten für SUMMEWENNS'!$J$5:$J$505,H$5)","v":0}]
[null,83,{"$f":"SUMIFS('05 Daten für SUMMEWENNS'!$E$5:$E$505,'05 Daten für SUMMEWENNS'!$H$5:$H$505,$B89,'05 Daten für SUMMEWENNS'!$J$5:$J$505,C$5)","v":0},{"$f":"SUMIFS('05 Daten für SUMMEWENNS'!$E$5:$E$505,'05 Daten für SUMMEWENNS'!$H$5:$H$505,$B89,'05 Daten für SUMMEWENNS'!$J$5:$J$505,D$5)","v":0},{"$f":"SUMIFS('05 Daten für SUMMEWENNS'!$E$5:$E$505,'05 Daten für SUMMEWENNS'!$H$5:$H$505,$B89,'05 Daten für SUMMEWENNS'!$J$5:$J$505,E$5)","v":0},{"$f":"SUMIFS('05 Daten für SUMMEWENNS'!$E$5:$E$505,'05 Daten für SUMMEWENNS'!$H$5:$H$505,$B89,'05 Daten für SUMMEWENNS'!$J$5:$J$505,F$5)","v":0},{"$f":"SUMIFS('05 Daten für SUMMEWENNS'!$E$5:$E$505,'05 Daten für SUMMEWENNS'!$H$5:$H$505,$B89,'05 Daten für SUMMEWENNS'!$J$5:$J$505,G$5)","v":0},{"$f":"SUMIFS('05 Daten für SUMMEWENNS'!$E$5:$E$505,'05 Daten für SUMMEWENNS'!$H$5:$H$505,$B89,'05 Daten für SUMMEWENNS'!$J$5:$J$505,H$5)","v":0}]
[null,84,{"$f":"SUMIFS('05 Daten für SUMMEWENNS'!$E$5:$E$505,'05 Daten für SUMMEWENNS'!$H$5:$H$505,$B90,'05 Daten für SUMMEWENNS'!$J$5:$J$505,C$5)","v":0},{"$f":"SUMIFS('05 Daten für SUMMEWENNS'!$E$5:$E$505,'05 Daten für SUMMEWENNS'!$H$5:$H$505,$B90,'05 Daten für SUMMEWENNS'!$J$5:$J$505,D$5)","v":0},{"$f":"SUMIFS('05 Daten für SUMMEWENNS'!$E$5:$E$505,'05 Daten für SUMMEWENNS'!$H$5:$H$505,$B90,'05 Daten für SUMMEWENNS'!$J$5:$J$505,E$5)","v":0},{"$f":"SUMIFS('05 Daten für SUMMEWENNS'!$E$5:$E$505,'05 Daten für SUMMEWENNS'!$H$5:$H$505,$B90,'05 Daten für SUMMEWENNS'!$J$5:$J$505,F$5)","v":0},{"$f":"SUMIFS('05 Daten für SUMMEWENNS'!$E$5:$E$505,'05 Daten für SUMMEWENNS'!$H$5:$H$505,$B90,'05 Daten für SUMMEWENNS'!$J$5:$J$505,G$5)","v":0},{"$f":"SUMIFS('05 Daten für SUMMEWENNS'!$E$5:$E$505,'05 Daten für SUMMEWENNS'!$H$5:$H$505,$B90,'05 Daten für SUMMEWENNS'!$J$5:$J$505,H$5)","v":0}]
[null,85,{"$f":"SUMIFS('05 Daten für SUMMEWENNS'!$E$5:$E$505,'05 Daten für SUMMEWENNS'!$H$5:$H$505,$B91,'05 Daten für SUMMEWENNS'!$J$5:$J$505,C$5)","v":0},{"$f":"SUMIFS('05 Daten für SUMMEWENNS'!$E$5:$E$505,'05 Daten für SUMMEWENNS'!$H$5:$H$505,$B91,'05 Daten für SUMMEWENNS'!$J$5:$J$505,D$5)","v":0},{"$f":"SUMIFS('05 Daten für SUMMEWENNS'!$E$5:$E$505,'05 Daten für SUMMEWENNS'!$H$5:$H$505,$B91,'05 Daten für SUMMEWENNS'!$J$5:$J$505,E$5)","v":0},{"$f":"SUMIFS('05 Daten für SUMMEWENNS'!$E$5:$E$505,'05 Daten für SUMMEWENNS'!$H$5:$H$505,$B91,'05 Daten für SUMMEWENNS'!$J$5:$J$505,F$5)","v":0},{"$f":"SUMIFS('05 Daten für SUMMEWENNS'!$E$5:$E$505,'05 Daten für SUMMEWENNS'!$H$5:$H$505,$B91,'05 Daten für SUMMEWENNS'!$J$5:$J$505,G$5)","v":0},{"$f":"SUMIFS('05 Daten für SUMMEWENNS'!$E$5:$E$505,'05 Daten für SUMMEWENNS'!$H$5:$H$505,$B91,'05 Daten für SUMMEWENNS'!$J$5:$J$505,H$5)","v":0}]
[null,86,{"$f":"SUMIFS('05 Daten für SUMMEWENNS'!$E$5:$E$505,'05 Daten für SUMMEWENNS'!$H$5:$H$505,$B92,'05 Daten für SUMMEWENNS'!$J$5:$J$505,C$5)","v":0},{"$f":"SUMIFS('05 Daten für SUMMEWENNS'!$E$5:$E$505,'05 Daten für SUMMEWENNS'!$H$5:$H$505,$B92,'05 Daten für SUMMEWENNS'!$J$5:$J$505,D$5)","v":0},{"$f":"SUMIFS('05 Daten für SUMMEWENNS'!$E$5:$E$505,'05 Daten für SUMMEWENNS'!$H$5:$H$505,$B92,'05 Daten für SUMMEWENNS'!$J$5:$J$505,E$5)","v":0},{"$f":"SUMIFS('05 Daten für SUMMEWENNS'!$E$5:$E$505,'05 Daten für SUMMEWENNS'!$H$5:$H$505,$B92,'05 Daten für SUMMEWENNS'!$J$5:$J$505,F$5)","v":0},{"$f":"SUMIFS('05 Daten für SUMMEWENNS'!$E$5:$E$505,'05 Daten für SUMMEWENNS'!$H$5:$H$505,$B92,'05 Daten für SUMMEWENNS'!$J$5:$J$505,G$5)","v":0},{"$f":"SUMIFS('05 Daten für SUMMEWENNS'!$E$5:$E$505,'05 Daten für SUMMEWENNS'!$H$5:$H$505,$B92,'05 Daten für SUMMEWENNS'!$J$5:$J$505,H$5)","v":0}]
[null,87,{"$f":"SUMIFS('05 Daten für SUMMEWENNS'!$E$5:$E$505,'05 Daten für SUMMEWENNS'!$H$5:$H$505,$B93,'05 Daten für SUMMEWENNS'!$J$5:$J$505,C$5)","v":0},{"$f":"SUMIFS('05 Daten für SUMMEWENNS'!$E$5:$E$505,'05 Daten für SUMMEWENNS'!$H$5:$H$505,$B93,'05 Daten für SUMMEWENNS'!$J$5:$J$505,D$5)","v":0},{"$f":"SUMIFS('05 Daten für SUMMEWENNS'!$E$5:$E$505,'05 Daten für SUMMEWENNS'!$H$5:$H$505,$B93,'05 Daten für SUMMEWENNS'!$J$5:$J$505,E$5)","v":0},{"$f":"SUMIFS('05 Daten für SUMMEWENNS'!$E$5:$E$505,'05 Daten für SUMMEWENNS'!$H$5:$H$505,$B93,'05 Daten für SUMMEWENNS'!$J$5:$J$505,F$5)","v":0},{"$f":"SUMIFS('05 Daten für SUMMEWENNS'!$E$5:$E$505,'05 Daten für SUMMEWENNS'!$H$5:$H$505,$B93,'05 Daten für SUMMEWENNS'!$J$5:$J$505,G$5)","v":0},{"$f":"SUMIFS('05 Daten für SUMMEWENNS'!$E$5:$E$505,'05 Daten für SUMMEWENNS'!$H$5:$H$505,$B93,'05 Daten für SUMMEWENNS'!$J$5:$J$505,H$5)","v":0}]
[null,88,{"$f":"SUMIFS('05 Daten für SUMMEWENNS'!$E$5:$E$505,'05 Daten für SUMMEWENNS'!$H$5:$H$505,$B94,'05 Daten für SUMMEWENNS'!$J$5:$J$505,C$5)","v":0},{"$f":"SUMIFS('05 Daten für SUMMEWENNS'!$E$5:$E$505,'05 Daten für SUMMEWENNS'!$H$5:$H$505,$B94,'05 Daten für SUMMEWENNS'!$J$5:$J$505,D$5)","v":0},{"$f":"SUMIFS('05 Daten für SUMMEWENNS'!$E$5:$E$505,'05 Daten für SUMMEWENNS'!$H$5:$H$505,$B94,'05 Daten für SUMMEWENNS'!$J$5:$J$505,E$5)","v":0},{"$f":"SUMIFS('05 Daten für SUMMEWENNS'!$E$5:$E$505,'05 Daten für SUMMEWENNS'!$H$5:$H$505,$B94,'05 Daten für SUMMEWENNS'!$J$5:$J$505,F$5)","v":0},{"$f":"SUMIFS('05 Daten für SUMMEWENNS'!$E$5:$E$505,'05 Daten für SUMMEWENNS'!$H$5:$H$505,$B94,'05 Daten für SUMMEWENNS'!$J$5:$J$505,G$5)","v":0},{"$f":"SUMIFS('05 Daten für SUMMEWENNS'!$E$5:$E$505,'05 Daten für SUMMEWENNS'!$H$5:$H$505,$B94,'05 Daten für SUMMEWENNS'!$J$5:$J$505,H$5)","v":0}]
[null,89,{"$f":"SUMIFS('05 Daten für SUMMEWENNS'!$E$5:$E$505,'05 Daten für SUMMEWENNS'!$H$5:$H$505,$B95,'05 Daten für SUMMEWENNS'!$J$5:$J$505,C$5)","v":0},{"$f":"SUMIFS('05 Daten für SUMMEWENNS'!$E$5:$E$505,'05 Daten für SUMMEWENNS'!$H$5:$H$505,$B95,'05 Daten für SUMMEWENNS'!$J$5:$J$505,D$5)","v":0},{"$f":"SUMIFS('05 Daten für SUMMEWENNS'!$E$5:$E$505,'05 Daten für SUMMEWENNS'!$H$5:$H$505,$B95,'05 Daten für SUMMEWENNS'!$J$5:$J$505,E$5)","v":0},{"$f":"SUMIFS('05 Daten für SUMMEWENNS'!$E$5:$E$505,'05 Daten für SUMMEWENNS'!$H$5:$H$505,$B95,'05 Daten für SUMMEWENNS'!$J$5:$J$505,F$5)","v":0},{"$f":"SUMIFS('05 Daten für SUMMEWENNS'!$E$5:$E$505,'05 Daten für SUMMEWENNS'!$H$5:$H$505,$B95,'05 Daten für SUMMEWENNS'!$J$5:$J$505,G$5)","v":0},{"$f":"SUMIFS('05 Daten für SUMMEWENNS'!$E$5:$E$505,'05 Daten für SUMMEWENNS'!$H$5:$H$505,$B95,'05 Daten für SUMMEWENNS'!$J$5:$J$505,H$5)","v":0}]
[null,90,{"$f":"SUMIFS('05 Daten für SUMMEWENNS'!$E$5:$E$505,'05 Daten für SUMMEWENNS'!$H$5:$H$505,$B96,'05 Daten für SUMMEWENNS'!$J$5:$J$505,C$5)","v":0},{"$f":"SUMIFS('05 Daten für SUMMEWENNS'!$E$5:$E$505,'05 Daten für SUMMEWENNS'!$H$5:$H$505,$B96,'05 Daten für SUMMEWENNS'!$J$5:$J$505,D$5)","v":0},{"$f":"SUMIFS('05 Daten für SUMMEWENNS'!$E$5:$E$505,'05 Daten für SUMMEWENNS'!$H$5:$H$505,$B96,'05 Daten für SUMMEWENNS'!$J$5:$J$505,E$5)","v":0},{"$f":"SUMIFS('05 Daten für SUMMEWENNS'!$E$5:$E$505,'05 Daten für SUMMEWENNS'!$H$5:$H$505,$B96,'05 Daten für SUMMEWENNS'!$J$5:$J$505,F$5)","v":40098.239999999983},{"$f":"SUMIFS('05 Daten für SUMMEWENNS'!$E$5:$E$505,'05 Daten für SUMMEWENNS'!$H$5:$H$505,$B96,'05 Daten für SUMMEWENNS'!$J$5:$J$505,G$5)","v":0},{"$f":"SUMIFS('05 Daten für SUMMEWENNS'!$E$5:$E$505,'05 Daten für SUMMEWENNS'!$H$5:$H$505,$B96,'05 Daten für SUMMEWENNS'!$J$5:$J$505,H$5)","v":0}]
[null,91,{"$f":"SUMIFS('05 Daten für SUMMEWENNS'!$E$5:$E$505,'05 Daten für SUMMEWENNS'!$H$5:$H$505,$B97,'05 Daten für SUMMEWENNS'!$J$5:$J$505,C$5)","v":0},{"$f":"SUMIFS('05 Daten für SUMMEWENNS'!$E$5:$E$505,'05 Daten für SUMMEWENNS'!$H$5:$H$505,$B97,'05 Daten für SUMMEWENNS'!$J$5:$J$505,D$5)","v":0},{"$f":"SUMIFS('05 Daten für SUMMEWENNS'!$E$5:$E$505,'05 Daten für SUMMEWENNS'!$H$5:$H$505,$B97,'05 Daten für SUMMEWENNS'!$J$5:$J$505,E$5)","v":0},{"$f":"SUMIFS('05 Daten für SUMMEWENNS'!$E$5:$E$505,'05 Daten für SUMMEWENNS'!$H$5:$H$505,$B97,'05 Daten für SUMMEWENNS'!$J$5:$J$505,F$5)","v":0},{"$f":"SUMIFS('05 Daten für SUMMEWENNS'!$E$5:$E$505,'05 Daten für SUMMEWENNS'!$H$5:$H$505,$B97,'05 Daten für SUMMEWENNS'!$J$5:$J$505,G$5)","v":0},{"$f":"SUMIFS('05 Daten für SUMMEWENNS'!$E$5:$E$505,'05 Daten für SUMMEWENNS'!$H$5:$H$505,$B97,'05 Daten für SUMMEWENNS'!$J$5:$J$505,H$5)","v":0}]
[null,92,{"$f":"SUMIFS('05 Daten für SUMMEWENNS'!$E$5:$E$505,'05 Daten für SUMMEWENNS'!$H$5:$H$505,$B98,'05 Daten für SUMMEWENNS'!$J$5:$J$505,C$5)","v":0},{"$f":"SUMIFS('05 Daten für SUMMEWENNS'!$E$5:$E$505,'05 Daten für SUMMEWENNS'!$H$5:$H$505,$B98,'05 Daten für SUMMEWENNS'!$J$5:$J$505,D$5)","v":0},{"$f":"SUMIFS('05 Daten für SUMMEWENNS'!$E$5:$E$505,'05 Daten für SUMMEWENNS'!$H$5:$H$505,$B98,'05 Daten für SUMMEWENNS'!$J$5:$J$505,E$5)","v":0},{"$f":"SUMIFS('05 Daten für SUMMEWENNS'!$E$5:$E$505,'05 Daten für SUMMEWENNS'!$H$5:$H$505,$B98,'05 Daten für SUMMEWENNS'!$J$5:$J$505,F$5)","v":0},{"$f":"SUMIFS('05 Daten für SUMMEWENNS'!$E$5:$E$505,'05 Daten für SUMMEWENNS'!$H$5:$H$505,$B98,'05 Daten für SUMMEWENNS'!$J$5:$J$505,G$5)","v":0},{"$f":"SUMIFS('05 Daten für SUMMEWENNS'!$E$5:$E$505,'05 Daten für SUMMEWENNS'!$H$5:$H$505,$B98,'05 Daten für SUMMEWENNS'!$J$5:$J$505,H$5)","v":0}]
[null,93,{"$f":"SUMIFS('05 Daten für SUMMEWENNS'!$E$5:$E$505,'05 Daten für SUMMEWENNS'!$H$5:$H$505,$B99,'05 Daten für SUMMEWENNS'!$J$5:$J$505,C$5)","v":0},{"$f":"SUMIFS('05 Daten für SUMMEWENNS'!$E$5:$E$505,'05 Daten für SUMMEWENNS'!$H$5:$H$505,$B99,'05 Daten für SUMMEWENNS'!$J$5:$J$505,D$5)","v":0},{"$f":"SUMIFS('05 Daten für SUMMEWENNS'!$E$5:$E$505,'05 Daten für SUMMEWENNS'!$H$5:$H$505,$B99,'05 Daten für SUMMEWENNS'!$J$5:$J$505,E$5)","v":0},{"$f":"SUMIFS('05 Daten für SUMMEWENNS'!$E$5:$E$505,'05 Daten für SUMMEWENNS'!$H$5:$H$505,$B99,'05 Daten für SUMMEWENNS'!$J$5:$J$505,F$5)","v":0},{"$f":"SUMIFS('05 Daten für SUMMEWENNS'!$E$5:$E$505,'05 Daten für SUMMEWENNS'!$H$5:$H$505,$B99,'05 Daten für SUMMEWENNS'!$J$5:$J$505,G$5)","v":0},{"$f":"SUMIFS('05 Daten für SUMMEWENNS'!$E$5:$E$505,'05 Daten für SUMMEWENNS'!$H$5:$H$505,$B99,'05 Daten für SUMMEWENNS'!$J$5:$J$505,H$5)","v":0}]
[null,94,{"$f":"SUMIFS('05 Daten für SUMMEWENNS'!$E$5:$E$505,'05 Daten für SUMMEWENNS'!$H$5:$H$505,$B100,'05 Daten für SUMMEWENNS'!$J$5:$J$505,C$5)","v":0},{"$f":"SUMIFS('05 Daten für SUMMEWENNS'!$E$5:$E$505,'05 Daten für SUMMEWENNS'!$H$5:$H$505,$B100,'05 Daten für SUMMEWENNS'!$J$5:$J$505,D$5)","v":0},{"$f":"SUMIFS('05 Daten für SUMMEWENNS'!$E$5:$E$505,'05 Daten für SUMMEWENNS'!$H$5:$H$505,$B100,'05 Daten für SUMMEWENNS'!$J$5:$J$505,E$5)","v":0},{"$f":"SUMIFS('05 Daten für SUMMEWENNS'!$E$5:$E$505,'05 Daten für SUMMEWENNS'!$H$5:$H$505,$B100,'05 Daten für SUMMEWENNS'!$J$5:$J$505,F$5)","v":0},{"$f":"SUMIFS('05 Daten für SUMMEWENNS'!$E$5:$E$505,'05 Daten für SUMMEWENNS'!$H$5:$H$505,$B100,'05 Daten für SUMMEWENNS'!$J$5:$J$505,G$5)","v":0},{"$f":"SUMIFS('05 Daten für SUMMEWENNS'!$E$5:$E$505,'05 Daten für SUMMEWENNS'!$H$5:$H$505,$B100,'05 Daten für SUMMEWENNS'!$J$5:$J$505,H$5)","v":0}]
[null,95,{"$f":"SUMIFS('05 Daten für SUMMEWENNS'!$E$5:$E$505,'05 Daten für SUMMEWENNS'!$H$5:$H$505,$B101,'05 Daten für SUMMEWENNS'!$J$5:$J$505,C$5)","v":4182.08},{"$f":"SUMIFS('05 Daten für SUMMEWENNS'!$E$5:$E$505,'05 Daten für SUMMEWENNS'!$H$5:$H$505,$B101,'05 Daten für SUMMEWENNS'!$J$5:$J$505,D$5)","v":2856.4},{"$f":"SUMIFS('05 Daten für SUMMEWENNS'!$E$5:$E$505,'05 Daten für SUMMEWENNS'!$H$5:$H$505,$B101,'05 Daten für SUMMEWENNS'!$J$5:$J$505,E$5)","v":0},{"$f":"SUMIFS('05 Daten für SUMMEWENNS'!$E$5:$E$505,'05 Daten für SUMMEWENNS'!$H$5:$H$505,$B101,'05 Daten für SUMMEWENNS'!$J$5:$J$505,F$5)","v":805},{"$f":"SUMIFS('05 Daten für SUMMEWENNS'!$E$5:$E$505,'05 Daten für SUMMEWENNS'!$H$5:$H$505,$B101,'05 Daten für SUMMEWENNS'!$J$5:$J$505,G$5)","v":0},{"$f":"SUMIFS('05 Daten für SUMMEWENNS'!$E$5:$E$505,'05 Daten für SUMMEWENNS'!$H$5:$H$505,$B101,'05 Daten für SUMMEWENNS'!$J$5:$J$505,H$5)","v":0}]
[null,96,{"$f":"SUMIFS('05 Daten für SUMMEWENNS'!$E$5:$E$505,'05 Daten für SUMMEWENNS'!$H$5:$H$505,$B102,'05 Daten für SUMMEWENNS'!$J$5:$J$505,C$5)","v":0},{"$f":"SUMIFS('05 Daten für SUMMEWENNS'!$E$5:$E$505,'05 Daten für SUMMEWENNS'!$H$5:$H$505,$B102,'05 Daten für SUMMEWENNS'!$J$5:$J$505,D$5)","v":0},{"$f":"SUMIFS('05 Daten für SUMMEWENNS'!$E$5:$E$505,'05 Daten für SUMMEWENNS'!$H$5:$H$505,$B102,'05 Daten für SUMMEWENNS'!$J$5:$J$505,E$5)","v":0},{"$f":"SUMIFS('05 Daten für SUMMEWENNS'!$E$5:$E$505,'05 Daten für SUMMEWENNS'!$H$5:$H$505,$B102,'05 Daten für SUMMEWENNS'!$J$5:$J$505,F$5)","v":0},{"$f":"SUMIFS('05 Daten für SUMMEWENNS'!$E$5:$E$505,'05 Daten für SUMMEWENNS'!$H$5:$H$505,$B102,'05 Daten für SUMMEWENNS'!$J$5:$J$505,G$5)","v":0},{"$f":"SUMIFS('05 Daten für SUMMEWENNS'!$E$5:$E$505,'05 Daten für SUMMEWENNS'!$H$5:$H$505,$B102,'05 Daten für SUMMEWENNS'!$J$5:$J$505,H$5)","v":0}]
[null,97,{"$f":"SUMIFS('05 Daten für SUMMEWENNS'!$E$5:$E$505,'05 Daten für SUMMEWENNS'!$H$5:$H$505,$B103,'05 Daten für SUMMEWENNS'!$J$5:$J$505,C$5)","v":0},{"$f":"SUMIFS('05 Daten für SUMMEWENNS'!$E$5:$E$505,'05 Daten für SUMMEWENNS'!$H$5:$H$505,$B103,'05 Daten für SUMMEWENNS'!$J$5:$J$505,D$5)","v":0},{"$f":"SUMIFS('05 Daten für SUMMEWENNS'!$E$5:$E$505,'05 Daten für SUMMEWENNS'!$H$5:$H$505,$B103,'05 Daten für SUMMEWENNS'!$J$5:$J$505,E$5)","v":0},{"$f":"SUMIFS('05 Daten für SUMMEWENNS'!$E$5:$E$505,'05 Daten für SUMMEWENNS'!$H$5:$H$505,$B103,'05 Daten für SUMMEWENNS'!$J$5:$J$505,F$5)","v":0},{"$f":"SUMIFS('05 Daten für SUMMEWENNS'!$E$5:$E$505,'05 Daten für SUMMEWENNS'!$H$5:$H$505,$B103,'05 Daten für SUMMEWENNS'!$J$5:$J$505,G$5)","v":0},{"$f":"SUMIFS('05 Daten für SUMMEWENNS'!$E$5:$E$505,'05 Daten für SUMMEWENNS'!$H$5:$H$505,$B103,'05 Daten für SUMMEWENNS'!$J$5:$J$505,H$5)","v":0}]
[null,98,{"$f":"SUMIFS('05 Daten für SUMMEWENNS'!$E$5:$E$505,'05 Daten für SUMMEWENNS'!$H$5:$H$505,$B104,'05 Daten für SUMMEWENNS'!$J$5:$J$505,C$5)","v":0},{"$f":"SUMIFS('05 Daten für SUMMEWENNS'!$E$5:$E$505,'05 Daten für SUMMEWENNS'!$H$5:$H$505,$B104,'05 Daten für SUMMEWENNS'!$J$5:$J$505,D$5)","v":0},{"$f":"SUMIFS('05 Daten für SUMMEWENNS'!$E$5:$E$505,'05 Daten für SUMMEWENNS'!$H$5:$H$505,$B104,'05 Daten für SUMMEWENNS'!$J$5:$J$505,E$5)","v":0},{"$f":"SUMIFS('05 Daten für SUMMEWENNS'!$E$5:$E$505,'05 Daten für SUMMEWENNS'!$H$5:$H$505,$B104,'05 Daten für SUMMEWENNS'!$J$5:$J$505,F$5)","v":0},{"$f":"SUMIFS('05 Daten für SUMMEWENNS'!$E$5:$E$505,'05 Daten für SUMMEWENNS'!$H$5:$H$505,$B104,'05 Daten für SUMMEWENNS'!$J$5:$J$505,G$5)","v":0},{"$f":"SUMIFS('05 Daten für SUMMEWENNS'!$E$5:$E$505,'05 Daten für SUMMEWENNS'!$H$5:$H$505,$B104,'05 Daten für SUMMEWENNS'!$J$5:$J$505,H$5)","v":0}]
[null,99,{"$f":"SUMIFS('05 Daten für SUMMEWENNS'!$E$5:$E$505,'05 Daten für SUMMEWENNS'!$H$5:$H$505,$B105,'05 Daten für SUMMEWENNS'!$J$5:$J$505,C$5)","v":0},{"$f":"SUMIFS('05 Daten für SUMMEWENNS'!$E$5:$E$505,'05 Daten für SUMMEWENNS'!$H$5:$H$505,$B105,'05 Daten für SUMMEWENNS'!$J$5:$J$505,D$5)","v":0},{"$f":"SUMIFS('05 Daten für SUMMEWENNS'!$E$5:$E$505,'05 Daten für SUMMEWENNS'!$H$5:$H$505,$B105,'05 Daten für SUMMEWENNS'!$J$5:$J$505,E$5)","v":0},{"$f":"SUMIFS('05 Daten für SUMMEWENNS'!$E$5:$E$505,'05 Daten für SUMMEWENNS'!$H$5:$H$505,$B105,'05 Daten für SUMMEWENNS'!$J$5:$J$505,F$5)","v":0},{"$f":"SUMIFS('05 Daten für SUMMEWENNS'!$E$5:$E$505,'05 Daten für SUMMEWENNS'!$H$5:$H$505,$B105,'05 Daten für SUMMEWENNS'!$J$5:$J$505,G$5)","v":0},{"$f":"SUMIFS('05 Daten für SUMMEWENNS'!$E$5:$E$505,'05 Daten für SUMMEWENNS'!$H$5:$H$505,$B105,'05 Daten für SUMMEWENNS'!$J$5:$J$505,H$5)","v":0}]

{"sheet":"05 SUMMEWENNS_","index":15,"n_rows":7,"n_cols":8,"rows_kept":7,"cut":false,"hidden":true,"merged":[]}
[null,2,2,2,1,1,1,0]
[1,"05 SUMIFS_",null,null,null,{"$f":"B2","v":"05 SUMIFS_"}]
[2,"05 SUMMEWENNS_"]
[0]
[null,1,"In der Formel SUMMEWENN() können Sie EIN Suchkriterium angeben. In SUMMEWENNS() können Sie MEHRERE Kriterien angeben.\n\nACHTUNG: \nDie Reihenfolge der Argumente ist umgekehrt wie bei SUMMEWENN() - ERST der zu summierende Bereich, DANN die Suchbereiche und Kriterien.\n\nIm Beispiel geht es um Lieferungen von verschiedenen Produktionsstandorten an mehrere Kunden. Mit SUMMEWENNS() kann man dann schnell eine Matrix aufbauen, die zeigt, welche Mengen \n- von wo (erstes Suchkriterium)\n- nach wo (zweites Suchkriterium)\ngeliefert wurden.",null,1,"You can specify ONE search criterion in the SUMIF() formula. You can specify MULTIPLE criteria in SUMIFS().\n\nATTENTION: \nThe order of the arguments is reverses as with SUMIF() - FIRST the range to be summed up, THEN the search ranges and criteria.\n\nThe example deals with deliveries from different production sites to several customers. With SUMIFS() you can then quickly build a matrix showing which quantities were delivered \n- from where (first search criterion)\n- to where (second search criterion)."]
[null,{"$f":"IF(C6<>\"\",B5+1,\"\")","v":""},null,null,{"$f":"IF(F6<>\"\",E5+1,\"\")","v":""}]
[null,{"$f":"IF(C7<>\"\",B6+1,\"\")","v":""},null,null,{"$f":"IF(F7<>\"\",E6+1,\"\")","v":""}]

{"sheet":"06 Teilergebnis","index":16,"n_rows":64,"n_cols":31,"rows_kept":64,"cut":false,"hidden":false,"merged":[[57,2,58,6],[59,2,61,6],[1,1,1,4],[2,1,2,4],[5,2,12,4],[13,2,20,4],[5,6,12,10],[13,6,20,10],[13,30,13,32],[14,30,15,33],[16,30,16,33],[17,30,17,33],[5,30,5,33],[6,30,7,33],[8,30,8,33],[9,30,9,33]]}
[null,null,null,null,null,null,null,null,null,null,null,null,null,null,null,null,null,0]
[1,"06 Subtotal",null,null,null,"Back to Start"]
[2,"06 Teilergebnis",null,null,null,"Startseite"]
[]
[2]
[2,"Achtung","Sortieren Sie die Liste vor der Anwendung von \n      DATEN / \"Teilergebnis\"\nnach der Spalte, die Sie unter \"Gruppieren nach\" auswählen!!\n\nWenn Sie das vergessen, ist der Rechner bei einer langen Liste sehr lange beschäftigt!",null,null,null,"Kopieren der Teilergebnisse über die Office-Zwischenablage:\nTeilergebnisse mit Klick auf \"2\" zusammenklappen\nOffice Zwischenablage mit Start / \"Zwischenablage\"\nKopieren: mit Strg-C in die Office-Zwischenablage\nZielzelle anklicken\nEinfügen: Klick in die Office-Zwischenablage\ndann:\nmit Suchen&Ersetzen \" Ergebnis\" entfernen",null,null,null,null,"-->","Bremen Ergebnis",null,null,779137,"-->","Bremen Ergebnis",779137,"-->","Bremen",779137,"-->",null,null,null,null,null,null,null,"Alles was Sie brauchen ist …"]
[2,null,null,null,null,null,null,null,null,null,null,null,"Hamburg Ergebnis",null,null,1172780,null,"Hamburg Ergebnis",1172780,null,"Hamburg",1172780,null,null,null,null,null,null,null,null,"… Informationen!"]
[2,null,null,null,null,null,null,null,null,null,null,null,"Oldenburg Ergebnis",null,null,616390,"leere","Oldenburg Ergebnis",616390,"\" Ergebnis\"","Oldenburg",616390,"Diagramm"]
[2,null,null,null,null,null,null,null,null,null,null,null,null,null,null,null,"Spalten",null,null,"löschen",null,null,"einfügen",null,null,null,null,null,null,null,"Führungskräfte fällen Entscheidungen!"]
[2,null,null,null,null,null,null,null,null,null,null,null,null,null,null,null,"löschen",null,null,null,null,null,null,null,null,null,null,null,null,null,"Entscheidungen basieren auf Informationen!"]
[2]
[2]
[2]
[1,"Attention","Sort the list before you apply \n      DATA / \"Subtotal\" \naccording to the column, you will select under \"At each change in\"!\n\nIf you have a long list and forget to sort it, the computer will be busy for a very long time!!",null,null,null,"Copy the subtotals using the Office clipboard:\nCollapse the subtotals with a click on \"2\"\nOpen the Office clipboard Home / \"Clipboard\"\nCopy with Ctrl-C into the Office clipboard\nClick the target cell\nPaste: Click into the Office Clipboard\nthen:\nRemove \" Total\" with Find&Replace",null,null,null,null,"-->","Bremen Total",null,null,779137,"-->","Bremen Total",779137,"-->","Bremen",779137,"-->",null,null,null,null,null,null,null,"All you need is …"]
[1,null,null,null,null,null,null,null,null,null,null,null,"Hamburg Total",null,null,1172780,null,"Hamburg Total",1172780,null,"Hamburg",1172780,null,null,null,null,null,null,null,null,"… Information!"]
[1,null,null,null,null,null,null,null,null,null,null,null,"Oldenburg Total",null,null,616390,"delete","Oldenburg Total",616390,"delete","Oldenburg",616390,"insert"]
[1,null,null,null,null,null,null,null,null,null,null,null,null,null,null,null,"empty",null,null,"\" Total\"",null,null,"chart",null,null,null,null,null,null,null,"Managers make decisions!"]
[1,null,null,null,null,null,null,null,null,null,null,null,null,null,null,null,"columns",null,null,null,null,null,null,null,null,null,null,null,null,null,"Decisions are based on information!"]
[1]
[1]
[1]
[1]
[]
[null,null,"branch","customer","quarter","sales","orders"]
[null,null,"Bremen","Shell",4,66745,138]
[null,null,"Bremen","Shell",3,72436,127]
[null,null,"Bremen","Shell",2,78647,120]
[null,null,"Bremen","Shell",1,80425,111]
[null,null,"Bremen","Esso",1,112536,92]
[null,null,"Bremen","Esso",3,111525,89]
[null,null,"Bremen","Esso",4,124978,96]
[null,null,"Bremen","Esso",2,131845,90]
[null,null,"Bremen Ergebnis",null,null,null,{"$f":"SUBTOTAL(9,G25:G32)","v":863}]
[null,null,"Hamburg","Shell",1,78176,66]
[null,null,"Hamburg","Shell",3,88111,68]
[null,null,"Hamburg","Shell",2,82789,63]
[null,null,"Hamburg","Shell",4,94512,59]
[null,null,"Hamburg","Esso",3,213999,119]
[null,null,"Hamburg","Esso",2,224924,122]
[null,null,"Hamburg","Aral",3,35712,19]
[null,null,"Hamburg","Esso",1,243890,123]
[null,null,"Hamburg","Aral",1,38523,19]
[null,null,"Hamburg","Aral",4,32677,15]
[null,null,"Hamburg","Aral",2,39467,17]
[null,null,"Hamburg Ergebnis",null,null,null,{"$f":"SUBTOTAL(9,G34:G44)","v":690}]
[null,null,"Oldenburg","Shell",2,112967,92]
[null,null,"Oldenburg","Shell",3,121210,98]
[null,null,"Oldenburg","Aral",1,31243,25]
[null,null,"Oldenburg","Shell",4,119891,94]
[null,null,"Oldenburg","Shell",1,123124,88]
[null,null,"Oldenburg","Aral",2,33756,24]
[null,null,"Oldenburg","Aral",3,38299,21]
[null,null,"Oldenburg","Aral",4,35900,19]
[null,null,"Oldenburg Ergebnis",null,null,null,{"$f":"SUBTOTAL(9,G46:G53)","v":461}]
[null,null,"Gesamtergebnis",null,null,null,{"$f":"SUBTOTAL(9,G25:G53)","v":2014}]
[]
[]
[1,"Exercise","Open the file \"Excel-Orders\", activate the sheet \"Exercises\" and answer the questions 1-6 using subtotals!"]
[1]
[2,"Übung","Öffnen Sie die Datei \"Excel-Orders\", aktivieren Sie das Blatt \"Übungen\" und beantworten Sie die Fragen 1-6 unter Benutzung von Teilergebnissen!"]
[2]
[]
[]
[0]

{"sheet":"06 Teilergebnis_","index":17,"n_rows":18,"n_cols":8,"rows_kept":18,"cut":false,"hidden":true,"merged":[]}
[null,2,2,2,1,1,1,0]
[1,"06 Subtotal_",null,null,null,{"$f":"B2","v":"06 Subtotal_"}]
[2,"06 Teilergebnis_"]
[0]
[null,1,"Die Funktion \"Teilergebnis\" demonstriert sehr anschaulich die Verdichtung einer zu großen, zu unübersichtlichen Menge an Daten, indem sie die Menge der angezeigten Daten reduziert.\n\nAuf diesem Blatt sehen Sie zunächst das Ergebnis der Anwendung der Funktion \"Teilergebnis\". Anschließend zeige ich Ihnen, wie man dort hin kommt.\n\nAm linken Fensterrand sehen Sie ein neues Bedienelement - Kästchen mit \"1\", \"2\" und \"3\" und Linien mit \"-\" darin. Damit können Sie die Liste zu- und wieder aufklappen.\n\nAm wichtigsten ist der Button \"2\". Er klappt die Liste so zu, dass Sie nur noch die Teilergebnisse sehen. Mit \"3\" können Sie sie wieder aufklappen. Das ist ein sehr anschauliches Beispiel für die Verdichtung von Daten zu Informationen.",null,1,"The \"subtotal\" function demonstrates very clearly the compression of a too large, too confusing amount of data by reducing the amount of data displayed.\n\nOn this sheet, you first see the result of using the \"subtotal\" function. Then I show you how to get there.\n\nOn the left edge of the window you see a new control element - boxes with \"1\", \"2\" and \"3\" and lines with \"-\" in them. With them you can expand and collapse the list.\n\nMost important is the button \"2\". It collapses the list so that you only see the subtotals. With \"3\" you can expand it again. This is a very clear example of how data are compressed into information."]
[null,{"$f":"IF(C6<>\"\",B5+1,\"\")","v":2},"Diese Informationen wollen wir dann später noch weiter bearbeiten. Lassen Sie uns aber zuerst ansehen, wie Sie zu den Teilergebnissen kommen. Dafür gibt es im Menü \"Daten\" unter \"Gliederung\" die Funktion \"Teilergebnis\". Wir werden sie jetzt erst einmal benutzen, um die bereits vorhandenen Teilergebnisse wieder zu entfernen, um sie dann neu erzeugen zu können.\n\nACHTUNG: Dafür muss vorher eine Zelle in der Liste angeklickt werden!\n\nBeachten Sie auch, dass die zusätzlichen Bedienelemente am linken Fensterrand jetzt wieder verschwunden sind!",null,{"$f":"IF(F6<>\"\",E5+1,\"\")","v":2},"This information will be further processed later. But let us first look at how you get to the subtotals. For this purpose, there is a function \"Subtotal\" in the \"Data\" menu under \"Outline\". We will now use it to remove the existing subtotals in order to create new ones.\n\nATTENTION: To do this you must first click on a cell in the list!\n\nPlease also note that the additional controls on the left side of the window have now disappeared again!"]
[null,{"$f":"IF(C7<>\"\",B6+1,\"\")","v":3},"So, jetzt wollen wir also Teilergebnisse anlegen. Dazu öffnen wir wieder das entsprechende Fenster. Dort müssen wir drei Angaben machen:\n\n- \"Gruppieren nach\": Hier wählen wir aus, nach welcher Spalte wir die Daten zusammenfassen wollen - z.B. \"branch\".\n\n- \"Unter Verwendung von\": Hier wählen wir aus, welche mathematische Funktion wir anwenden wollen. Das muss nämlich gar nicht immer die Summe sein.\n\n- \"Teilergebnis addieren zu\": Hier wählen wir aus, auf welche Spalte wir die ausgewählte mathematische Funktion anwenden wollen. Also z.B. Summe der Umsätze.\n\nUnd - Voila! Da sind die Teilergebnisse!",null,{"$f":"IF(F7<>\"\",E6+1,\"\")","v":3},"Well, now we want to create Teilergebnisse. To do this, we open the corresponding window again. There we have to make three entries:\n\n- \"At each change in\": Here we select the column by which we want to group the data - e.g. \"branch\".\n\n- \"Use function\": Here we select which mathematical function we want to use. This does not always have to be the sum.\n\n- \"Add subtotal to\": Here we select to which column we want to apply the selected mathematical function. For example, sum of the sales.\n\nAnd - Voila! There are the subtotals!"]
[null,4,"ACHTUNG: \nEs ist ganz wichtig, dass die Liste VOR der Anwendung der Funktion \"Teilergebnis\" nach der Spalte SORTIERT wird, die in \"Gruppieren nach\" ausgewählt werden soll!\n\nIch zeige Ihnen mal, was passiert, wenn Sie das nicht tun. Dann funktioniert zwar \"Teilergebnis\" trotzdem - das Ergebnis ist aber unbrauchbar. Hinzu kommt, dass die Erstellung von Teilergebnissen in einer unsortierten sehr langen Liste seeehr lange dauern kann.\n\nIm englischen heißt \"Gruppieren nach\" übrigens \"At each change in\". Das drückt es viel genauer aus!",null,{"$f":"IF(F8<>\"\",E7+1,\"\")","v":4},"ATTENTION: \nIt is very important that the list is SORTED BEFORE using the \"subtotal\" function according to the column to be selected in \"At each change in\"!\n\nLet me show you what happens if you do not do this. Then \"subtotal\" will still work - but the result will be unusable. In addition, creating partial results in an unsorted, very long list can take a veeeery long time."]
[null,5,"So, jetzt wollen wir die erzeugten Teilergebnisse weiter verarbeiten. Am Ende soll ein Diagramm dabei herauskommen, denn ein Bild sagt bekanntlich mehr als tausend Worte (bzw. Zahlen).\n\nDafür wollen wir die Teilergebnisse an eine andere Stelle auf unserem Blatt kopieren, um sie dort weiter zu bearbeiten. Das funktioniert aber leider nicht mit dem üblichen copy&paste.\n\nWarum nicht, zeigt Ihnen das Video.",null,5,"Well, now we want to process the generated subtotals further. At the end we want to create a chart, because a picture says more than a thousand words (or numbers).\n\nFor this purpose we want to copy the subtotals to another place on our sheet in order to process them there. Unfortunately, this does not work with the usual copy&paste.\n\nThe video shows you, why not."]
[null,6,"Beim üblichen copy&paste werden also die ausgeblendeten Zeilen mit kopiert. Das können wir verhindern, wenn wir die sog. \"Office-Zwischenablage\" benutzen. Ich wette, die kennen Sie noch nicht!?\n\nSie wird unter \"Start / Zwischenablage\" geöffnet und hat drei Vorteile gegenüber der normalen Zwischenablage, die bei copy&paste benutzt wird:\n\n(1) Sie ist sichtbar. \n\n(2) Sie kann mehr als ein Objekt aufnehmen.\n\n(3) Sie ist in gewisser Weise \"intelligent\" - sie kopiert z.B. ausgeblendete Zeilen nicht mit.\n\nWir benutzen sie also jetzt, um die Teilergebnisse an eine andere Stelle zu kopieren.",null,6,"With the usual copy&paste, the hidden rows are also copied. We can prevent this by using the so-called \"Office clipboard\". I bet you haven't heard of it!?\n\nIt is opened under \"Start / Clipboard\" and has three advantages compared to the normal clipboard, which is used with copy&paste\n\n(1) It is visible. \n\n(2) It can hold more than one object.\n\n(3) It is \"intelligent\" in a certain way - for example, it does not copy hidden lines.\n\nNow we use it to copy the subtotals to another place."]
[null,7,"Jetzt stört uns noch das Wort \"Ergebnis\" hinter jedem Wert in der ersten Spalte. Ist es nur das Wort \"Ergebnis\"? Nein - es ist \" Ergebnis\"! Da ist nämlich noch ein Leerzeichen vor dem Wort \"Ergebnis\", das auch weg muss.\n\nWas sage ich immer? \"Ein Leerzeichen ist nicht nichts!\"\n\nDas machen wir einfach mit \"Suchen und Ersetzen\". Wir suchen nach \n\" Ergebnis\" und ersetzen es durch nichts.",null,7,"Now the word \"Total\" after each value in the first column still bothers us. Is it just the word \"Total\"? No - it is \" Total\"! There is a space before the word \"Total\", which must be removed.\n\nWhat do I always say? \"A space isn't nothing!\"\n\nThat's what we do with \"find&replace\". We search for \n\" Total\" and replace it with nothing."]
[null,8,"Abschließend wollen wir aus den Teilergebnissen ein Diagramm erstellen. Dazu ist es zwar nicht zwingend erforderlich aber bequemer, wenn sich die x- und y-Werte in unmittelbar benachbarten Spalten befinden. Also schieben wir die y-Werte nach links.\n\nWas Sie auf keinen Fall machen sollten: Einfach den ganzen Bereich inkl. der Leerzellen markieren und damit ein Diagramm erstellen! Das sieht zwar normal aus - Sie haben dann aber zwei leere Datenreihen im Diagramm.",null,8,"Finally, we want to create a chart from the subtotals. For this purpose, it is not absolutely necessary but more convenient if the x and y values are located in immediately adjacent columns. So we move the y-values to the left.\n\nWhat you should not do under any circumstances: Simply select the whole area including the empty cells and create a chart! This may look normal - but you will have two empty data series in the chart."]
[null,9,"Übungen zu Teilergebnissen finden Sie in meiner Datei Excel-Orders!",null,9,"You can find exercises for subtotals in my file Excel-Orders!"]
[null,"",null,null,""]
[null,"",null,null,""]
[null,"",null,null,""]
[null,"",null,null,""]
[null,""]

{"sheet":"07 Pivot (Daten)","index":18,"n_rows":38,"n_cols":15,"rows_kept":38,"cut":false,"hidden":false,"merged":[[29,9,29,12],[21,9,21,12],[30,9,30,12],[17,9,17,11],[1,1,1,4],[2,1,2,4],[26,9,26,12],[18,9,19,12],[27,9,28,12],[20,9,20,12]]}
[null,null,null,null,null,null,null,null,0]
[1,"07 Pivot (Data)",null,null,null,"Back to Start"]
[2,"07 Pivot (Daten)",null,null,null,"Startseite"]
[]
[1,null,"List = Data (=many numbers)",null,null,null,null,null,null,"PivotTable = Information (=few structered numbers)"]
[2,null,"Liste = Daten (=viele Zahlen)",null,null,null,null,null,null,"Pivot-Tabelle = Informationen (=wenige strukturierte Zahlen)"]
[]
[null,null,"branch","customer","quarter","sales","orders"]
[null,null,"Bremen","Esso",1,112536,92,null,null,"Summe von sales","quarter"]
[null,null,"Bremen","Esso",3,111525,89,null,null,"customer",1,2,3,4,"Gesamtergebnis"]
[null,null,"Bremen","Esso",4,124978,96,null,null,"Aral",69766,73223,74011,68577,285577]
[null,null,"Bremen","Esso",2,131845,90,null,null,"Esso",356426,356769,325524,124978,1163697]
[null,null,"Bremen","Shell",4,66745,138,null,null,"Shell",281725,274403,281757,281148,1119033]
[null,null,"Bremen","Shell",3,72436,127,null,null,"Gesamtergebnis",707917,704395,681292,474703,2568307]
[null,null,"Bremen","Shell",2,78647,120]
[null,null,"Bremen","Shell",1,80425,111]
[null,null,"Hamburg","Aral",3,35712,19]
[null,null,"Hamburg","Aral",1,38523,19,null,null,"All you need is …"]
[null,null,"Hamburg","Aral",4,32677,15,null,null,"… Information!"]
[null,null,"Hamburg","Aral",2,39467,17]
[null,null,"Hamburg","Esso",3,213999,119,null,null,"Managers make decisions!"]
[null,null,"Hamburg","Esso",2,224924,122,null,null,"Decisions are based on information!"]
[null,null,"Hamburg","Esso",1,243890,123]
[null,null,"Hamburg","Shell",1,78176,66]
[null,null,"Hamburg","Shell",3,88111,68]
[null,null,"Hamburg","Shell",2,82789,63]
[null,null,"Hamburg","Shell",4,94512,59,null,null,"Alles was Sie brauchen ist …"]
[null,null,"Oldenburg","Aral",1,31243,25,null,null,"… Informationen!"]
[null,null,"Oldenburg","Aral",2,33756,24]
[null,null,"Oldenburg","Aral",3,38299,21,null,null,"Führungskräfte fällen Entscheidungen!"]
[null,null,"Oldenburg","Aral",4,35900,19,null,null,"Entscheidungen basieren auf Informationen!"]
[null,null,"Oldenburg","Shell",2,112967,92]
[null,null,"Oldenburg","Shell",3,121210,98]
[null,null,"Oldenburg","Shell",4,119891,94]
[null,null,"Oldenburg","Shell",1,123124,88]
[]
[]
[0]

{"sheet":"07 Pivot (Daten)_","index":19,"n_rows":7,"n_cols":8,"rows_kept":7,"cut":false,"hidden":true,"merged":[]}
[null,2,2,2,1,1,1,0]
[1,"07 Pivot (Data)_",null,null,null,{"$f":"B2","v":"07 Pivot (Data)_"}]
[2,"07 Pivot (Daten)_"]
[0]
[null,1,"So, jetzt kommen wir also zu dem wichtigsten Inhalt dieser Übungsdatei - den Pivot-Tabellen. Falls Sie davon noch nie etwas gehört haben sollten, zeige ich Ihnen erste einmal eine solche. Wie sie erstellt wird, sehen wir später.\n\nHier auf diesem Blatt sehen Sie rechts neben der Originaltabelle, die Sie schon kennen, eine Pivot-Tabelle. Sie enthält dieselben Daten wie die Originaltabelle - nur in einem rechteckigen Schema zusammengefasst.\n\nSie erinnern sich, dass ich mal gesagt hatte, dass es in der Originaltabelle Kriterien- und Datenspalten gibt? Die Kriterienspalten finden Sie in der Pivot-Tabelle in den Zeilen und Spalten, die Daten aus den Datenspalten im Inneren der Pivot-Tabelle.",null,1,"Well, now we come to the most important content of this exercise file - the PivotTables. If you have never heard of them before, I will show you one of them for the first time. Later we will see, how it is created.\n\nHere on this sheet, you can see a PivotTable to the right of the original table that you already know. It contains the same data as the original table - only in a rectangular scheme.\n\nDo you remember that I once said that there are criteria and data columns in the original table? The criteria columns are located in the rows and columns of the PivotTable, the data from the data columns are located inside the PivotTable."]
[null,{"$f":"IF(C6<>\"\",B5+1,\"\")","v":2},"In der Originaltabelle gibt es drei Kriterienspalten (branch, customer, quarter) - in der Pivot-Tabelle aber nur Zeilen (customer) und Spalten (quarter). Wo ist das dritte Kriterium (branch)? Über das dritte Kriterium wird kumuliert (addiert).\n\nMit Shell wurden im 3. Quartal 281.148€ Umsatz gemacht. Das setzt sich zusammen aus 72.436€ in Bremen, 88.111€ in Hamburg und 121.210€ in Oldenburg.\n\nUm das zu überprüfen, machen Sie einfach einen Doppelklick in der entsprechenden Zelle der Pivot-Tabelle. Daraufhin legt Excel ein neues Blatt an und zeigt Ihnen dort, welche Daten zu dem Ergebnis in dieser Zelle geführt haben.\n\nWenn Sie später mit Pivot-Tabellen arbeiten, sollten Sie dieses Blatt löschen, wenn Sie es nicht mehr benötigen, um sich nicht mit solchen Blättern \"zuzumüllen\".\n\nHier in dieser Datei gibt es eine Besonderheit: Ich habe durch entsprechende VBA-Programmierung verhindert, dass neue Blätter angelegt werden. Die Blätter müssen nämlich wegen der Zweisprachigkeit ein bestimmtes Format haben. Daher sollen Sie neue Blätter nur als Kopien des Blattes \"Vorlage\" anlegen. Zum Anschauen der Datenherkunft in der Pivot-Tabelle reicht es aber.",null,{"$f":"IF(F6<>\"\",E5+1,\"\")","v":2},"In the original table there are three criteria columns (branch, customer, quarter) - but in the PivotTable there are only rows (customer) and columns (quarter). Where is the third criterion (branch)? The third criterion is used to cumulate (add).\n\nIn the 3rd quarter 281,148€ turnover was made with Shell. This is made up of 72,436€ in Bremen, 88,111€ in Hamburg and 121,210€ in Oldenburg.\n\nTo check this, simply double-click in the corresponding cell of the PivotTable. Excel will then create a new sheet and show you which data led to the result in this cell.\n\nIf you work with PivotTables later on, you should delete this sheet when you no longer need it in order to avoid getting \"cluttered\" with such sheets.\n\nHere in this file there is a special feature: I have prevented new sheets from being created by appropriate VBA programming. The sheets must have a certain format because of the bilingualism. Therefore you should only create new sheets as copies of the sheet \"Template\". But it is sufficient to view the data origin in the PivotTable."]
[null,{"$f":"IF(C7<>\"\",B6+1,\"\")","v":3},"Die Pivot-Tabelle zeigt einmal mehr, was ich mit dem Unterschied zwischen Daten und Informationen meine. Daten sind eine große, unstrukturierte Menge an Werten, die uns unverarbeitet nichts sagen. Informationen sind wenige, strukturierte Werte, aus denen wir eine Aussage entnehmen aus der wir wiederum Handlungsempfehlungen ableiten können:\n\n\"Der Umsatz mit Esso ist im 4. Quartal dramatisch eingebrochen. Wir müssen herauskriegen, warum das passiert ist.\"\n\nEin Doppelklick in der entsprechenden Zelle zeigt uns: Da gab es in Hamburg und Oldenburg gar keinen Umsatz! Dem müssen wir nachgehen! Wurden die Daten nur nicht erhoben? War die Filiale geschlossen?",null,{"$f":"IF(F7<>\"\",E6+1,\"\")","v":3},"The PivotTable shows once again what I mean by the difference between data and information. Data is a large, unstructured set of values that tells us nothing if it remains unprocessed. Information is a set of few, structured values, from which we take a statement from which we can derive recommendations for action:\n\n\"Sales with Esso fell dramatically in the fourth quarter. We have to find out why this happened.\"\n\nA double-click in the corresponding cell shows us: There was no sales at all in Hamburg and Oldenburg! We have to look into this! Was the data just not collected? Was the branche closed?"]

{"sheet":"08 Pivot (Tabelle)","index":20,"n_rows":147,"n_cols":9,"rows_kept":147,"cut":false,"hidden":false,"merged":[[140,2,141,8],[142,2,143,8],[1,1,1,4],[2,1,2,4],[123,2,124,8],[125,2,126,8],[136,2,136,8],[137,2,137,8],[95,2,97,8],[98,2,100,8]]}
[null,null,null,null,null,null,null,null,0]
[1,"08 Pivot (Table)",null,null,null,"Back to Start"]
[2,"08 Pivot (Tabelle)",null,null,null,"Startseite"]
[]
[2,"Voraussetzung"]
[2,"Erstellen"]
[1,"Precondition"]
[1,"Create"]
[]
[]
[]
[]
[]
[]
[]
[]
[]
[]
[]
[]
[]
[]
[]
[]
[]
[]
[]
[]
[]
[]
[]
[2,"Klass. Layout"]
[1,"Class. Layout"]
[]
[]
[]
[]
[]
[]
[]
[]
[]
[]
[]
[]
[]
[]
[]
[]
[]
[]
[]
[]
[]
[]
[]
[]
[]
[]
[]
[]
[]
[]
[]
[]
[]
[]
[]
[]
[]
[2,"PivotTable-Felder"]
[1,"PivotTable Fields"]
[]
[]
[]
[]
[]
[]
[]
[]
[]
[]
[]
[]
[]
[]
[]
[]
[]
[]
[]
[]
[]
[]
[]
[2,null,"Jetzt sehen Sie, worin die große Stärke einer Pivot-Tabelle besteht: \nSie bringt Übersichtlichkeit in Ihre Daten! Sie macht mit wenigen Mausklicks aus Daten (=viele Zahlen!) Informationen (=wenige Zahlen!)."]
[2]
[2]
[1,null,"Now you can see the big strength of a PivotTable: \nIt brings clearness to your data! With only some mouse clicks it transforms data (=many numbers) into information (=few numbers)."]
[1]
[1]
[]
[]
[2,"3. Dimension"]
[1,"3rd Dimension"]
[]
[null,null,"Summe von sales",null,"quarter"]
[null,null,"branch","customer",1,2,3,4,"Gesamtergebnis"]
[null,null,"Bremen","Esso",112536,131845,111525,124978,480884]
[null,null,null,"Shell",80425,78647,72436,66745,298253]
[null,null,"Bremen Ergebnis",null,192961,210492,183961,191723,779137]
[]
[null,null,"Hamburg","Aral",38523,39467,35712,32677,146379]
[null,null,null,"Esso",243890,224924,213999,null,682813]
[null,null,null,"Shell",78176,82789,88111,94512,343588]
[null,null,"Hamburg Ergebnis",null,360589,347180,337822,127189,1172780]
[]
[null,null,"Oldenburg","Aral",31243,33756,38299,35900,139198]
[null,null,null,"Shell",123124,112967,121210,119891,477192]
[null,null,"Oldenburg Ergebnis",null,154367,146723,159509,155791,616390]
[]
[null,null,"Gesamtergebnis",null,707917,704395,681292,474703,2568307]
[]
[2,"Übung 1","Probieren Sie verschiedene Möglichkeiten aus, mit den Daten vom Blatt \"Pivot (Daten)\" eine Pivot-Tabelle zu erzeugen!"]
[2]
[1,"Exercise 1","Try out different possibilities to generate a PivotTable with the data list from the worksheet \"Pivot (Data)\"!"]
[1]
[]
[]
[2,"Analysieren"]
[2,"Entwurf"]
[2,"Doppelklick"]
[1,"Analyse"]
[1,"Design"]
[1,"Double click"]
[]
[2,"Übung 2","Probieren Sie diese Techniken mit Ihrer Pivot-Tabelle aus!"]
[1,"Exercise 2","Try out these techniques with your PivotTable!"]
[]
[]
[1,"Exercise 3","Open the file \"Excel-Orders\", activate the sheet \"Exercises\" and answer the questions 7-9 using PivotTables!"]
[1]
[2,"Übung 3","Öffnen Sie die Datei \"Excel-Orders\", aktivieren Sie das Blatt \"Übungen\" und beantworten Sie die Fragen 7-9 unter Benutzung von Pivot-Tabellen!"]
[2]
[]
[]
[0]

{"sheet":"08 Pivot (Tabelle)_","index":21,"n_rows":15,"n_cols":8,"rows_kept":15,"cut":false,"hidden":true,"merged":[]}
[null,2,2,2,1,1,1,0]
[1,"08 Pivot (Table)_",null,null,null,{"$f":"B2","v":"08 Pivot (Table)_"}]
[2,"08 Pivot (Tabelle)_"]
[0]
[null,1,"Eine Pivot-Tabelle zu erstellen ist sehr einfach. Voraussetzung ist, dass Sie eine Liste mit Daten haben und dass die Spalten der Liste Überschriften haben. Wir verwenden die Liste vom Blatt \"Pivot (Daten)\". Klicken Sie eine einzelne Zelle innerhalb der Liste an!\n\nACHTUNG: Die Liste muss rundherum durch Leerzeilen und -spalten von anderen Daten abgegrenzt sein! Dann erkennt Excel selber, welche Daten für die Pivot-Tabelle benutzt werden sollen. Sie sollten sich angewöhnen, NICHT die gesamte Liste zu markieren. Das führt u.U. zu Fehlern. Es reicht, eine einzelne Zelle anzuklicken!",null,1,"It is very easy to create a PivotTable. All you need is a list of data with a header for each column. We will use the list from the worksheet \"Pivot (Data)\". Click into one cell within the list!\n\nATTENTION: The list must be surrounded by empty rows and columns! Then Excel recognizes automatically, which data shall be used for the PivotTable. Please don't mark the whole list! That may cause errors. It's enough, if you click into one single cell!"]
[null,{"$f":"IF(C6<>\"\",B5+1,\"\")","v":2},"Dann wählen Sie \"Einfügen / Tabellen / PivotTable\".\n\nDaraufhin passiert zweierlei:\n\n(1) Der Datenbereich wird durch eine farbige Linie markiert. Überprüfen Sie, ob Excel den Datenbereich richtig erkannt hat! Falls das nicht der Fall ist, kann die Ursache nur sein, dass sich links, rechts, über oder unter dem Datenbereich nicht-leere Zellen befinden.\n\n(2) Das Fenster \"PivotTable erstellen\" öffnet sich. Darin können Sie wählen, ob Sie die Pivot-Tabelle auf dem vorhandenen Blatt oder auf einem neuen Blatt anlegen wollen. Wir wählen \"Vorhandenes Arbeitsblatt\" und klicken auf \"OK\".\n\nJetzt sehen Sie ein Bild mit der symbolischen Darstellung einer Pivot-Tabelle.",null,{"$f":"IF(F6<>\"\",E5+1,\"\")","v":2},"Then select \"Insert / Tables / PivotTable\".\n\nThen two things will happen:\n\n(1) The range of data is marked with a colored line. Please check, if Excel has recognized the right range! If that is not the case, the only reason can be, that there are non-empty cells left, right, above or below the list.\n\n(2) The windows \"Create PivotTable\" opens. There you can select, if you want to create the PivotTable on the existing sheet or on a new sheet. We select \"Existing worksheet\" and click \"OK\".\n\nNow you can see picture with the symbolic presentation of a PivotTable."]
[null,{"$f":"IF(C7<>\"\",B6+1,\"\")","v":3},"Das ist die \"moderne\" Ansicht, die ich aber für schlechter halte als die alte (\"klassische\") Ansicht. Dankenswerterweise bietet Excel aber die Möglichkeit, dorthin zurück zu kehren.\n\nDazu klicken Sie mit der rechten Maustaste auf den Bereich mit dem Bild und wählen \n\n\"PivotTable-Optionen / Anzeige / Klassisches PivotTable-Layout\". \n\nDaraufhin sehen Sie eine Art virtuelle Pivot-Tabelle mit bisher noch leeren Bereichen, die Sie mit Drag&Drop sehr einfach füllen können.",null,{"$f":"IF(F7<>\"\",E6+1,\"\")","v":3},"This is the \"modern\" view, but I think it is worse than the old (\"classical\") view. Thankfully, Excel offers the possibility to return to this view.\n\nTo do so, right-click on the area with the image and select \n\n\"PivotTable Options / Display / Classic PivotTable Layout\". \n\nYou will then see a kind of a virtual PivotTable with preliminary empty areas that can be filled very easily using drag and drop."]
[null,{"$f":"IF(C8<>\"\",B7+1,\"\")","v":4},"Wenn Sie in den Bereich der Pivot-Tabelle hineinklicken, sehen Sie am rechten Fensterrand den Bereich \"PivotTable-Felder\". Sollte das nicht funktionieren, müssen Sie mit der rechten Maustaste in die Pivot-Tabelle klicken und \"Feldliste anzeigen\" auswählen.\n\nDort sehen Sie dann die Spaltenüberschriften der Liste, auf der Ihre Pivot-Tabelle beruht. Sie werden hier als \"PivotTable-Felder\" bezeichnet und Sie können sie jetzt einfach per Drag&Drop in die farblich umrandeten Bereiche der Pivot-Tabelle hineinziehen: \n\nKriterienspalten in die Zeilen- und Spaltenfelder, \nDatenspalten in die Mitte (\"Wertfelder\"). \n\nFertig!",null,{"$f":"IF(F8<>\"\",E7+1,\"\")","v":4},"If you click into the PivotTable area, you will see the \"PivotTable Fields\" side bar on the right side of the window. If this does not work, you must right-click in the pivot table and select \"Show field list\".\n\nThere you will see the column headings of the list which your PivotTable is based upon. They are called \"PivotTable Fields\" here and you can now simply drag and drop them into the color-coded areas of the PivotTable: \n\nCriteria columns into the row and column fields, \ndata columns into the middle (\"value fields\"). \n\nDone!"]
[null,{"$f":"IF(C9<>\"\",B8+1,\"\")","v":5},"In derselben Art und Weise können Sie auch mit den Listen rechts unten in der Feldliste arbeiten. Diese gehören zu der bereits erwähnten \"modernen\" Ansicht der Pivot-Tabelle.\n\nIch denke, jetzt sehen Sie deutlich, worin die große Stärke einer Pivot-Tabelle besteht:\n\nSie bringt Übersichtlichkeit in Ihre Daten! Sie macht mit wenigen Mausklicks aus Daten (=viele Zahlen!) Informationen (=wenige Zahlen!).",null,{"$f":"IF(F9<>\"\",E8+1,\"\")","v":5},"In the same way, you can also work with the lists at the bottom right of the field list. They belong to the \"modern\" view of the PivotTable mentioned above.\n\nI think now you can clearly see what the great strength of a PivotTable is:\n\nIt brings clarity to your data! It turns data (=many numbers!) into information (=few numbers!) with a few mouse clicks."]
[null,6,"Die Pivot-Tabelle ist zunächst eine zweidimensionale Darstellung von Daten. Damit kann z.B. die Frage beantwortet werden: \n     \"Welchen Umsatz haben wir pro Kunde und Quartal gemacht?\".\n\nEs kann aber auch dreidimensionale Fragen geben: \n     \"Welchen Umsatz haben wir pro Kunde, Quartal und Niederlassung gemacht?\". \n\nDie dritte Dimension der Fragestellung kann man \n\nENTWEDER per Drag&Drop ins Berichtsfilterfeld (zwei Zeilen über der Pivot-Tabelle) \n\nODER rechts neben ein bereits vorhandenes Zeilenfeld ziehen (Untergruppierung der Zeilen). \n\nEine Untergruppierung der Spalten ist auch möglich - aber selten sinnvoll, da die Pivot-Tabelle dann sehr breit und damit unübersichtlich wird.",null,6,"First of all the PivotTable is a two-dimensional presentation of data. Then you can answer questions like\n     \"Which turnover did we made per customer and quarter?\"\n\nBut also three-dimensional questions are possible:\n     \"Which turnover did we made per customer, quarter and branch?\"\n\nThe third dimension of the question may be dragged \n\nEITHER into the report filter field (two rows above the PivotTable) \n\nOR right to an existing row field (as a sub-group of the row). \n\nA sub-grouping of the columns is also possible, but rarely useful, because the PivotTable becomes very boad and confusing then."]
[null,7,"Sie können die Pivot-Tabelle auch nach ihrer Erstellung noch beliebig umsortieren.\n\nBitte probieren Sie jetzt verschiedene Möglichkeiten aus, mit den Daten vom Blatt \"Pivot (Daten)\" eine Pivot-Tabelle zu erzeugen!\n\nUmfangreichere Datenlisten und Übungen finden Sie in der Datei \"Excel-Orders\"!",null,7,"You can re-sort the PivotTable as you wish even after its creation.\n\nPlease try out different ways to create a PivotTable with the data from the \"Pivot (Data)\" sheet!\n\nMore extensive data lists and exercises can be found in the file \"Excel-Orders\"!"]
[null,8,"Wenn Sie in die Pivot-Tabelle hinein klicken, erscheint ein neues Menü \"PivotTable-Tools\" mit zwei Untermenüs: \"Analysieren\" und \"Entwurf\". Dort gibt es zahlreiche Möglichekeiten, weiter mit der Pivot-Tabelle zu arbeiten. Einige der wichtigsten sollen hier kurz erläutert werden.\n\n\"PivotTable-Tools / Analysieren\":\n--------------------------------------------\n\n\"Aktives Feld\" / \"Feldeinstellungen\" / \"Wertfeld zusammenfassen nach\"\nACHTUNG: Was man hier tun kann, hängt davon ab, welches Feld man vorher in der Pivot-Tabelle angeklickt hat! (\"Aktives Feld\"!)\n\n\"Daten\" / \"Aktualisieren\"\nACHTUNG: Wenn Sie Daten in der Liste verändern, die der Pivot-Tabelle zugrunde liegt, müssen Sie die Pivot-Tabelle hinterher aktualisieren!\n  \n\"Daten\" / \"Datenquelle ändern\"\nACHTUNG: Wenn Sie Zeilen oder Spalten zu der Liste hinzufügen oder entfernen, müssen Sie hinterher die Datenquelle ändern!  \n\n\"Aktionen\" / \"PivotTable verschieben\"\n... klar!",null,8,"When you click inside the PivotTable, a new menu \"PivotTable-Tools\" appears with two submenus: \"Analyse\" and \"Design\". There are many ways to continue working with the PivotTable. Some of the most important ones will be briefly explained here.\n\n\"PivotTable-Tools / Analyze\":\n--------------------------------------\n\n\"Active Field\" / \"Field Settings\" / \"Summarize values field by\"\nATTENTION: What you can do now, depends on which filed you have clicked in the PivotTable before! (\"Active Field\"!)\n\n\"Data\" / \"Refresh\"\nATTENTION: If you change the data in the list which the PivotTable is based on, you have to refresh it afterwards!\n\n\"Data\" / \"Change Data Source\"\nATTENTION: If you add or remove columns or rows from the list, you have to change the data source afterwards!\n\n\"Actions\" / \"Move PivotTable\"\n... obvious!"]
[null,9," \"PivotTable-Tools / Entwurf\":\n---------------------------------------\n\n\"Layout\" / \"Teilergebnisse\"\n… einfach ausprobieren!\n\n\"Layout\" / \"Gesamtergebnisse\"\n… einfach ausprobieren!\n\n\"PivotTable-Formate\"\n… einfach ausprobieren!",null,9,"\"PivotTable-Tools\" / Design\":\n---------------------------------------\n\n\"Design\" / \"Subtotals\"\n… simply try it!\n\n\"Design\" / \"Grand Totals\"\n… simply try it!\n\n\"PivotTable Styles\"\n… simply try it!"]
[null,10,"Zu guter Letzt nochmal der Hinweis:\n\nWenn Sie doppelt auf eine Zelle in der Pivot-Tabelle klicken, wird ein neues Blatt angelegt, das Ihnen zeigt, wie der Wert in der angeklickten Zelle zustande gekommen ist.\n\nHier in dieser Datei gibt es eine Besonderheit: Ich habe durch entsprechende VBA-Programmierung verhindert, dass neue Blätter angelegt werden. Die Blätter müssen nämlich wegen der Zweisprachigkeit ein bestimmtes Format haben. Daher sollen Sie neue Blätter nur als Kopien des Blattes \"Vorlage\" anlegen. Zum Anschauen der Datenherkunft in der Pivot-Tabelle reicht es aber.",null,10,"Last but not least, let me remind you:\n\nIf you double-click on a cell in the PivotTable, a new sheet is created showing you how the value in the clicked cell was calculated.\n\nHere in this file there is a special feature: I have prevented new sheets from being created by appropriate VBA programming. The sheets must have a certain format because of the bilingualism. Therefore you should only create new sheets as copies of the sheet \"Template\". However, it is sufficient to look at the data origin in the PivotTable."]
[null,11,"Übungen:\n\n(1) Probieren Sie diese Techniken hier mit dieser kleinen Pivot-Tabelle aus!\n\n(2) Öffnen Sie die Datei \"Excel-Orders\", aktivieren Sie das Blatt \"Übungen\" und beantworten Sie die Fragen 7-9 unter Benutzung von Pivot-Tabellen!",null,11,"Exercises:\n\n(1) Try out these techniques here with this little PivotTable!\n\n(2) Open the file \"Excel-Orders\", activate the sheet \"Exercises\" and answer questions 7-9 using PivotTables!"]

{"sheet":"09 Pivot (Tipps&Tricks)","index":22,"n_rows":61,"n_cols":9,"rows_kept":61,"cut":false,"hidden":false,"merged":[[31,2,34,8],[36,2,38,8],[1,1,1,4],[2,1,2,4],[9,2,10,8],[5,2,6,8]]}
[null,null,null,null,null,0]
[1,"09 Pivot (Tipps&Tricks)",null,null,null,"Back to Start"]
[2,"09 Pivot (Tipps&Tricks)",null,null,null,"Startseite"]
[]
[2,"Elemente ohne Daten"]
[2,null,"In unserem Beispiel wurde in Bremen kein Umsatz mit Aral erzielt. Infolgedessen erscheint in der Pivot-Tabelle unter \"Bremen\" keine Zeile \"Aral\":"]
[2]
[]
[1,"Items with no data"]
[1,null,"In our example there are no sales in Bremen with Aral. Therefore, there is no row \"Aral\" at \"Bremen\":"]
[1]
[]
[]
[]
[]
[]
[]
[]
[]
[]
[]
[]
[]
[]
[]
[]
[]
[]
[]
[]
[]
[2,null,"Falls trotzdem unter \"branch\" immer alle \"customer\" angezeigt werden sollen, so können Sie das folgendermaßen einstellen:\nDoppelklick auf die Spaltenüberschrift \"customer\" und \"Layout & Drucken / Elemente ohne Daten anzeigen\""]
[2]
[2]
[2]
[]
[1,null,"If you want to see always all the customers for each of the branches, you can do this as follows:\ndouble click on the column heading \"customer\" and \"Layout & Print / Show items with no data\""]
[1]
[1]
[]
[]
[null,null,"Summe von sales",null,"quarter"]
[null,null,"branch","customer",1,2,3,4,"Gesamtergebnis"]
[null,null,"Bremen","Aral"]
[null,null,null,"Esso",112536,131845,111525,124978,480884]
[null,null,null,"Shell",80425,78647,72436,66745,298253]
[null,null,"Bremen Ergebnis",null,192961,210492,183961,191723,779137]
[null,null,"Hamburg","Aral",38523,39467,35712,32677,146379]
[null,null,null,"Esso",243890,224924,213999,null,682813]
[null,null,null,"Shell",78176,82789,88111,94512,343588]
[null,null,"Hamburg Ergebnis",null,360589,347180,337822,127189,1172780]
[null,null,"Oldenburg","Aral",31243,33756,38299,35900,139198]
[null,null,null,"Esso"]
[null,null,null,"Shell",123124,112967,121210,119891,477192]
[null,null,"Oldenburg Ergebnis",null,154367,146723,159509,155791,616390]
[null,null,"Gesamtergebnis",null,707917,704395,681292,474703,2568307]
[]
[]
[]
[]
[0]

{"sheet":"10 Pivot (Datenschnitte)","index":23,"n_rows":66,"n_cols":18,"rows_kept":66,"cut":false,"hidden":false,"merged":[[1,1,1,4],[2,1,2,4],[44,2,44,8],[45,2,45,8]]}
[null,null,null,null,null,null,null,null,null,null,null,null,null,null,null,null,null,0]
[1,"10 Pivot (Slicer)",null,null,null,"Back to Start"]
[2,"10 Pivot (Datenschnitte)",null,null,null,"Startseite"]
[]
[null,null,"branch","customer","quarter","sales","orders"]
[null,null,"Bremen","Esso",1,112536,92]
[null,null,"Bremen","Esso",3,111525,89]
[null,null,"Bremen","Esso",4,124978,96]
[null,null,"Bremen","Esso",2,131845,90]
[null,null,"Bremen","Shell",4,66745,138]
[null,null,"Bremen","Shell",3,72436,127]
[null,null,"Bremen","Shell",2,78647,120]
[null,null,"Bremen","Shell",1,80425,111]
[null,null,"Hamburg","Aral",3,35712,19]
[null,null,"Hamburg","Aral",1,38523,19]
[null,null,"Hamburg","Aral",4,32677,15]
[null,null,"Hamburg","Aral",2,39467,17]
[null,null,"Hamburg","Esso",3,213999,119]
[null,null,"Hamburg","Esso",2,224924,122]
[null,null,"Hamburg","Esso",1,243890,123]
[null,null,"Hamburg","Shell",1,78176,66]
[null,null,"Hamburg","Shell",3,88111,68]
[null,null,"Hamburg","Shell",2,82789,63]
[null,null,"Hamburg","Shell",4,94512,59]
[null,null,"Oldenburg","Aral",1,31243,25]
[null,null,"Oldenburg","Aral",2,33756,24]
[null,null,"Oldenburg","Aral",3,38299,21]
[null,null,"Oldenburg","Aral",4,35900,19]
[null,null,"Oldenburg","Shell",2,112967,92]
[null,null,"Oldenburg","Shell",3,121210,98]
[null,null,"Oldenburg","Shell",4,119891,94]
[null,null,"Oldenburg","Shell",1,123124,88]
[]
[]
[null,null,"Summe von sales",null,"quarter"]
[null,null,"branch","customer",1,2,3,4]
[null,null,"Bremen","Esso",112536,131845,111525,124978]
[null,null,null,"Shell",80425,78647,72436,66745]
[null,null,"Hamburg","Aral",38523,39467,35712,32677]
[null,null,null,"Esso",243890,224924,213999]
[null,null,null,"Shell",78176,82789,88111,94512]
[null,null,"Oldenburg","Aral",31243,33756,38299,35900]
[null,null,null,"Shell",123124,112967,121210,119891]
[]
[2,"Einfügen"]
[1,"Insert"]
[]
[]
[]
[]
[]
[]
[]
[]
[]
[]
[]
[]
[]
[]
[]
[2,"Ziel"]
[1,"Objective"]
[]
[]
[0]

{"sheet":"10 Pivot (Datenschnitte)_","index":24,"n_rows":7,"n_cols":8,"rows_kept":7,"cut":false,"hidden":true,"merged":[]}
[null,2,2,2,1,1,1,0]
[1,"10 Pivot (Slicer)_",null,null,null,{"$f":"B2","v":"10 Pivot (Slicer)_"}]
[2,"10 Pivot (Datenschnitte)_"]
[0]
[null,1,"Datenschnitte sind eine schicke Ergänzung der Pivot-Tabellen. Sie haben eine qualitative und eine quantitative Aussage. Lassen Sie uns zunächst Datenschnitte einfügen und dann schauen, was wir damit machen können.\n\nKlick in die Pivottabelle und \"Pivottable-Tools / Analysieren / Filtern / Datenschnitt einfügen\"\n\ndann:\n\n-  \"branch\", \"customer\" und \"quarter\" auswählen\n-  Rechtsklick in einen Datenschnitt / \"Datenschnitteinstellungen\"\n\n",null,1,"Slicers are a fancy addition to the PivotTables. They have a qualitative and a quantitative message. Let's first insert data slicers and then see what we can do with them.\n\nClick into the PivotTable and \"PivotTable-Tools / Analyze / Filter / Insert Slicer\"\n\nthen\n\n-  select \"branch\", \"customer\" and \"quarter\"\n-  right click into a slicer /\"Slicer Settings\"\n\n"]
[null,{"$f":"IF(C6<>\"\",B5+1,\"\")","v":2},"Zur QUANTITATIVEN Aussage der Datenschnitte:\n\nSie dienen quasi der \"intuitiven Filterung\" der Pivot-Tabelle. Mit jedem Klick in einen Datenschnitt verändert sich die Pivot-Tabelle.\n\nDabei addieren sich die Filter. Wenn Sie also in \"branch\" Bremen anklicken und in \"customer\" Shell, zeigt die Pivot-Tabelle alle Umsätze mit Shell in Bremen.\n\nMit den Buttons rechts oben im Datenschnitt können Sie eine Mehrfachauswahl treffen bzw. den Filter wieder löschen.\n\n",null,{"$f":"IF(F6<>\"\",E5+1,\"\")","v":2},"Concerning the QUANTITATIVE message of the slicers:\n\nThey serve quasi as \"intuitive filtering\" of the PivotTable. With each click in a slicer the PivotTable changes.\n\nThe filters add up in the process. So if you click on Bremen in \"branch\" and Shell in \"customer\", the PivotTable shows all sales with Shell in Bremen.\n\nWith the buttons at the top right of the slicers you can make a multiple selection or delete the filter."]
[null,{"$f":"IF(C7<>\"\",B6+1,\"\")","v":3},"Zur QUALITATIVEN Aussage der Datenschnitte:\n\nSie können auch ohne die Pivot-Tabelle eine qualitative Aussage aus den Datenschnitten gewinnen. Wenn Sie nämlich\n\n-  auf \"Bremen\" klicken, sehen Sie, dass es dort keinen Umsatz mit Aral gibt\n-  auf \"Hamburg\" und \"Esso\" klicken, sehen Sie, dass es dort keinen Umsatz im 4. Quartal gibt\n-  auf \"Oldenburg\" klicken, sehen Sie, dass es dort keinen Umsatz mit Esso gibt.\n\nSie bekommen also eine Antwort auf die Frage \"Zu welchen Daten in Spalte X gibt es Daten in Spalte Y?\". Das ist in unserer kleinen Beispieltabelle natürlich banal - kann aber in einer komplexeren Tabelle sehr interessant sein - z.B.:\n\n\"In welcher Region wird Produkt X verkauft?\"\n\"Welche Mitarbeiter bedienen den Kunden Y?\"\n\"Welche Häfen fährt Schiff Z an?\"",null,{"$f":"IF(F7<>\"\",E6+1,\"\")","v":3},"Concerning the QUALITATIVE message of the slicers:\n\nYou can obtain a qualitative message from the slicers even without the PivotTable. If you\n\n- click on \"Bremen\", you will see that there is no turnover with Aral\n- click on \"Hamburg\" and \"Esso\", you will see that there is no turnover in the 4th quarter\n- click on \"Oldenburg\", you will see that there are no Esso sales.\n\nSo you get an answer to the question \"For which data in column X there are data in column Y?\" This is of course banal in our small example table - but can be very interesting in a more complex table - e.g:\n\n\"In which region product X is sold?\"\n\"Which employees serve customer Y?\"\n\"Which ports does ship Z call at?\""]

{"sheet":"11 Pivot (Berechnetes Feld)","index":25,"n_rows":88,"n_cols":10,"rows_kept":88,"cut":false,"hidden":false,"merged":[[1,1,1,4],[2,1,2,4],[49,2,49,8],[50,2,50,8]]}
[null,null,null,null,null,null,null,null,null,0]
[1,"11 Pivot (Calculated Field)",null,null,null,"Back to Start"]
[2,"11 Pivot (Berechnetes Feld)",null,null,null,"Startseite"]
[]
[null,null,"branch","customer","quarter","sales","orders"]
[null,null,"Bremen","Esso",1,112536,92]
[null,null,"Bremen","Esso",3,111525,89]
[null,null,"Bremen","Esso",4,124978,96]
[null,null,"Bremen","Esso",2,131845,90]
[null,null,"Bremen","Shell",4,66745,138]
[null,null,"Bremen","Shell",3,72436,127]
[null,null,"Bremen","Shell",2,78647,120]
[null,null,"Bremen","Shell",1,80425,111]
[null,null,"Hamburg","Aral",3,35712,19]
[null,null,"Hamburg","Aral",1,38523,19]
[null,null,"Hamburg","Aral",4,32677,15]
[null,null,"Hamburg","Aral",2,39467,17]
[null,null,"Hamburg","Esso",3,213999,119]
[null,null,"Hamburg","Esso",2,224924,122]
[null,null,"Hamburg","Esso",1,243890,123]
[null,null,"Hamburg","Shell",1,78176,66]
[null,null,"Hamburg","Shell",3,88111,68]
[null,null,"Hamburg","Shell",2,82789,63]
[null,null,"Hamburg","Shell",4,94512,59]
[null,null,"Oldenburg","Aral",1,31243,25]
[null,null,"Oldenburg","Aral",2,33756,24]
[null,null,"Oldenburg","Aral",3,38299,21]
[null,null,"Oldenburg","Aral",4,35900,19]
[null,null,"Oldenburg","Shell",2,112967,92]
[null,null,"Oldenburg","Shell",3,121210,98]
[null,null,"Oldenburg","Shell",4,119891,94]
[null,null,"Oldenburg","Shell",1,123124,88]
[]
[null,null,"customer","(Alle)"]
[]
[null,null,null,null,"branch"]
[null,null,"quarter","Werte","Bremen","Hamburg","Oldenburg","Gesamtergebnis"]
[null,null,1,"Total Sales",192961,360589,154367,707917]
[null,null,null,"Summe von sales per order",950.54679802955661,1733.6009615384614,1366.0796460176991,1350.9866412213742]
[null,null,2,"Total Sales",210492,347180,146723,704395]
[null,null,null,"Summe von sales per order",1002.3428571428572,1718.7128712871288,1264.8534482758621,1334.0814393939395]
[null,null,3,"Total Sales",183961,337822,159509,681292]
[null,null,null,"Summe von sales per order",851.6712962962963,1639.9126213592233,1340.4117647058824,1259.3197781885397]
[null,null,4,"Total Sales",191723,127189,155791,474703]
[null,null,null,"Summe von sales per order",819.32905982905982,1718.7702702702702,1378.6814159292035,1127.560570071259]
[null,null,"Gesamt: Total Sales",null,779137,1172780,616390,2568307]
[null,null,"Gesamt: Summe von sales per order",null,902.82387022016223,1699.6811594202898,1337.0715835140998,1275.2269116186694]
[]
[]
[2,"Einfügen"]
[1,"Insert"]
[]
[]
[]
[]
[]
[]
[]
[]
[]
[]
[]
[]
[]
[]
[]
[]
[]
[]
[]
[]
[]
[]
[]
[]
[]
[]
[]
[]
[]
[]
[]
[]
[]
[]
[]
[]
[0]

{"sheet":"11 Pivot (Berechnetes Feld)_","index":26,"n_rows":9,"n_cols":8,"rows_kept":9,"cut":false,"hidden":true,"merged":[]}
[null,2,2,2,1,1,1,0]
[1,"11 Pivot (Calculated Field)_",null,null,null,{"$f":"B2","v":"11 Pivot (Calculated Field)_"}]
[2,"11 Pivot (Berechnetes Feld)_"]
[0]
[null,1,"Sie hatten bei der Erstellung der Pivot-Tabelle schon gesehen, dass aus den Spaltenüberschriften der Originaltabelle PivotTable-Felder werden, die man per Drag&Drop in die Pivot-Tabelle hinein ziehen kann.\n\nAndere Felder kann es also nicht geben? Doch!\n\nSie können sich aus den vorhandenen Feldern neue Felder berechnen - im vorliegenden Fall z.B., indem Sie \"sales\" durch \"orders\" teilen und sich so den mittleren Wert einer Bestellung ausrechnen.",null,1,"When you created the PivotTable, you had already seen that the column headings of the original table become PivotTable fields that you can drag and drop into the PivotTable.\n\nSo there can be no other fields? Yes, there are!\n\nYou can calculate new fields from the existing fields - in this case, for example, by dividing \"sales\" by \"orders\" and thus calculating the average value of an order."]
[null,{"$f":"IF(C6<>\"\",B5+1,\"\")","v":2},"Dazu machen Sie folgendes:\n\nKlick in die Pivottabelle und \"Pivottable-Tools / Analysieren / Berechnungen / Felder, Elemente und Gruppen / Berechnetes Feld\"\n\nHier geben Sie die Berechnungsformel ein. \n\nACHTUNG: Die Formel für die Feldberechnung kann nur\n-  Bezüge auf Felder der Pivot-Tabelle (hier: branch, customer und quarter) und \n-  konstante Werte \n\nenthalten, aber keine Bezüge auf andere Zellen des Arbeitsblattes!\n\nDas berechnete Feld taucht anschließend in der Feldliste auf und kann in den Wertebereich gezogen werden.\n\nDessen Beschriftung \"Summe von sales per order\" ist irreführend und sollte geändert werden (Rechtsklick + \"Wertfeldeinstellungen\").",null,{"$f":"IF(F6<>\"\",E5+1,\"\")","v":2},"To do this, you need to do the following:\n\nClick into the PivotTable + \"Pivottable-Tools / Analyze / Calculations / Fields, Items & Sets / Calculated Field\"                                                                                                                          Here you enter the calculation formula. \n\nATTENTION: The formula for the field calculation can only contain\n- references to fields in the PivotTable (here: branch, customer and quarter) and \n- constant values\n\nbut no references to other cells of the worksheet!\n\nThe calculated field then appears in the field list and can be dragged into the value range.\n\nIts label \"Sum of sales per order\" is misleading and should be changed (right click + \"Value field settings\")."]
[null,{"$f":"IF(C7<>\"\",B6+1,\"\")","v":3},"Da die Pivot-Tabelle jetzt etwas unübersichtlich geworden ist, greifen wir in die Trickkiste und färben die Zeilen unterschiedlich. Zum Markieren müssen Sie nur an den linken Rand einer Zelle klicken. Beachten Sie dabei die Veränderung der Cursorform!",null,{"$f":"IF(F7<>\"\",E6+1,\"\")","v":3},"Since the PivotTable has now become a bit confusing, we'll use our bag of tricks and color the rows differently. To select, you only need to click on the left edge of a cell. Note the change of the cursor shape!"]
[null,{"$f":"IF(C8<>\"\",B7+1,\"\")","v":""},null,null,{"$f":"IF(F8<>\"\",E7+1,\"\")","v":""}]
[null,""]

{"sheet":"12 Pivot (Berechnetes Element)","index":27,"n_rows":57,"n_cols":9,"rows_kept":57,"cut":false,"hidden":false,"merged":[[1,1,1,4],[2,1,2,4]]}
[]
[1,"12 Pivot (Calculated Item)",null,null,null,"Back to Start"]
[2,"12 Pivot (Berechnetes Element)",null,null,null,"Startseite"]
[]
[]
[null,null,"branch","customer","quarter","sales","orders"]
[null,null,"Bremen","Shell",4,66745,138]
[null,null,"Bremen","Shell",3,72436,127]
[null,null,"Bremen","Shell",2,78647,120]
[null,null,"Bremen","Shell",1,80425,111]
[null,null,"Bremen","Esso",1,112536,92]
[null,null,"Bremen","Esso",3,111525,89]
[null,null,"Bremen","Esso",4,124978,96]
[null,null,"Bremen","Esso",2,131845,90]
[null,null,"Hamburg","Shell",1,78176,66]
[null,null,"Hamburg","Shell",3,88111,68]
[null,null,"Hamburg","Shell",2,82789,63]
[null,null,"Hamburg","Shell",4,94512,59]
[null,null,"Hamburg","Esso",3,213999,119]
[null,null,"Hamburg","Esso",2,224924,122]
[null,null,"Hamburg","Aral",3,35712,19]
[null,null,"Hamburg","Esso",1,243890,123]
[null,null,"Hamburg","Aral",1,38523,19]
[null,null,"Hamburg","Aral",4,32677,15]
[null,null,"Hamburg","Aral",2,39467,17]
[null,null,"Oldenburg","Shell",2,112967,92]
[null,null,"Oldenburg","Shell",3,121210,98]
[null,null,"Oldenburg","Aral",1,31243,25]
[null,null,"Oldenburg","Shell",4,119891,94]
[null,null,"Oldenburg","Shell",1,123124,88]
[null,null,"Oldenburg","Aral",2,33756,24]
[null,null,"Oldenburg","Aral",3,38299,21]
[null,null,"Oldenburg","Aral",4,35900,19]
[]
[]
[]
[]
[]
[null,null,"total sales","quarter"]
[null,null,"branch",1,2,3,4,"increase 2nd half","Gesamtergebnis"]
[null,null,"Bremen",192961,210492,183961,191723,0.93117166063952928,779137.93117166066]
[null,null,"Hamburg",360589,347180,337822,127189,0.6570095610290928,1172780.6570095611]
[null,null,"Oldenburg",154367,146723,159509,155791,1.0471951908067356,616391.0471951908]
[null,null,"Gesamtergebnis",707917,704395,681292,474703,2.6353764124753578,2568309.6353764124]
[]
[2,null,null,null,null,null,null,"Achtung: \"Gesamtergebnis\" ist sinnlos!"]
[1,null,null,null,null,null,null,"Attention: \"Grand total\" is nonsense!"]
[]
[2,"Einfügen"]
[1,"Insert"]
[]
[]
[]
[]
[]
[]
[0]

{"sheet":"12 Pivot (Berechnetes Element)_","index":28,"n_rows":7,"n_cols":8,"rows_kept":7,"cut":false,"hidden":true,"merged":[]}
[null,2,2,2,1,1,1,0]
[1,"12 Pivot (Calculated Item)_",null,null,null,{"$f":"B2","v":"12 Pivot (Calculated Item)_"}]
[2,"12 Pivot (Berechnetes Element)_"]
[0]
[null,1,"Neben dem berechneten Feld gibt es auch noch das berechnete Element. Warum sich Microsoft das ausgedacht hat, ist mir ehrlich gesagt, auch nicht ganz klar. Im Endeffekt sieht es dann nämlich genauso aus wie das berechnete Feld.\n\nDazu machen Sie folgendes:\n\nKlick auf \"quarter\" in der Pivot-Tabelle + \"Pivottable-Tools / Analysieren / Berechnungen / Felder, Elemente und Gruppen / Berechnetes Element\"\n\nACHTUNG: Wenn Sie vorher die falsche Zelle angeklickt haben (also nicht \"quarter\"), ist \"Berechnetes Feld\" deaktiviert!\n\n",null,1,"Besides the calculated field there is also the calculated element. Why Microsoft came up with this is, to be honest, not quite clear to me either. In the end it looks exactly like the calculated field.\n\nYou can do the following:\n\nClick on \"quarter\" in the PivotTable + \"Pivottable-Tools / Analyze / Calculations / Fields, Items & Sets / Calculated Item\"                                                            \n\nATTENTION: If you have previously clicked on the wrong cell (i.e. not \"quarter\"), \"Calculated Item\" is disabled! "]
[null,{"$f":"IF(C6<>\"\",B5+1,\"\")","v":2},"Im Beispiel wollen wir mal berechnen, wie sich der Umsatz des zweiten Halbjahres zum Umsatz des ersten Halbjahres verhält: ('3'+'4')/('1'+'2')\n\nDas berechnete Element ist anschließend ein weiteres Element desjenigen Feldes, für das es berechnet wurde - z.B. ist \"increase 2nd half\" ein Element von \"quarter\" zusätzlich zu \"1\", \"2\", \"3\" und \"4\", weil wir \"quarter\" angeklickt hatten, bevor wir die Funktion \"Berechnetes Element\" aufgerufen haben.\n\nEs erscheint in der Pivottabelle, wenn das entsprechende Feld (z.B. \"quarter\") hineingezogen wird.\n\nACHTUNG: Alle Zeilensummen und die ganz rechte Spaltensumme sind jetzt sinnlos, denn man kann nicht Euros und Prozent addieren!",null,{"$f":"IF(F6<>\"\",E5+1,\"\")","v":2},"In the example we want to calculate how the sales of the second half of the year relate to the sales of the first half of the year: ('3'+'4')/('1'+'2')\n\nThe calculated element is then another element of the field for which it was calculated - e.g. \"increase 2nd half\" is an element of \"quarter\" in addition to \"1\", \"2\", \"3\" and \"4\" because we clicked \"quarter\" before we called the \"Calculated Item\" function.\n\nIt appears in the PivotTable when the corresponding field (e.g. \"quarter\") is dragged in.\n\nATTENTION: All row sums and the rightmost column sum are now useless, because you cannot add Euros and percent!"]
[null,{"$f":"IF(C7<>\"\",B6+1,\"\")","v":""},null,null,{"$f":"IF(F7<>\"\",E6+1,\"\")","v":""}]

{"sheet":"13 Pivot (Diagramm)","index":29,"n_rows":99,"n_cols":8,"rows_kept":99,"cut":false,"hidden":false,"merged":[[65,2,65,8],[67,3,73,8],[1,1,1,4],[2,1,2,4],[56,2,56,8],[58,3,64,8]]}
[]
[1,"13 Pivot (Chart)",null,null,null,"Back to Start"]
[2,"13 Pivot (Diagramm)",null,null,null,"Startseite"]
[]
[]
[null,null,"branch","customer","quarter","sales","orders"]
[null,null,"Bremen","Shell",4,66745,138]
[null,null,"Bremen","Shell",3,72436,127]
[null,null,"Bremen","Shell",2,78647,120]
[null,null,"Bremen","Shell",1,80425,111]
[null,null,"Bremen","Esso",1,112536,92]
[null,null,"Bremen","Esso",3,111525,89]
[null,null,"Bremen","Esso",4,124978,96]
[null,null,"Bremen","Esso",2,131845,90]
[null,null,"Hamburg","Shell",1,78176,66]
[null,null,"Hamburg","Shell",3,88111,68]
[null,null,"Hamburg","Shell",2,82789,63]
[null,null,"Hamburg","Shell",4,94512,59]
[null,null,"Hamburg","Esso",3,213999,119]
[null,null,"Hamburg","Esso",2,224924,122]
[null,null,"Hamburg","Aral",3,35712,19]
[null,null,"Hamburg","Esso",1,243890,123]
[null,null,"Hamburg","Aral",1,38523,19]
[null,null,"Hamburg","Aral",4,32677,15]
[null,null,"Hamburg","Aral",2,39467,17]
[null,null,"Oldenburg","Shell",2,112967,92]
[null,null,"Oldenburg","Shell",3,121210,98]
[null,null,"Oldenburg","Aral",1,31243,25]
[null,null,"Oldenburg","Shell",4,119891,94]
[null,null,"Oldenburg","Shell",1,123124,88]
[null,null,"Oldenburg","Aral",2,33756,24]
[null,null,"Oldenburg","Aral",3,38299,21]
[null,null,"Oldenburg","Aral",4,35900,19]
[]
[]
[]
[null,null,"total sales",null,"customer"]
[null,null,"branch","quarter","Aral","Esso","Shell","Gesamtergebnis"]
[null,null,"Bremen",1,null,112536,80425,192961]
[null,null,null,2,null,131845,78647,210492]
[null,null,null,3,null,111525,72436,183961]
[null,null,null,4,null,124978,66745,191723]
[null,null,"Bremen Ergebnis",null,null,480884,298253,779137]
[null,null,"Hamburg",1,38523,243890,78176,360589]
[null,null,null,2,39467,224924,82789,347180]
[null,null,null,3,35712,213999,88111,337822]
[null,null,null,4,32677,null,94512,127189]
[null,null,"Hamburg Ergebnis",null,146379,682813,343588,1172780]
[null,null,"Oldenburg",1,31243,null,123124,154367]
[null,null,null,2,33756,null,112967,146723]
[null,null,null,3,38299,null,121210,159509]
[null,null,null,4,35900,null,119891,155791]
[null,null,"Oldenburg Ergebnis",null,139198,null,477192,616390]
[null,null,"Gesamtergebnis",null,285577,1163697,1119033,2568307]
[]
[]
[2,"Einfügen:","Klick in die Pivot-Tabelle / Pivottable-Tools / Analysieren / \"Tools\" / \"PivotChart\""]
[2]
[2,null,null,"Änderungen der Pivot-Tabelle wirken sich im Diagramm aus und umgekehrt.\n\nDas Layout des Pivot-Diagramms ist nicht besonders vorbildlich und daher eher zur \"visuellen Selbstinformation\" geeignet als zur Präsentation.\n\nMan kann es auch als Hilfsmittel bei der Diskussion in Meetings einsetzen (\"Sehen wir uns doch mal ... an!\")"]
[2]
[2]
[2]
[2]
[2]
[2]
[1,"Insert:","Click into the PivotTable / Pivottable-Tools / Analyze / \"Tools\" / \"PivotChart\""]
[1]
[1,null,null,"Changes in the PivotTable influence the chart and vice versa.\n\nThe layout of the chart is not ideal and therefore it is more suitable for a \"visual self-information\" than for a presentation.\n\nIt may also be used as a tool for discussions in meetings (\"Let's have a look at ... !\")"]
[1]
[1]
[1]
[1]
[1]
[1]
[]
[]
[]
[]
[]
[]
[]
[]
[]
[]
[]
[]
[]
[]
[]
[]
[]
[]
[]
[]
[]
[]
[]
[]
[0]

{"sheet":"13 Pivot (Diagramm)_","index":30,"n_rows":9,"n_cols":8,"rows_kept":9,"cut":false,"hidden":true,"merged":[]}
[null,2,2,2,1,1,1,0]
[1,"13 Pivot (Chart)_",null,null,null,{"$f":"B2","v":"13 Pivot (Chart)_"}]
[2,"13 Pivot (Diagramm)_"]
[0]
[null,1,"Die Zahlen einer Pivot-Tabelle können mit wenigen Mausklicks schnell in ein Diagramm umgewandelt werden.\n\nKlicken Sie dazu in die Pivot-Tabelle (NUR eine Zelle anklicken - NICHT die gesamte Tabelle markieren!) und wählen Sie \n\n\"Pivottable-Tools / Analysieren / Tools / PivotChart\"\n\nAls Diagrammtyp sollten Sie im Allgemeinen \"Gruppierte Säulen\" benutzen.",null,1,"The numbers of a PivotTable can be quickly converted into a chart with a few mouse clicks.\n\nTo do this, click in the PivotTable (ONLY click on a cell - do NOT select the entire table!) and choose \n\n\"Pivottable tools / Analyze / Tools / PivotChart\"\n\nIn general, you should use \"Grouped columns\" as the chart type."]
[null,{"$f":"IF(C6<>\"\",B5+1,\"\")","v":2},"Daraufhin wird ein entsprechendes Diagramm erstellt, das Bedienelemente zur Steuerung der Anzeige enthält. Das bedeutet, Sie können auf diese Buttons klicken und auswählen, welche Daten im Diagramm angezeigt werden sollen.\n\nDiese Aktion wirkt sich ebenfalls auf die Pivot-Tabelle aus. Auch dort werden jetzt die ausgewählten Daten angezeigt.\n\nDas funktioniert auch umgekehrt: Sie können die Datenauswahl in der Pivot-Tabelle ändern - woraufhin sich ebenfalls das Diagramm ändert.",null,{"$f":"IF(F6<>\"\",E5+1,\"\")","v":2},"A corresponding chart is then created, which contains operating elements for controlling the display. This means that you can click on these buttons and select which data should be displayed in the chart.\n\nThis action also affects the PivotTable. The selected data is now also displayed there.\n\nThis also works the other way around: You can change the data selection in the PivotTable - which also changes the chart."]
[null,{"$f":"IF(C7<>\"\",B6+1,\"\")","v":3},"Das Layout des Pivot-Diagramms entspricht in keiner Weise den Regeln für vorbildliche Formatierung (siehe meine Übungsdatei \"Charts\"!) und ist daher eher zur \"schnellen visuellen Selbstinformation\" geeignet als zur Präsentation. \n\nDafür müsste es erst noch komplett überarbeitet werden (Titel / Achsenbeschriftung und -skalierung / Schriftart, -farbe und -größe / Farbgestaltung).",null,{"$f":"IF(F7<>\"\",E6+1,\"\")","v":3},"The layout of the PivotChart does not follow the rules of commendable formatting in any way (see my exercise file \"Charts\"!) and is therefore more suitable for \"quick visual self-information\" than for presentation. \n\nFor this it would have to be completely reworked (title / axes labeling and scaling / font, color and size / color scheme)."]
[null,{"$f":"IF(C8<>\"\",B7+1,\"\")","v":4},"Man kann es auch als schnelles Hilfsmittel bei der Diskussion in Meetings einsetzen (\"Sehen wir uns doch mal ... an!\").",null,{"$f":"IF(F8<>\"\",E7+1,\"\")","v":4},"It can also be used as a quick tool for discussion in meetings (\"Let's have a look at ...!\")."]
[null,"",null,null,""]

{"sheet":"14 Übungsdaten (1)","index":31,"n_rows":111,"n_cols":14,"rows_kept":111,"cut":false,"hidden":false,"merged":[[1,1,1,4],[2,1,2,4]]}
[null,null,null,null,null,null,null,null,null,null,null,null,null,0]
[1,"14 Exercise data (1)",null,null,null,"Back to Start"]
[2,"14 Übungsdaten (1)",null,null,null,"Startseite"]
[]
[2,"Beleg-Nr.","Kostenart","Konto-Nr","Kosten-kategorie","Kosten-stelle","Monat","Buchungs-datum","MwSt-Satz","Netto","Mwst","Brutto"]
[1,"voucher nr.","cost type","account nr.","cost category","cost center","month","booking date","VAT %","net","VAT","gross"]
[null,1,"material (Material)",4101,"P",100,"January","2015-01-06",0.19,2234,424.46,2658.46]
[0,2,"interests (Zinsen)",4191,"P",190,"January","2015-01-07",null,2548,0,2548]
[null,3,"salaries (Gehälter)",4101,"P",100,"January","2015-01-08",null,250,0,250]
[null,4,"energy (Energie)",4201,"S",200,"January","2015-01-09",0.19,569,108.11,677.11]
[null,5,"depreciation of fixed assets (AFA)",4121,"P",120,"January","2015-01-10",null,250,0,250]
[null,6,"interests (Zinsen)",4121,"P",120,"January","2015-01-11",null,3545,0,3545]
[null,7,"wages (Löhne)",4191,"P",190,"January","2015-01-12",null,2500,0,2500]
[null,8,"salaries (Gehälter)",4101,"P",100,"January","2015-01-13",null,6224,0,6224]
[null,9,"rents (Mieten)",4101,"S",100,"January","2015-01-14",null,9022,0,9022]
[null,10,"depreciation of fixed assets (AFA)",4131,"P",130,"February","2015-02-05",null,250,0,250]
[null,11,"salaries (Gehälter)",4131,"P",130,"February","2015-02-06",null,6224,0,6224]
[null,12,"rents (Mieten)",4201,"S",200,"February","2015-02-07",null,9022,0,9022]
[null,13,"depreciation of fixed assets (AFA)",4131,"P",130,"February","2015-02-08",null,250,0,250]
[null,14,"other (Sonstiges)",4191,"S",190,"February","2015-02-09",0.19,2345,445.55,2790.55]
[null,15,"wages (Löhne)",4101,"P",100,"February","2015-02-10",null,250,0,250]
[null,16,"rents (Mieten)",4101,"P",100,"February","2015-02-11",null,2582,0,2582]
[null,17,"social costs (Sozialkosten)",4101,"P",100,"February","2015-02-12",null,250,0,250]
[null,18,"depreciation of fixed assets (AFA)",4101,"P",100,"February","2015-02-13",null,9022,0,9022]
[null,19,"material (Material)",4191,"P",190,"February","2015-02-14",0.19,2489,472.91,2961.91]
[null,20,"social costs (Sozialkosten)",4101,"P",100,"March","2015-03-16",0,2548,0,2548]
[null,21,"energy (Energie)",4201,"S",200,"March","2015-03-17",0.19,1545,293.55,1838.55]
[null,22,"material (Material)",4101,"P",100,"March","2015-03-18",0.19,2214,420.66,2634.66]
[null,23,"interests (Zinsen)",4191,"P",190,"March","2015-03-19",null,2548,0,2548]
[null,24,"energy (Energie)",4201,"S",200,"March","2015-03-21",0.19,569,108.11,677.11]
[null,25,"depreciation of fixed assets (AFA)",4121,"P",120,"March","2015-03-22",null,250,0,250]
[null,26,"salaries (Gehälter)",4101,"P",100,"March","2015-03-23",null,250,0,250]
[null,27,"interests (Zinsen)",4101,"P",100,"March","2015-03-23",null,1545,0,1545]
[null,28,"wages (Löhne)",4191,"P",190,"March","2015-03-24",null,2500,0,2500]
[null,29,"wages (Löhne)",4121,"P",120,"April","2015-04-07",null,5145,0,5145]
[null,30,"dues (Abgaben)",4181,"S",180,"April","2015-04-08",null,2548,0,2548]
[null,31,"social costs (Sozialkosten)",4121,"P",120,"April","2015-04-09",null,3250,0,3250]
[null,32,"Instandhaltung",4201,"P",200,"April","2015-04-10",0.19,974,185.06,1159.06]
[null,33,"material (Material)",4131,"P",130,"April","2015-04-11",0.19,250,47.5,297.5]
[null,34,"dues (Abgaben)",4131,"P",130,"April","2015-04-12",null,2489,0,2489]
[null,35,"salaries (Gehälter)",4181,"P",180,"April","2015-04-13",null,1000,0,1000]
[null,36,"social costs (Sozialkosten)",4101,"P",100,"April","2015-04-14",null,2548,0,2548]
[null,37,"energy (Energie)",4201,"S",200,"April","2015-04-15",0.19,1545,293.55,1838.55]
[null,38,"depreciation of fixed assets (AFA)",4101,"P",100,"May","2015-05-21",null,9022,0,9022]
[null,39,"material (Material)",4191,"P",190,"May","2015-05-22",0.19,2489,472.91,2961.91]
[null,40,"wages (Löhne)",4121,"P",120,"May","2015-05-23",null,5145,0,5145]
[null,41,"dues (Abgaben)",4181,"P",180,"May","2015-05-24",null,2548,0,2548]
[null,42,"social costs (Sozialkosten)",4121,"P",120,"May","2015-05-25",null,250,0,250]
[null,43,"Instandhaltung",4201,"P",200,"May","2015-05-26",0.19,974,185.06,1159.06]
[null,44,"material (Material)",4131,"P",130,"May","2015-05-27",0.19,250,47.5,297.5]
[null,45,"dues (Abgaben)",4101,"P",100,"May","2015-05-28",null,2489,0,2489]
[null,46,"salaries (Gehälter)",4181,"P",180,"May","2015-05-29",null,1000,0,1000]
[null,47,"interests (Zinsen)",4121,"P",120,"June","2015-06-10",null,1545,0,1545]
[null,48,"wages (Löhne)",4191,"P",190,"June","2015-06-11",null,2500,0,2500]
[null,49,"salaries (Gehälter)",4131,"P",130,"June","2015-06-12",null,6224,0,6224]
[null,50,"rents (Mieten)",4201,"P",200,"June","2015-06-13",null,9022,0,9022]
[null,51,"depreciation of fixed assets (AFA)",4131,"P",130,"June","2015-06-14",null,250,0,250]
[null,52,"other (Sonstiges)",4191,"S",190,"June","2015-06-15",0.19,2145,407.55,2552.5500000000002]
[null,53,"wages (Löhne)",4101,"P",100,"June","2015-06-16",null,250,0,250]
[null,54,"rents (Mieten)",4101,"P",100,"June","2015-06-17",null,2582,0,2582]
[null,55,"social costs (Sozialkosten)",4101,"P",100,"June","2015-06-18",null,250,0,250]
[null,56,"dues (Abgaben)",4131,"P",130,"July","2015-07-12",null,2489,0,2489]
[null,57,"salaries (Gehälter)",4181,"P",180,"July","2015-07-13",null,3000,0,3000]
[null,58,"social costs (Sozialkosten)",4101,"P",100,"July","2015-07-14",null,2548,0,2548]
[null,59,"energy (Energie)",4201,"P",200,"July","2015-07-15",0.19,3545,673.55,4218.55]
[null,60,"material (Material)",4101,"P",100,"July","2015-07-16",0.19,2234,424.46,2658.46]
[null,61,"interests (Zinsen)",4191,"P",190,"July","2015-07-17",null,2548,0,2548]
[null,62,"salaries (Gehälter)",4101,"P",100,"July","2015-07-18",null,250,0,250]
[null,63,"energy (Energie)",4101,"S",100,"July","2015-07-19",0.19,569,108.11,677.11]
[null,64,"depreciation of fixed assets (AFA)",4121,"P",120,"July","2015-07-23",null,250,0,250]
[null,65,"material (Material)",4101,"P",100,"August","2015-08-12",0.19,2234,424.46,2658.46]
[null,66,"interests (Zinsen)",4191,"P",190,"August","2015-08-13",null,2548,0,2548]
[null,67,"salaries (Gehälter)",4101,"P",100,"August","2015-08-14",null,250,0,250]
[null,68,"energy (Energie)",4101,"S",100,"August","2015-08-15",0.19,569,108.11,677.11]
[null,69,"depreciation of fixed assets (AFA)",4121,"P",120,"August","2015-08-16",null,250,0,250]
[null,70,"rents (Mieten)",4101,"S",100,"September","2015-09-14",null,2582,0,2582]
[null,71,"social costs (Sozialkosten)",4101,"P",100,"September","2015-09-15",null,250,0,250]
[null,72,"depreciation of fixed assets (AFA)",4101,"P",100,"September","2015-09-16",null,9022,0,9022]
[null,73,"material (Material)",4191,"P",190,"September","2015-09-17",0.19,2489,472.91,2961.91]
[null,74,"wages (Löhne)",4121,"P",120,"September","2015-09-18",null,5345,0,5345]
[null,75,"dues (Abgaben)",4181,"P",180,"September","2015-09-19",null,2548,0,2548]
[null,76,"Instandhaltung",4101,"P",100,"September","2015-09-21",0.19,974,185.06,1159.06]
[null,77,"material (Material)",4131,"P",130,"September","2015-09-22",0.19,250,47.5,297.5]
[null,78,"social costs (Sozialkosten)",4121,"P",120,"September","2015-09-23",null,250,0,250]
[null,79,"energy (Energie)",4201,"S",200,"October","2015-10-31",0.19,569,108.11,677.11]
[null,80,"wages (Löhne)",4191,"P",190,"October","2015-10-31",null,2500,0,2500]
[null,81,"other (Sonstiges)",4101,"S",100,"October","2015-10-31",0.19,2345,445.55,2790.55]
[null,82,"depreciation of fixed assets (AFA)",4121,"P",120,"October","2015-11-01",null,250,0,250]
[null,83,"salaries (Gehälter)",4131,"P",130,"October","2015-11-01",null,6224,0,6224]
[null,84,"wages (Löhne)",4101,"P",100,"October","2015-11-01",null,250,0,250]
[null,85,"interests (Zinsen)",4121,"P",120,"October","2015-11-02",null,3545,0,3545]
[null,86,"rents (Mieten)",4201,"S",200,"October","2015-11-02",null,9022,0,9022]
[null,87,"depreciation of fixed assets (AFA)",4131,"P",130,"October","2015-11-03",null,250,0,250]
[null,88,"Instandhaltung",4201,"P",200,"November","2015-11-12",0.19,974,185.06,1159.06]
[null,89,"material (Material)",4131,"P",130,"November","2015-11-13",0.19,250,47.5,297.5]
[null,90,"dues (Abgaben)",4131,"P",130,"November","2015-11-14",null,2489,0,2489]
[null,91,"salaries (Gehälter)",4181,"P",180,"November","2015-11-15",null,3000,0,3000]
[null,92,"social costs (Sozialkosten)",4101,"P",100,"November","2015-11-16",null,2548,0,2548]
[null,93,"energy (Energie)",4201,"S",200,"November","2015-11-17",0.19,3545,673.55,4218.55]
[null,94,"material (Material)",4101,"P",100,"November","2015-11-18",0.19,2234,424.46,2658.46]
[null,95,"interests (Zinsen)",4101,"P",100,"November","2015-11-19",null,2548,0,2548]
[null,96,"salaries (Gehälter)",4101,"P",100,"November","2015-11-23",null,250,0,250]
[null,97,"other (Sonstiges)",4191,"S",190,"December","2015-12-19",0.19,2345,445.55,2790.55]
[null,98,"rents (Mieten)",4101,"P",100,"December","2015-12-21",null,2582,0,2582]
[null,99,"social costs (Sozialkosten)",4101,"P",100,"December","2015-12-22",null,250,0,250]
[null,100,"wages (Löhne)",4101,"P",100,"December","2015-12-23",null,250,0,250]
[null,101,"depreciation of fixed assets (AFA)",4101,"P",100,"December","2015-12-23",null,9022,0,9022]
[null,102,"material (Material)",4191,"P",190,"December","2015-12-24",0.19,2489,472.91,2961.91]
[null,103,"wages (Löhne)",4101,"P",100,"December","2015-12-25",null,5345,0,5345]
[null,104,"dues (Abgaben)",4101,"P",100,"December","2015-12-26",null,2548,0,2548]
[null,105,"social costs (Sozialkosten)",4121,"P",120,"December","2015-12-27",null,250,0,250]

{"sheet":"15 Übungsdaten (2)","index":32,"n_rows":1506,"n_cols":14,"rows_kept":1506,"cut":false,"hidden":false,"merged":[[1,1,1,4],[2,1,2,4]]}
[null,null,null,null,null,null,null,null,null,null,null,null,null,0]
[1,"15 Exercise data (2)",null,null,null,"Back to Start"]
[2,"15 Übungsdaten (2)",null,null,null,"Startseite"]
[]
[2,"Artikel-Nr.","Artikel-\nGruppe","Kunde","Vertreter","Verkaufs-gebiet","Anzahl","Verkaufs-preis","Umsatz","DB\npro Einheit","DB\ngesamt"]
[1,"article nr.","article group","customer","employee","sales territory","number","sales price","trunover","gross margin per unit","total gross margin"]
[null,123,1,"Sauer","Schulte","Süd",10,11.95,119.5,3.2862499999999999,32.862499999999997]
[null,123,1,"Meier","Schulte","Süd",11,11.95,131.44999999999999,2.2585500000000001,24.844049999999999]
[0,123,1,"Feier","Schulte","Süd",12,11.7,140.4,3.2174999999999998,38.61]
[null,123,1,"Kader","Hunter","Süd",25,11.7,292.5,2.2113,55.282499999999999]
[null,123,1,"Wager","Hunter","Süd",77,12.1,931.7,3.3275000000000001,256.21749999999997]
[null,123,1,"Loch","Hunter","Süd",33,13.4,442.2,2.5326,83.575800000000001]
[null,123,1,"Koch","Hunter","Süd",10,12.1,121,3.3275000000000001,33.274999999999999]
[null,123,1,"Block","Hunter","Süd",11,9.99,109.89,1.88811,20.769210000000001]
[null,125,1,"Bunt","Hunter","Süd",12,12.95,155.4,3.5612499999999998,42.734999999999999]
[null,125,1,"Meier","Hunter","Süd",25,14.95,373.75,2.8255499999999998,70.638750000000002]
[null,126,1,"Müller","Voss","Süd",77,14.95,1151.1500000000001,4.1112500000000001,316.56625000000003]
[null,123,1,"Rot","Voss","Süd",33,11.95,394.35,2.2585500000000001,74.532150000000001]
[null,123,1,"Rot","Voss","Süd",10,15.95,159.5,4.3862500000000004,43.862499999999997]
[null,142,1,"Bauer","Seiler","Nord",10,12.95,129.5,2.4475499999999997,24.475499999999997]
[null,142,1,"Müller","Voss","Nord",10,16.95,169.5,4.6612499999999999,46.612499999999997]
[null,143,1,"Rot","Wefler","Nord",10,13.95,139.5,2.6365499999999997,26.365499999999997]
[null,144,1,"Rot","Wefler","Nord",11,17.95,197.45,4.9362500000000002,54.298749999999998]
[null,145,1,"Bauer","Wefler","Nord",12,14.95,179.4,2.8255499999999998,33.906599999999997]
[null,146,1,"Müller","Wefler","Nord",25,18.95,473.75,5.2112499999999997,130.28125]
[null,146,1,"Rot","Wefler","Nord",77,15.95,1228.1500000000001,3.0145499999999998,232.12034999999997]
[null,255,2,"Rot","Seiler","Nord",33,19.95,658.35,5.4862500000000001,181.04624999999999]
[null,255,2,"Bauer","Seiler","Nord",20,16.95,339,3.2035499999999999,64.070999999999998]
[null,255,2,"Müller","Seiler","Nord",20,20.95,419,5.7612500000000004,115.22499999999999]
[null,255,2,"Rot","Voss","Nord",20,17.95,359,3.39255,67.850999999999999]
[null,323,3,"Sauer","Schulte","Süd",20,21.95,439,6.0362499999999999,120.72499999999999]
[null,323,3,"Meier","Schulte","Süd",20,11.95,239,2.2585500000000001,45.170999999999999]
[null,323,3,"Feier","Schulte","Süd",20,11.95,239,3.2862499999999999,65.724999999999994]
[null,323,3,"Kader","Hunter","Süd",20,11.7,234,2.2113,44.225999999999999]
[null,323,3,"Wager","Hunter","Süd",17,11.7,198.9,3.2174999999999998,54.697499999999998]
[null,323,3,"Loch","Hunter","Süd",18,12.1,217.8,2.2869000000000002,41.164200000000001]
[null,323,3,"Koch","Hunter","Süd",19,13.4,254.6,3.6850000000000001,70.015000000000001]
[null,323,3,"Block","Hunter","Süd",20,12.1,242,2.2869000000000002,45.738]
[null,325,3,"Bunt","Hunter","Süd",21,9.99,209.79,2.7472500000000002,57.692250000000001]
[null,325,3,"Meier","Hunter","Süd",22,12.95,284.89999999999998,2.4475499999999997,53.846099999999993]
[null,326,3,"Müller","Voss","Süd",23,14.95,343.85,4.1112500000000001,94.558750000000003]
[null,323,3,"Rot","Voss","Süd",24,14.95,358.8,2.8255499999999998,67.813199999999995]
[null,323,3,"Rot","Voss","Süd",25,14.7,367.5,4.0425000000000004,101.0625]
[null,442,4,"Bauer","Seiler","Nord",10,14.7,147,2.7782999999999998,27.782999999999998]
[null,442,4,"Müller","Voss","Nord",10,15.1,151,4.1524999999999999,41.524999999999999]
[null,443,4,"Rot","Wefler","Nord",10,16.399999999999999,164,3.0995999999999997,30.995999999999995]
[null,444,4,"Rot","Wefler","Nord",11,15.1,166.1,4.1524999999999999,45.677500000000002]
[null,445,4,"Bauer","Wefler","Nord",12,12.99,155.88,2.4551099999999999,29.461320000000001]
[null,446,4,"Müller","Wefler","Nord",25,15.95,398.75,4.3862500000000004,109.65625]
[null,446,4,"Rot","Wefler","Nord",77,17.95,1382.15,3.39255,261.22635000000002]
[null,555,5,"Rot","Seiler","Nord",33,11.95,394.35,3.2862499999999999,108.44625000000001]
[null,555,5,"Bauer","Seiler","Nord",20,11.95,239,2.2585500000000001,45.170999999999999]
[null,556,5,"Müller","Seiler","Nord",20,11.95,239,3.2862499999999999,65.724999999999994]
[null,558,5,"Rot","Voss","Nord",20,11.95,239,2.2585500000000001,45.170999999999999]
[null,623,6,"Sauer","Schulte","Süd",10,19.399999999999999,194,5.335,53.35]
[null,623,6,"Meier","Schulte","Süd",11,18.100000000000001,199.1,3.4209000000000005,37.629900000000006]
[null,623,6,"Feier","Schulte","Süd",12,15.99,191.88,4.3972500000000005,52.76700000000001]
[null,623,6,"Kader","Hunter","Süd",25,18.95,473.75,3.58155,89.538749999999993]
[null,623,6,"Wager","Hunter","Süd",77,20.95,1613.15,5.7612500000000004,443.61624999999998]
[null,623,6,"Loch","Hunter","Süd",33,14.95,493.35,2.8255499999999998,93.243149999999986]
[null,623,6,"Koch","Hunter","Süd",10,14.95,149.5,4.1112500000000001,41.112499999999997]
[null,623,6,"Block","Hunter","Süd",11,14.95,164.45,2.8255499999999998,31.081049999999998]
[null,625,6,"Bunt","Hunter","Süd",12,14.95,179.4,4.1112500000000001,49.335000000000001]
[null,625,6,"Meier","Hunter","Süd",25,22.4,560,4.2336,105.84]
[null,626,6,"Müller","Voss","Süd",18,21.1,379.8,5.8025000000000002,104.44499999999999]
[null,623,6,"Rot","Voss","Süd",33,18.989999999999998,626.66999999999996,3.5891099999999998,118.44063]
[null,623,6,"Rot","Voss","Süd",10,21.95,219.5,6.0362499999999999,60.362499999999997]
[null,642,6,"Bauer","Seiler","Nord",10,23.95,239.5,4.5265500000000003,45.265500000000003]
[null,642,6,"Müller","Voss","Nord",19,17.95,341.05,4.9362500000000002,93.788749999999993]
[null,643,6,"Rot","Wefler","Nord",10,17.95,179.5,3.39255,33.9255]
[null,644,6,"Rot","Wefler","Nord",11,17.95,197.45,4.9362500000000002,54.298749999999998]
[null,645,6,"Bauer","Wefler","Nord",88,17.95,1579.6,3.39255,298.5444]
[null,646,6,"Müller","Wefler","Nord",25,25.4,635,6.9850000000000003,174.625]
[null,646,6,"Rot","Wefler","Nord",77,24.1,1855.7,4.5548999999999999,350.72730000000001]
[null,723,7,"Sauer","Schulte","Süd",110,21.99,2418.9,6.04725,665.19749999999999]
[null,723,7,"Meier","Schulte","Süd",11,24.95,274.45,4.7155499999999995,51.871049999999997]
[null,723,7,"Feier","Schulte","Süd",12,26.95,323.39999999999998,7.4112499999999999,88.935000000000002]
[null,723,7,"Kader","Hunter","Süd",25,20.95,523.75,3.9595499999999997,98.988749999999996]
[null,723,7,"Wager","Hunter","Süd",77,20.95,1613.15,5.7612500000000004,443.61624999999998]
[null,723,7,"Loch","Hunter","Süd",100,20.95,2095,3.9595499999999997,395.95499999999998]
[null,723,7,"Koch","Hunter","Süd",10,20.95,209.5,5.7612500000000004,57.612499999999997]
[null,723,7,"Block","Hunter","Süd",11,28.4,312.39999999999998,5.3675999999999995,59.043599999999998]
[null,725,7,"Bunt","Hunter","Süd",12,27.1,325.2,7.4524999999999997,89.43]
[null,725,7,"Meier","Hunter","Süd",25,24.99,624.75,4.7231100000000001,118.07775000000001]
[null,726,7,"Müller","Voss","Süd",77,27.95,2152.15,7.6862500000000002,591.84124999999995]
[null,723,7,"Rot","Voss","Süd",50,29.95,1497.5,5.6605499999999997,283.02749999999997]
[null,723,7,"Rot","Voss","Süd",10,23.95,239.5,6.5862499999999997,65.862499999999997]
[null,742,7,"Bauer","Seiler","Nord",10,23.95,239.5,4.5265500000000003,45.265500000000003]
[null,742,7,"Müller","Voss","Nord",10,23.95,239.5,6.5862499999999997,65.862499999999997]
[null,743,7,"Rot","Wefler","Nord",70,23.95,1676.5,4.5265500000000003,316.85850000000005]
[null,744,7,"Rot","Wefler","Nord",11,31.4,345.4,8.6349999999999998,94.984999999999999]
[null,845,8,"Bauer","Wefler","Nord",12,30.1,361.2,5.6889000000000003,68.266800000000003]
[null,846,8,"Müller","Wefler","Nord",25,27.99,699.75,7.6972500000000004,192.43125000000001]
[null,846,8,"Rot","Wefler","Nord",77,30.95,2383.15,5.8495499999999998,450.41534999999999]
[null,823,8,"Sauer","Schulte","Süd",30,32.950000000000003,988.5,9.0612499999999994,271.83749999999998]
[null,823,8,"Meier","Schulte","Süd",11,26.95,296.45,5.0935499999999996,56.029049999999998]
[null,823,8,"Feier","Schulte","Süd",12,26.95,323.39999999999998,7.4112499999999999,88.935000000000002]
[null,823,8,"Kader","Hunter","Süd",25,11.7,292.5,2.2113,55.282499999999999]
[null,823,8,"Wager","Hunter","Süd",77,12.1,931.7,3.3275000000000001,256.21749999999997]
[null,823,8,"Loch","Hunter","Süd",33,13.4,442.2,2.5326,83.575800000000001]
[null,823,8,"Koch","Hunter","Süd",10,12.1,121,3.3275000000000001,33.274999999999999]
[null,823,8,"Block","Hunter","Süd",11,11.95,131.44999999999999,2.2585500000000001,24.844049999999999]
[null,825,8,"Bunt","Hunter","Süd",12,11.95,143.4,3.2862499999999999,39.435000000000002]
[null,825,8,"Meier","Hunter","Süd",25,35.950000000000003,898.75,6.794550000000001,169.86375000000001]
[null,826,8,"Müller","Voss","Süd",77,29.95,2306.15,8.2362500000000001,634.19124999999997]
[null,823,8,"Rot","Voss","Süd",33,29.95,988.35,5.6605499999999997,186.79814999999999]
[null,823,8,"Rot","Voss","Süd",10,14.7,147,4.0425000000000004,40.424999999999997]
[null,842,8,"Bauer","Seiler","Nord",10,15.1,151,2.8538999999999999,28.538999999999998]
[null,842,8,"Müller","Voss","Nord",10,16.399999999999999,164,4.51,45.1]
[null,843,8,"Rot","Wefler","Nord",10,15.1,151,2.8538999999999999,28.538999999999998]
[null,844,8,"Rot","Wefler","Nord",11,14.95,164.45,4.1112500000000001,45.223750000000003]
[null,845,8,"Bauer","Wefler","Nord",12,11.95,143.4,2.2585500000000001,27.102600000000002]
[null,846,8,"Müller","Wefler","Nord",25,11.95,298.75,3.2862499999999999,82.15625]
[null,846,8,"Rot","Wefler","Nord",77,32.950000000000003,2537.15,6.2275500000000008,479.52135000000004]
[null,823,8,"Sauer","Schulte","Süd",10,32.950000000000003,329.5,9.0612499999999994,90.612499999999997]
[null,823,8,"Meier","Schulte","Süd",11,17.7,194.7,3.3452999999999999,36.798299999999998]
[null,823,8,"Feier","Schulte","Süd",12,18.100000000000001,217.2,4.9775,59.73]
[null,823,8,"Kader","Hunter","Süd",25,19.399999999999999,485,3.6665999999999999,91.665000000000006]
[null,823,8,"Wager","Hunter","Süd",77,18.100000000000001,1393.7,4.9775,383.26749999999998]
[null,823,8,"Loch","Hunter","Süd",33,17.95,592.35,3.39255,111.95415]
[null,823,8,"Koch","Hunter","Süd",10,14.95,149.5,4.1112500000000001,41.112499999999997]
[null,823,8,"Block","Hunter","Süd",11,11.95,131.44999999999999,2.2585500000000001,24.844049999999999]
[null,825,8,"Bunt","Hunter","Süd",12,11.95,143.4,3.2862499999999999,39.435000000000002]
[null,825,8,"Meier","Hunter","Süd",25,35.950000000000003,898.75,6.794550000000001,169.86375000000001]
[null,826,8,"Müller","Voss","Süd",77,20.7,1593.9,5.6924999999999999,438.32249999999999]
[null,823,8,"Rot","Voss","Süd",33,21.1,696.3,3.9879000000000002,131.60070000000002]
[null,823,8,"Rot","Voss","Süd",10,22.4,224,6.16,61.6]
[null,942,9,"Bauer","Seiler","Nord",10,21.1,211,3.9879000000000002,39.879000000000005]
[null,942,9,"Müller","Voss","Nord",10,20.95,209.5,5.7612500000000004,57.612499999999997]
[null,943,9,"Rot","Wefler","Nord",10,17.95,179.5,3.39255,33.9255]
[null,944,9,"Rot","Wefler","Nord",11,14.95,164.45,4.1112500000000001,45.223750000000003]
[null,945,9,"Bauer","Wefler","Nord",12,11.95,143.4,2.2585500000000001,27.102600000000002]
[null,946,9,"Müller","Wefler","Nord",25,12.99,324.75,3.5722500000000004,89.306250000000006]
[null,946,9,"Rot","Wefler","Nord",77,13.05,1004.85,2.46645,189.91665]
[null,223,2,"Sauer","Schulte","Süd",20,22.95,494,6.3112500000000002,126.22499999999999]
[null,223,2,"Meier","Schulte","Süd",22,22.95,528,4.3375500000000002,95.426100000000005]
[null,223,2,"Feier","Schulte","Süd",22,22.7,528,6.2424999999999997,137.33500000000001]
[null,223,2,"Kader","Hunter","Süd",25,22.7,504,4.2903000000000002,107.25749999999999]
[null,223,2,"Wager","Hunter","Süd",77,22.2,548.9,6.1050000000000004,470.08499999999998]
[null,223,2,"Loch","Hunter","Süd",33,23.4,504.9,4.4226000000000001,145.94579999999999]
[null,223,2,"Koch","Hunter","Süd",20,22.2,573.75,6.1050000000000004,122.1]
[null,223,2,"Block","Hunter","Süd",22,9.99,2537.15,1.88811,41.538420000000002]
[null,225,2,"Bunt","Hunter","Süd",22,22.95,659,6.3112500000000002,138.8475]
[null,225,2,"Meier","Hunter","Süd",25,24.95,609.4,4.7155499999999995,117.88875]
[null,226,2,"Müller","Voss","Süd",77,24.95,620.4,6.8612500000000001,528.31624999999997]
[null,223,2,"Rot","Voss","Süd",33,22.95,2171.4,4.3375500000000002,143.13915]
[null,223,2,"Rot","Voss","Süd",20,25.95,2171.4,7.1362500000000004,142.72499999999999]
[null,242,2,"Bauer","Seiler","Nord",20,22.95,922.35,4.3375500000000002,86.751000000000005]
[null,242,2,"Müller","Voss","Nord",20,26.95,499,7.4112499999999999,148.22499999999999]
[null,243,2,"Rot","Wefler","Nord",20,23.95,504.9,4.5265500000000003,90.531000000000006]
[null,244,2,"Rot","Wefler","Nord",22,27.95,504.9,7.6862500000000002,169.0975]
[null,245,2,"Bauer","Wefler","Nord",22,24.95,898.75,4.7155499999999995,103.74209999999999]
[null,246,2,"Müller","Wefler","Nord",25,28.95,1593.9,7.9612499999999997,199.03125]
[null,246,2,"Rot","Wefler","Nord",77,25.95,732.6,4.9045499999999995,377.65034999999995]
[null,255,2,"Rot","Seiler","Nord",33,29.95,448,8.2362500000000001,271.79624999999999]
[null,255,2,"Bauer","Seiler","Nord",20,26.95,419,5.0935499999999996,101.871]
[null,255,2,"Müller","Seiler","Nord",20,20.95,419,5.7612500000000004,115.22499999999999]
[null,255,2,"Rot","Voss","Nord",20,27.95,559,5.2825499999999996,105.651]
[null,323,3,"Sauer","Schulte","Süd",20,22.95,548.9,6.3112500000000002,126.22499999999999]
[null,323,3,"Meier","Schulte","Süd",20,22.95,504.9,4.3375500000000002,86.751000000000005]
[null,323,3,"Feier","Schulte","Süd",20,22.95,574.75,6.3112500000000002,126.22499999999999]
[null,323,3,"Kader","Hunter","Süd",20,22.7,1774.85,4.2903000000000002,85.806000000000012]
[null,323,3,"Wager","Hunter","Süd",27,22.7,612.9,6.2424999999999997,168.54750000000001]
[null,323,3,"Loch","Hunter","Süd",28,22.2,621.6,4.1958000000000002,117.48240000000001]
[null,323,3,"Koch","Hunter","Süd",29,23.4,678.6,6.4349999999999996,186.61500000000001]
[null,323,3,"Block","Hunter","Süd",20,22.2,444,4.1958000000000002,83.915999999999997]
[null,325,3,"Bunt","Hunter","Süd",22,9.99,219.78,2.7472500000000002,60.439500000000002]
[null,325,3,"Meier","Hunter","Süd",22,22.95,504.9,4.3375500000000002,95.426100000000005]
[null,326,3,"Müller","Voss","Süd",23,24.95,573.85,6.8612500000000001,157.80875]
[null,323,3,"Rot","Voss","Süd",24,24.95,598.79999999999995,4.7155499999999995,113.17319999999998]
[null,323,3,"Rot","Voss","Süd",25,24.7,617.5,6.7925000000000004,169.8125]
[null,442,4,"Bauer","Seiler","Nord",20,24.7,494,4.6683000000000003,93.366000000000014]
[null,442,4,"Müller","Voss","Nord",20,25.2,504,6.93,138.6]
[null,443,4,"Rot","Wefler","Nord",20,26.4,528,4.9895999999999994,99.791999999999987]
[null,444,4,"Rot","Wefler","Nord",22,25.2,554.4,6.93,152.46]
[null,445,4,"Bauer","Wefler","Nord",22,22.99,505.78,4.34511,95.592420000000004]
[null,446,4,"Müller","Wefler","Nord",25,25.95,648.75,7.1362500000000004,178.40625]
[null,446,4,"Rot","Wefler","Nord",77,27.95,2152.15,5.2825499999999996,406.75635]
[null,555,5,"Rot","Seiler","Nord",33,22.95,757.35,6.3112500000000002,208.27125000000001]
[null,555,5,"Bauer","Seiler","Nord",20,22.95,459,4.3375500000000002,86.751000000000005]
[null,556,5,"Müller","Seiler","Nord",20,22.95,459,6.3112500000000002,126.22499999999999]
[null,558,5,"Rot","Voss","Nord",20,22.95,459,4.3375500000000002,86.751000000000005]
[null,623,6,"Sauer","Schulte","Süd",20,29.4,588,8.0850000000000009,161.69999999999999]
[null,623,6,"Meier","Schulte","Süd",22,28.2,620.4,5.3297999999999996,117.25559999999999]
[null,623,6,"Feier","Schulte","Süd",22,25.99,571.78,7.1472500000000005,157.23950000000002]
[null,623,6,"Kader","Hunter","Süd",25,28.95,723.75,5.4715499999999997,136.78874999999999]
[null,623,6,"Wager","Hunter","Süd",77,20.95,1613.15,5.7612500000000004,443.61624999999998]
[null,623,6,"Loch","Hunter","Süd",33,24.95,823.35,4.7155499999999995,155.61314999999999]
[null,623,6,"Koch","Hunter","Süd",20,24.95,499,6.8612500000000001,137.22499999999999]
[null,623,6,"Block","Hunter","Süd",22,24.95,548.9,4.7155499999999995,103.74209999999999]
[null,625,6,"Bunt","Hunter","Süd",22,24.95,548.9,6.8612500000000001,150.94749999999999]
[null,625,6,"Meier","Hunter","Süd",25,22.4,560,4.2336,105.84]
[null,626,6,"Müller","Voss","Süd",28,22.2,621.6,6.1050000000000004,170.94]
[null,623,6,"Rot","Voss","Süd",33,28.99,956.67,5.4791099999999995,180.81062999999997]
[null,623,6,"Rot","Voss","Süd",20,22.95,459,6.3112500000000002,126.22499999999999]
[null,642,6,"Bauer","Seiler","Nord",20,23.95,479,4.5265500000000003,90.531000000000006]
[null,642,6,"Müller","Voss","Nord",29,27.95,810.55,7.6862500000000002,222.90125]
[null,643,6,"Rot","Wefler","Nord",20,27.95,559,5.2825499999999996,105.651]
[null,644,6,"Rot","Wefler","Nord",22,27.95,614.9,7.6862500000000002,169.0975]
[null,645,6,"Bauer","Wefler","Nord",88,27.95,2459.6,5.2825499999999996,464.86439999999999]
[null,646,6,"Müller","Wefler","Nord",25,25.4,635,6.9850000000000003,174.625]
[null,646,6,"Rot","Wefler","Nord",77,24.2,1863.4,4.5738000000000003,352.18260000000004]
[null,723,7,"Sauer","Schulte","Süd",220,22.99,5057.8,6.3222500000000004,1390.895]
[null,723,7,"Meier","Schulte","Süd",22,24.95,548.9,4.7155499999999995,103.74209999999999]
[null,723,7,"Feier","Schulte","Süd",22,26.95,592.9,7.4112499999999999,163.04750000000001]
[null,723,7,"Kader","Hunter","Süd",25,20.95,523.75,3.9595499999999997,98.988749999999996]
[null,723,7,"Wager","Hunter","Süd",77,20.95,1613.15,5.7612500000000004,443.61624999999998]
[null,723,7,"Loch","Hunter","Süd",200,20.95,4190,3.9595499999999997,791.91]
[null,723,7,"Koch","Hunter","Süd",20,20.95,419,5.7612500000000004,115.22499999999999]
[null,723,7,"Block","Hunter","Süd",22,28.4,624.79999999999995,5.3675999999999995,118.0872]
[null,725,7,"Bunt","Hunter","Süd",22,27.2,598.4,7.48,164.56]
[null,725,7,"Meier","Hunter","Süd",25,24.99,624.75,4.7231100000000001,118.07775000000001]
[null,726,7,"Müller","Voss","Süd",77,27.95,2152.15,7.6862500000000002,591.84124999999995]
[null,723,7,"Rot","Voss","Süd",50,29.95,1497.5,5.6605499999999997,283.02749999999997]
[null,723,7,"Rot","Voss","Süd",20,23.95,479,6.5862499999999997,131.72499999999999]
[null,742,7,"Bauer","Seiler","Nord",20,23.95,479,4.5265500000000003,90.531000000000006]
[null,742,7,"Müller","Voss","Nord",20,23.95,479,6.5862499999999997,131.72499999999999]
[null,743,7,"Rot","Wefler","Nord",70,23.95,1676.5,4.5265500000000003,316.85850000000005]
[null,744,7,"Rot","Wefler","Nord",22,32.4,712.8,8.91,196.02]
[null,845,8,"Bauer","Wefler","Nord",22,30.2,664.4,5.7077999999999998,125.57159999999999]
[null,846,8,"Müller","Wefler","Nord",25,27.99,699.75,7.6972500000000004,192.43125000000001]
[null,846,8,"Rot","Wefler","Nord",77,30.95,2383.15,5.8495499999999998,450.41534999999999]
[null,823,8,"Sauer","Schulte","Süd",30,32.950000000000003,988.5,9.0612499999999994,271.83749999999998]
[null,823,8,"Meier","Schulte","Süd",22,26.95,592.9,5.0935499999999996,112.0581]
[null,823,8,"Feier","Schulte","Süd",22,26.95,592.9,7.4112499999999999,163.04750000000001]
[null,823,8,"Kader","Hunter","Süd",25,22.7,567.5,4.2903000000000002,107.25749999999999]
[null,823,8,"Wager","Hunter","Süd",77,22.2,1709.4,6.1050000000000004,470.08499999999998]
[null,823,8,"Loch","Hunter","Süd",33,23.4,772.2,4.4226000000000001,145.94579999999999]
[null,823,8,"Koch","Hunter","Süd",20,22.2,444,6.1050000000000004,122.1]
[null,823,8,"Block","Hunter","Süd",22,22.95,504.9,4.3375500000000002,95.426100000000005]
[null,825,8,"Bunt","Hunter","Süd",22,22.95,504.9,6.3112500000000002,138.8475]
[null,825,8,"Meier","Hunter","Süd",25,35.950000000000003,898.75,6.794550000000001,169.86375000000001]
[null,826,8,"Müller","Voss","Süd",77,29.95,2306.15,8.2362500000000001,634.19124999999997]
[null,823,8,"Rot","Voss","Süd",33,29.95,988.35,5.6605499999999997,186.79814999999999]
[null,823,8,"Rot","Voss","Süd",20,24.7,494,6.7925000000000004,135.85]
[null,842,8,"Bauer","Seiler","Nord",20,25.2,528,4.7627999999999995,95.255999999999986]
[null,842,8,"Müller","Voss","Nord",20,26.4,528,7.26,145.19999999999999]
[null,843,8,"Rot","Wefler","Nord",20,25.2,504,4.7627999999999995,95.255999999999986]
[null,844,8,"Rot","Wefler","Nord",22,24.95,548.9,6.8612500000000001,150.94749999999999]
[null,845,8,"Bauer","Wefler","Nord",22,22.95,504.9,4.3375500000000002,95.426100000000005]
[null,846,8,"Müller","Wefler","Nord",25,22.95,573.75,6.3112500000000002,157.78125]
[null,846,8,"Rot","Wefler","Nord",77,32.950000000000003,2537.15,6.2275500000000008,479.52135000000004]
[null,823,8,"Sauer","Schulte","Süd",20,32.950000000000003,659,9.0612499999999994,181.22499999999999]
[null,823,8,"Meier","Schulte","Süd",22,27.7,609.4,5.2352999999999996,115.17659999999999]
[null,823,8,"Feier","Schulte","Süd",22,28.2,620.4,7.7549999999999999,170.61]
[null,823,8,"Kader","Hunter","Süd",25,29.4,2171.4,5.5565999999999995,138.91499999999999]
[null,823,8,"Wager","Hunter","Süd",77,28.2,2171.4,7.7549999999999999,597.13499999999999]
[null,823,8,"Loch","Hunter","Süd",33,27.95,922.35,5.2825499999999996,174.32414999999997]
[null,823,8,"Koch","Hunter","Süd",20,24.95,499,6.8612500000000001,137.22499999999999]
[null,823,8,"Block","Hunter","Süd",22,22.95,504.9,4.3375500000000002,95.426100000000005]
[null,825,8,"Bunt","Hunter","Süd",22,22.95,504.9,6.3112500000000002,138.8475]
[null,825,8,"Meier","Hunter","Süd",25,35.950000000000003,898.75,6.794550000000001,169.86375000000001]
[null,826,8,"Müller","Voss","Süd",77,20.7,1593.9,5.6924999999999999,438.32249999999999]
[null,823,8,"Rot","Voss","Süd",33,22.2,732.6,4.1958000000000002,138.4614]
[null,823,8,"Rot","Voss","Süd",20,22.4,448,6.16,123.2]
[null,942,9,"Bauer","Seiler","Nord",20,22.2,419,4.1958000000000002,83.915999999999997]
[null,942,9,"Müller","Voss","Nord",20,20.95,419,5.7612500000000004,115.22499999999999]
[null,943,9,"Rot","Wefler","Nord",20,27.95,559,5.2825499999999996,105.651]
[null,944,9,"Rot","Wefler","Nord",22,24.95,548.9,6.8612500000000001,150.94749999999999]
[null,945,9,"Bauer","Wefler","Nord",22,22.95,504.9,4.3375500000000002,95.426100000000005]
[null,946,9,"Müller","Wefler","Nord",25,22.99,574.75,6.3222500000000004,158.05625000000001]
[null,946,9,"Rot","Wefler","Nord",77,23.05,1774.85,4.3564500000000006,335.44665000000003]
[null,123,1,"Sauer","Schulte","Süd",10,11.95,119.5,3.2862499999999999,32.862499999999997]
[null,123,1,"Meier","Schulte","Süd",11,11.95,131.44999999999999,2.2585500000000001,24.844049999999999]
[null,123,1,"Feier","Schulte","Süd",12,11.7,140.4,3.2174999999999998,38.61]
[null,123,1,"Kader","Hunter","Süd",25,11.7,292.5,2.2113,55.282499999999999]
[null,123,1,"Wager","Hunter","Süd",77,12.1,931.7,3.3275000000000001,256.21749999999997]
[null,123,1,"Loch","Hunter","Süd",33,13.4,442.2,2.5326,83.575800000000001]
[null,123,1,"Koch","Hunter","Süd",10,12.1,121,3.3275000000000001,33.274999999999999]
[null,123,1,"Block","Hunter","Süd",11,9.99,109.89,1.88811,20.769210000000001]
[null,125,1,"Bunt","Hunter","Süd",12,12.95,155.4,3.5612499999999998,42.734999999999999]
[null,125,1,"Meier","Hunter","Süd",25,14.95,373.75,2.8255499999999998,70.638750000000002]
[null,126,1,"Müller","Voss","Süd",77,14.95,1151.1500000000001,4.1112500000000001,316.56625000000003]
[null,123,1,"Rot","Voss","Süd",33,11.95,394.35,2.2585500000000001,74.532150000000001]
[null,123,1,"Rot","Voss","Süd",10,15.95,159.5,4.3862500000000004,43.862499999999997]
[null,142,1,"Bauer","Seiler","Nord",10,12.95,129.5,2.4475499999999997,24.475499999999997]
[null,142,1,"Müller","Voss","Nord",10,16.95,169.5,4.6612499999999999,46.612499999999997]
[null,143,1,"Rot","Wefler","Nord",10,13.95,139.5,2.6365499999999997,26.365499999999997]
[null,144,1,"Rot","Wefler","Nord",11,17.95,197.45,4.9362500000000002,54.298749999999998]
[null,145,1,"Bauer","Wefler","Nord",12,14.95,179.4,2.8255499999999998,33.906599999999997]
[null,146,1,"Müller","Wefler","Nord",25,18.95,473.75,5.2112499999999997,130.28125]
[null,146,1,"Rot","Wefler","Nord",77,15.95,1228.1500000000001,3.0145499999999998,232.12034999999997]
[null,255,2,"Rot","Seiler","Nord",33,19.95,658.35,5.4862500000000001,181.04624999999999]
[null,255,2,"Bauer","Seiler","Nord",20,16.95,339,3.2035499999999999,64.070999999999998]
[null,255,2,"Müller","Seiler","Nord",20,20.95,419,5.7612500000000004,115.22499999999999]
[null,255,2,"Rot","Voss","Nord",20,17.95,359,3.39255,67.850999999999999]
[null,323,3,"Sauer","Schulte","Süd",20,21.95,439,6.0362499999999999,120.72499999999999]
[null,323,3,"Meier","Schulte","Süd",20,11.95,239,2.2585500000000001,45.170999999999999]
[null,323,3,"Feier","Schulte","Süd",20,11.95,239,3.2862499999999999,65.724999999999994]
[null,323,3,"Kader","Hunter","Süd",20,11.7,234,2.2113,44.225999999999999]
[null,323,3,"Wager","Hunter","Süd",17,11.7,198.9,3.2174999999999998,54.697499999999998]
[null,323,3,"Loch","Hunter","Süd",18,12.1,217.8,2.2869000000000002,41.164200000000001]
[null,323,3,"Koch","Hunter","Süd",19,13.4,254.6,3.6850000000000001,70.015000000000001]
[null,323,3,"Block","Hunter","Süd",20,12.1,242,2.2869000000000002,45.738]
[null,325,3,"Bunt","Hunter","Süd",21,9.99,209.79,2.7472500000000002,57.692250000000001]
[null,325,3,"Meier","Hunter","Süd",22,12.95,284.89999999999998,2.4475499999999997,53.846099999999993]
[null,326,3,"Müller","Voss","Süd",23,14.95,343.85,4.1112500000000001,94.558750000000003]
[null,323,3,"Rot","Voss","Süd",24,14.95,358.8,2.8255499999999998,67.813199999999995]
[null,323,3,"Rot","Voss","Süd",25,14.7,367.5,4.0425000000000004,101.0625]
[null,442,4,"Bauer","Seiler","Nord",10,14.7,147,2.7782999999999998,27.782999999999998]
[null,442,4,"Müller","Voss","Nord",10,15.1,151,4.1524999999999999,41.524999999999999]
[null,443,4,"Rot","Wefler","Nord",10,16.399999999999999,164,3.0995999999999997,30.995999999999995]
[null,444,4,"Rot","Wefler","Nord",11,15.1,166.1,4.1524999999999999,45.677500000000002]
[null,445,4,"Bauer","Wefler","Nord",12,12.99,155.88,2.4551099999999999,29.461320000000001]
[null,446,4,"Müller","Wefler","Nord",25,15.95,398.75,4.3862500000000004,109.65625]
[null,446,4,"Rot","Wefler","Nord",77,17.95,1382.15,3.39255,261.22635000000002]
[null,555,5,"Rot","Seiler","Nord",33,11.95,394.35,3.2862499999999999,108.44625000000001]
[null,555,5,"Bauer","Seiler","Nord",20,11.95,239,2.2585500000000001,45.170999999999999]
[null,556,5,"Müller","Seiler","Nord",20,11.95,239,3.2862499999999999,65.724999999999994]
[null,558,5,"Rot","Voss","Nord",20,11.95,239,2.2585500000000001,45.170999999999999]
[null,623,6,"Sauer","Schulte","Süd",10,19.399999999999999,194,5.335,53.35]
[null,623,6,"Meier","Schulte","Süd",11,18.100000000000001,199.1,3.4209000000000005,37.629900000000006]
[null,623,6,"Feier","Schulte","Süd",12,15.99,191.88,4.3972500000000005,52.76700000000001]
[null,623,6,"Kader","Hunter","Süd",25,18.95,473.75,3.58155,89.538749999999993]
[null,623,6,"Wager","Hunter","Süd",77,20.95,1613.15,5.7612500000000004,443.61624999999998]
[null,623,6,"Loch","Hunter","Süd",33,14.95,493.35,2.8255499999999998,93.243149999999986]
[null,623,6,"Koch","Hunter","Süd",10,14.95,149.5,4.1112500000000001,41.112499999999997]
[null,623,6,"Block","Hunter","Süd",11,14.95,164.45,2.8255499999999998,31.081049999999998]
[null,625,6,"Bunt","Hunter","Süd",12,14.95,179.4,4.1112500000000001,49.335000000000001]
[null,625,6,"Meier","Hunter","Süd",25,22.4,560,4.2336,105.84]
[null,626,6,"Müller","Voss","Süd",18,21.1,379.8,5.8025000000000002,104.44499999999999]
[null,623,6,"Rot","Voss","Süd",33,18.989999999999998,626.66999999999996,3.5891099999999998,118.44063]
[null,623,6,"Rot","Voss","Süd",10,21.95,219.5,6.0362499999999999,60.362499999999997]
[null,642,6,"Bauer","Seiler","Nord",10,23.95,239.5,4.5265500000000003,45.265500000000003]
[null,642,6,"Müller","Voss","Nord",19,17.95,341.05,4.9362500000000002,93.788749999999993]
[null,643,6,"Rot","Wefler","Nord",10,17.95,179.5,3.39255,33.9255]
[null,644,6,"Rot","Wefler","Nord",11,17.95,197.45,4.9362500000000002,54.298749999999998]
[null,645,6,"Bauer","Wefler","Nord",88,17.95,1579.6,3.39255,298.5444]
[null,646,6,"Müller","Wefler","Nord",25,25.4,635,6.9850000000000003,174.625]
[null,646,6,"Rot","Wefler","Nord",77,24.1,1855.7,4.5548999999999999,350.72730000000001]
[null,723,7,"Sauer","Schulte","Süd",110,21.99,2418.9,6.04725,665.19749999999999]
[null,723,7,"Meier","Schulte","Süd",11,24.95,274.45,4.7155499999999995,51.871049999999997]
[null,723,7,"Feier","Schulte","Süd",12,26.95,323.39999999999998,7.4112499999999999,88.935000000000002]
[null,723,7,"Kader","Hunter","Süd",25,20.95,523.75,3.9595499999999997,98.988749999999996]
[null,723,7,"Wager","Hunter","Süd",77,20.95,1613.15,5.7612500000000004,443.61624999999998]
[null,723,7,"Loch","Hunter","Süd",100,20.95,2095,3.9595499999999997,395.95499999999998]
[null,723,7,"Koch","Hunter","Süd",10,20.95,209.5,5.7612500000000004,57.612499999999997]
[null,723,7,"Block","Hunter","Süd",11,28.4,312.39999999999998,5.3675999999999995,59.043599999999998]
[null,725,7,"Bunt","Hunter","Süd",12,27.1,325.2,7.4524999999999997,89.43]
[null,725,7,"Meier","Hunter","Süd",25,24.99,624.75,4.7231100000000001,118.07775000000001]
[null,726,7,"Müller","Voss","Süd",77,27.95,2152.15,7.6862500000000002,591.84124999999995]
[null,723,7,"Rot","Voss","Süd",50,29.95,1497.5,5.6605499999999997,283.02749999999997]
[null,723,7,"Rot","Voss","Süd",10,23.95,239.5,6.5862499999999997,65.862499999999997]
[null,742,7,"Bauer","Seiler","Nord",10,23.95,239.5,4.5265500000000003,45.265500000000003]
[null,742,7,"Müller","Voss","Nord",10,23.95,239.5,6.5862499999999997,65.862499999999997]
[null,743,7,"Rot","Wefler","Nord",70,23.95,1676.5,4.5265500000000003,316.85850000000005]
[null,744,7,"Rot","Wefler","Nord",11,31.4,345.4,8.6349999999999998,94.984999999999999]
[null,845,8,"Bauer","Wefler","Nord",12,30.1,361.2,5.6889000000000003,68.266800000000003]
[null,846,8,"Müller","Wefler","Nord",25,27.99,699.75,7.6972500000000004,192.43125000000001]
[null,846,8,"Rot","Wefler","Nord",77,30.95,2383.15,5.8495499999999998,450.41534999999999]
[null,823,8,"Sauer","Schulte","Süd",30,32.950000000000003,988.5,9.0612499999999994,271.83749999999998]
[null,823,8,"Meier","Schulte","Süd",11,26.95,296.45,5.0935499999999996,56.029049999999998]
[null,823,8,"Feier","Schulte","Süd",12,26.95,323.39999999999998,7.4112499999999999,88.935000000000002]
[null,823,8,"Kader","Hunter","Süd",25,11.7,292.5,2.2113,55.282499999999999]
[null,823,8,"Wager","Hunter","Süd",77,12.1,931.7,3.3275000000000001,256.21749999999997]
[null,823,8,"Loch","Hunter","Süd",33,13.4,442.2,2.5326,83.575800000000001]
[null,823,8,"Koch","Hunter","Süd",10,12.1,121,3.3275000000000001,33.274999999999999]
[null,823,8,"Block","Hunter","Süd",11,11.95,131.44999999999999,2.2585500000000001,24.844049999999999]
[null,825,8,"Bunt","Hunter","Süd",12,11.95,143.4,3.2862499999999999,39.435000000000002]
[null,825,8,"Meier","Hunter","Süd",25,35.950000000000003,898.75,6.794550000000001,169.86375000000001]
[null,826,8,"Müller","Voss","Süd",77,29.95,2306.15,8.2362500000000001,634.19124999999997]
[null,823,8,"Rot","Voss","Süd",33,29.95,988.35,5.6605499999999997,186.79814999999999]
[null,823,8,"Rot","Voss","Süd",10,14.7,147,4.0425000000000004,40.424999999999997]
[null,842,8,"Bauer","Seiler","Nord",10,15.1,151,2.8538999999999999,28.538999999999998]
[null,842,8,"Müller","Voss","Nord",10,16.399999999999999,164,4.51,45.1]
[null,843,8,"Rot","Wefler","Nord",10,15.1,151,2.8538999999999999,28.538999999999998]
[null,844,8,"Rot","Wefler","Nord",11,14.95,164.45,4.1112500000000001,45.223750000000003]
[null,845,8,"Bauer","Wefler","Nord",12,11.95,143.4,2.2585500000000001,27.102600000000002]
[null,846,8,"Müller","Wefler","Nord",25,11.95,298.75,3.2862499999999999,82.15625]
[null,846,8,"Rot","Wefler","Nord",77,32.950000000000003,2537.15,6.2275500000000008,479.52135000000004]
[null,823,8,"Sauer","Schulte","Süd",10,32.950000000000003,329.5,9.0612499999999994,90.612499999999997]
[null,823,8,"Meier","Schulte","Süd",11,17.7,194.7,3.3452999999999999,36.798299999999998]
[null,823,8,"Feier","Schulte","Süd",12,18.100000000000001,217.2,4.9775,59.73]
[null,823,8,"Kader","Hunter","Süd",25,19.399999999999999,485,3.6665999999999999,91.665000000000006]
[null,823,8,"Wager","Hunter","Süd",77,18.100000000000001,1393.7,4.9775,383.26749999999998]
[null,823,8,"Loch","Hunter","Süd",33,17.95,592.35,3.39255,111.95415]
[null,823,8,"Koch","Hunter","Süd",10,14.95,149.5,4.1112500000000001,41.112499999999997]
[null,823,8,"Block","Hunter","Süd",11,11.95,131.44999999999999,2.2585500000000001,24.844049999999999]
[null,825,8,"Bunt","Hunter","Süd",12,11.95,143.4,3.2862499999999999,39.435000000000002]
[null,825,8,"Meier","Hunter","Süd",25,35.950000000000003,898.75,6.794550000000001,169.86375000000001]
[null,826,8,"Müller","Voss","Süd",77,20.7,1593.9,5.6924999999999999,438.32249999999999]
[null,823,8,"Rot","Voss","Süd",33,21.1,696.3,3.9879000000000002,131.60070000000002]
[null,823,8,"Rot","Voss","Süd",10,22.4,224,6.16,61.6]
[null,942,9,"Bauer","Seiler","Nord",10,21.1,211,3.9879000000000002,39.879000000000005]
[null,942,9,"Müller","Voss","Nord",10,20.95,209.5,5.7612500000000004,57.612499999999997]
[null,943,9,"Rot","Wefler","Nord",10,17.95,179.5,3.39255,33.9255]
[null,944,9,"Rot","Wefler","Nord",11,14.95,164.45,4.1112500000000001,45.223750000000003]
[null,945,9,"Bauer","Wefler","Nord",12,11.95,143.4,2.2585500000000001,27.102600000000002]
[null,946,9,"Müller","Wefler","Nord",25,12.99,324.75,3.5722500000000004,89.306250000000006]
[null,946,9,"Rot","Wefler","Nord",77,13.05,1004.85,2.46645,189.91665]
[null,223,2,"Sauer","Schulte","Süd",20,22.95,494,6.3112500000000002,126.22499999999999]
[null,223,2,"Meier","Schulte","Süd",22,22.95,528,4.3375500000000002,95.426100000000005]
[null,223,2,"Feier","Schulte","Süd",22,22.7,528,6.2424999999999997,137.33500000000001]
[null,223,2,"Kader","Hunter","Süd",25,22.7,504,4.2903000000000002,107.25749999999999]
[null,223,2,"Wager","Hunter","Süd",77,22.2,548.9,6.1050000000000004,470.08499999999998]
[null,223,2,"Loch","Hunter","Süd",33,23.4,504.9,4.4226000000000001,145.94579999999999]
[null,223,2,"Koch","Hunter","Süd",20,22.2,573.75,6.1050000000000004,122.1]
[null,223,2,"Block","Hunter","Süd",22,9.99,2537.15,1.88811,41.538420000000002]
[null,225,2,"Bunt","Hunter","Süd",22,22.95,659,6.3112500000000002,138.8475]
[null,225,2,"Meier","Hunter","Süd",25,24.95,609.4,4.7155499999999995,117.88875]
[null,226,2,"Müller","Voss","Süd",77,24.95,620.4,6.8612500000000001,528.31624999999997]
[null,223,2,"Rot","Voss","Süd",33,22.95,2171.4,4.3375500000000002,143.13915]
[null,223,2,"Rot","Voss","Süd",20,25.95,2171.4,7.1362500000000004,142.72499999999999]
[null,242,2,"Bauer","Seiler","Nord",20,22.95,922.35,4.3375500000000002,86.751000000000005]
[null,242,2,"Müller","Voss","Nord",20,26.95,499,7.4112499999999999,148.22499999999999]
[null,243,2,"Rot","Wefler","Nord",20,23.95,504.9,4.5265500000000003,90.531000000000006]
[null,244,2,"Rot","Wefler","Nord",22,27.95,504.9,7.6862500000000002,169.0975]
[null,245,2,"Bauer","Wefler","Nord",22,24.95,898.75,4.7155499999999995,103.74209999999999]
[null,246,2,"Müller","Wefler","Nord",25,28.95,1593.9,7.9612499999999997,199.03125]
[null,246,2,"Rot","Wefler","Nord",77,25.95,732.6,4.9045499999999995,377.65034999999995]
[null,255,2,"Rot","Seiler","Nord",33,29.95,448,8.2362500000000001,271.79624999999999]
[null,255,2,"Bauer","Seiler","Nord",20,26.95,419,5.0935499999999996,101.871]
[null,255,2,"Müller","Seiler","Nord",20,20.95,419,5.7612500000000004,115.22499999999999]
[null,255,2,"Rot","Voss","Nord",20,27.95,559,5.2825499999999996,105.651]
[null,323,3,"Sauer","Schulte","Süd",20,22.95,548.9,6.3112500000000002,126.22499999999999]
[null,323,3,"Meier","Schulte","Süd",20,22.95,504.9,4.3375500000000002,86.751000000000005]
[null,323,3,"Feier","Schulte","Süd",20,22.95,574.75,6.3112500000000002,126.22499999999999]
[null,323,3,"Kader","Hunter","Süd",20,22.7,1774.85,4.2903000000000002,85.806000000000012]
[null,323,3,"Wager","Hunter","Süd",27,22.7,612.9,6.2424999999999997,168.54750000000001]
[null,323,3,"Loch","Hunter","Süd",28,22.2,621.6,4.1958000000000002,117.48240000000001]
[null,323,3,"Koch","Hunter","Süd",29,23.4,678.6,6.4349999999999996,186.61500000000001]
[null,323,3,"Block","Hunter","Süd",20,22.2,444,4.1958000000000002,83.915999999999997]
[null,325,3,"Bunt","Hunter","Süd",22,9.99,219.78,2.7472500000000002,60.439500000000002]
[null,325,3,"Meier","Hunter","Süd",22,22.95,504.9,4.3375500000000002,95.426100000000005]
[null,326,3,"Müller","Voss","Süd",23,24.95,573.85,6.8612500000000001,157.80875]
[null,323,3,"Rot","Voss","Süd",24,24.95,598.79999999999995,4.7155499999999995,113.17319999999998]
[null,323,3,"Rot","Voss","Süd",25,24.7,617.5,6.7925000000000004,169.8125]
[null,442,4,"Bauer","Seiler","Nord",20,24.7,494,4.6683000000000003,93.366000000000014]
[null,442,4,"Müller","Voss","Nord",20,25.2,504,6.93,138.6]
[null,443,4,"Rot","Wefler","Nord",20,26.4,528,4.9895999999999994,99.791999999999987]
[null,444,4,"Rot","Wefler","Nord",22,25.2,554.4,6.93,152.46]
[null,445,4,"Bauer","Wefler","Nord",22,22.99,505.78,4.34511,95.592420000000004]
[null,446,4,"Müller","Wefler","Nord",25,25.95,648.75,7.1362500000000004,178.40625]
[null,446,4,"Rot","Wefler","Nord",77,27.95,2152.15,5.2825499999999996,406.75635]
[null,555,5,"Rot","Seiler","Nord",33,22.95,757.35,6.3112500000000002,208.27125000000001]
[null,555,5,"Bauer","Seiler","Nord",20,22.95,459,4.3375500000000002,86.751000000000005]
[null,556,5,"Müller","Seiler","Nord",20,22.95,459,6.3112500000000002,126.22499999999999]
[null,558,5,"Rot","Voss","Nord",20,22.95,459,4.3375500000000002,86.751000000000005]
[null,623,6,"Sauer","Schulte","Süd",20,29.4,588,8.0850000000000009,161.69999999999999]
[null,623,6,"Meier","Schulte","Süd",22,28.2,620.4,5.3297999999999996,117.25559999999999]
[null,623,6,"Feier","Schulte","Süd",22,25.99,571.78,7.1472500000000005,157.23950000000002]
[null,623,6,"Kader","Hunter","Süd",25,28.95,723.75,5.4715499999999997,136.78874999999999]
[null,623,6,"Wager","Hunter","Süd",77,20.95,1613.15,5.7612500000000004,443.61624999999998]
[null,623,6,"Loch","Hunter","Süd",33,24.95,823.35,4.7155499999999995,155.61314999999999]
[null,623,6,"Koch","Hunter","Süd",20,24.95,499,6.8612500000000001,137.22499999999999]
[null,623,6,"Block","Hunter","Süd",22,24.95,548.9,4.7155499999999995,103.74209999999999]
[null,625,6,"Bunt","Hunter","Süd",22,24.95,548.9,6.8612500000000001,150.94749999999999]
[null,625,6,"Meier","Hunter","Süd",25,22.4,560,4.2336,105.84]
[null,626,6,"Müller","Voss","Süd",28,22.2,621.6,6.1050000000000004,170.94]
[null,623,6,"Rot","Voss","Süd",33,28.99,956.67,5.4791099999999995,180.81062999999997]
[null,623,6,"Rot","Voss","Süd",20,22.95,459,6.3112500000000002,126.22499999999999]
[null,642,6,"Bauer","Seiler","Nord",20,23.95,479,4.5265500000000003,90.531000000000006]
[null,642,6,"Müller","Voss","Nord",29,27.95,810.55,7.6862500000000002,222.90125]
[null,643,6,"Rot","Wefler","Nord",20,27.95,559,5.2825499999999996,105.651]
[null,644,6,"Rot","Wefler","Nord",22,27.95,614.9,7.6862500000000002,169.0975]
[null,645,6,"Bauer","Wefler","Nord",88,27.95,2459.6,5.2825499999999996,464.86439999999999]
[null,646,6,"Müller","Wefler","Nord",25,25.4,635,6.9850000000000003,174.625]
[null,646,6,"Rot","Wefler","Nord",77,24.2,1863.4,4.5738000000000003,352.18260000000004]
[null,723,7,"Sauer","Schulte","Süd",220,22.99,5057.8,6.3222500000000004,1390.895]
[null,723,7,"Meier","Schulte","Süd",22,24.95,548.9,4.7155499999999995,103.74209999999999]
[null,723,7,"Feier","Schulte","Süd",22,26.95,592.9,7.4112499999999999,163.04750000000001]
[null,723,7,"Kader","Hunter","Süd",25,20.95,523.75,3.9595499999999997,98.988749999999996]
[null,723,7,"Wager","Hunter","Süd",77,20.95,1613.15,5.7612500000000004,443.61624999999998]
[null,723,7,"Loch","Hunter","Süd",200,20.95,4190,3.9595499999999997,791.91]
[null,723,7,"Koch","Hunter","Süd",20,20.95,419,5.7612500000000004,115.22499999999999]
[null,723,7,"Block","Hunter","Süd",22,28.4,624.79999999999995,5.3675999999999995,118.0872]
[null,725,7,"Bunt","Hunter","Süd",22,27.2,598.4,7.48,164.56]
[null,725,7,"Meier","Hunter","Süd",25,24.99,624.75,4.7231100000000001,118.07775000000001]
[null,726,7,"Müller","Voss","Süd",77,27.95,2152.15,7.6862500000000002,591.84124999999995]
[null,723,7,"Rot","Voss","Süd",50,29.95,1497.5,5.6605499999999997,283.02749999999997]
[null,723,7,"Rot","Voss","Süd",20,23.95,479,6.5862499999999997,131.72499999999999]
[null,742,7,"Bauer","Seiler","Nord",20,23.95,479,4.5265500000000003,90.531000000000006]
[null,742,7,"Müller","Voss","Nord",20,23.95,479,6.5862499999999997,131.72499999999999]
[null,743,7,"Rot","Wefler","Nord",70,23.95,1676.5,4.5265500000000003,316.85850000000005]
[null,744,7,"Rot","Wefler","Nord",22,32.4,712.8,8.91,196.02]
[null,845,8,"Bauer","Wefler","Nord",22,30.2,664.4,5.7077999999999998,125.57159999999999]
[null,846,8,"Müller","Wefler","Nord",25,27.99,699.75,7.6972500000000004,192.43125000000001]
[null,846,8,"Rot","Wefler","Nord",77,30.95,2383.15,5.8495499999999998,450.41534999999999]
[null,823,8,"Sauer","Schulte","Süd",30,32.950000000000003,988.5,9.0612499999999994,271.83749999999998]
[null,823,8,"Meier","Schulte","Süd",22,26.95,592.9,5.0935499999999996,112.0581]
[null,823,8,"Feier","Schulte","Süd",22,26.95,592.9,7.4112499999999999,163.04750000000001]
[null,823,8,"Kader","Hunter","Süd",25,22.7,567.5,4.2903000000000002,107.25749999999999]
[null,823,8,"Wager","Hunter","Süd",77,22.2,1709.4,6.1050000000000004,470.08499999999998]
[null,823,8,"Loch","Hunter","Süd",33,23.4,772.2,4.4226000000000001,145.94579999999999]
[null,823,8,"Koch","Hunter","Süd",20,22.2,444,6.1050000000000004,122.1]
[null,823,8,"Block","Hunter","Süd",22,22.95,504.9,4.3375500000000002,95.426100000000005]
[null,825,8,"Bunt","Hunter","Süd",22,22.95,504.9,6.3112500000000002,138.8475]
[null,825,8,"Meier","Hunter","Süd",25,35.950000000000003,898.75,6.794550000000001,169.86375000000001]
[null,826,8,"Müller","Voss","Süd",77,29.95,2306.15,8.2362500000000001,634.19124999999997]
[null,823,8,"Rot","Voss","Süd",33,29.95,988.35,5.6605499999999997,186.79814999999999]
[null,823,8,"Rot","Voss","Süd",20,24.7,494,6.7925000000000004,135.85]
[null,842,8,"Bauer","Seiler","Nord",20,25.2,528,4.7627999999999995,95.255999999999986]
[null,842,8,"Müller","Voss","Nord",20,26.4,528,7.26,145.19999999999999]
[null,843,8,"Rot","Wefler","Nord",20,25.2,504,4.7627999999999995,95.255999999999986]
[null,844,8,"Rot","Wefler","Nord",22,24.95,548.9,6.8612500000000001,150.94749999999999]
[null,845,8,"Bauer","Wefler","Nord",22,22.95,504.9,4.3375500000000002,95.426100000000005]
[null,846,8,"Müller","Wefler","Nord",25,22.95,573.75,6.3112500000000002,157.78125]
[null,846,8,"Rot","Wefler","Nord",77,32.950000000000003,2537.15,6.2275500000000008,479.52135000000004]
[null,823,8,"Sauer","Schulte","Süd",20,32.950000000000003,659,9.0612499999999994,181.22499999999999]
[null,823,8,"Meier","Schulte","Süd",22,27.7,609.4,5.2352999999999996,115.17659999999999]
[null,823,8,"Feier","Schulte","Süd",22,28.2,620.4,7.7549999999999999,170.61]
[null,823,8,"Kader","Hunter","Süd",25,29.4,2171.4,5.5565999999999995,138.91499999999999]
[null,823,8,"Wager","Hunter","Süd",77,28.2,2171.4,7.7549999999999999,597.13499999999999]
[null,823,8,"Loch","Hunter","Süd",33,27.95,922.35,5.2825499999999996,174.32414999999997]
[null,123,1,"Sauer","Schulte","Süd",10,11.95,119.5,3.2862499999999999,32.862499999999997]
[null,123,1,"Meier","Schulte","Süd",11,11.95,131.44999999999999,2.2585500000000001,24.844049999999999]
[null,123,1,"Feier","Schulte","Süd",12,11.7,140.4,3.2174999999999998,38.61]
[null,123,1,"Kader","Hunter","Süd",25,11.7,292.5,2.2113,55.282499999999999]
[null,123,1,"Wager","Hunter","Süd",77,12.1,931.7,3.3275000000000001,256.21749999999997]
[null,123,1,"Loch","Hunter","Süd",33,13.4,442.2,2.5326,83.575800000000001]
[null,123,1,"Koch","Hunter","Süd",10,12.1,121,3.3275000000000001,33.274999999999999]
[null,123,1,"Block","Hunter","Süd",11,9.99,109.89,1.88811,20.769210000000001]
[null,125,1,"Bunt","Hunter","Süd",12,12.95,155.4,3.5612499999999998,42.734999999999999]
[null,125,1,"Meier","Hunter","Süd",25,14.95,373.75,2.8255499999999998,70.638750000000002]
[null,126,1,"Müller","Voss","Süd",77,14.95,1151.1500000000001,4.1112500000000001,316.56625000000003]
[null,123,1,"Rot","Voss","Süd",33,11.95,394.35,2.2585500000000001,74.532150000000001]
[null,123,1,"Rot","Voss","Süd",10,15.95,159.5,4.3862500000000004,43.862499999999997]
[null,142,1,"Bauer","Seiler","Nord",10,12.95,129.5,2.4475499999999997,24.475499999999997]
[null,142,1,"Müller","Voss","Nord",10,16.95,169.5,4.6612499999999999,46.612499999999997]
[null,143,1,"Rot","Wefler","Nord",10,13.95,139.5,2.6365499999999997,26.365499999999997]
[null,144,1,"Rot","Wefler","Nord",11,17.95,197.45,4.9362500000000002,54.298749999999998]
[null,145,1,"Bauer","Wefler","Nord",12,14.95,179.4,2.8255499999999998,33.906599999999997]
[null,146,1,"Müller","Wefler","Nord",25,18.95,473.75,5.2112499999999997,130.28125]
[null,146,1,"Rot","Wefler","Nord",77,15.95,1228.1500000000001,3.0145499999999998,232.12034999999997]
[null,255,2,"Rot","Seiler","Nord",33,19.95,658.35,5.4862500000000001,181.04624999999999]
[null,255,2,"Bauer","Seiler","Nord",20,16.95,339,3.2035499999999999,64.070999999999998]
[null,255,2,"Müller","Seiler","Nord",20,20.95,419,5.7612500000000004,115.22499999999999]
[null,255,2,"Rot","Voss","Nord",20,17.95,359,3.39255,67.850999999999999]
[null,323,3,"Sauer","Schulte","Süd",20,21.95,439,6.0362499999999999,120.72499999999999]
[null,323,3,"Meier","Schulte","Süd",20,11.95,239,2.2585500000000001,45.170999999999999]
[null,323,3,"Feier","Schulte","Süd",20,11.95,239,3.2862499999999999,65.724999999999994]
[null,323,3,"Kader","Hunter","Süd",20,11.7,234,2.2113,44.225999999999999]
[null,323,3,"Wager","Hunter","Süd",17,11.7,198.9,3.2174999999999998,54.697499999999998]
[null,323,3,"Loch","Hunter","Süd",18,12.1,217.8,2.2869000000000002,41.164200000000001]
[null,323,3,"Koch","Hunter","Süd",19,13.4,254.6,3.6850000000000001,70.015000000000001]
[null,323,3,"Block","Hunter","Süd",20,12.1,242,2.2869000000000002,45.738]
[null,325,3,"Bunt","Hunter","Süd",21,9.99,209.79,2.7472500000000002,57.692250000000001]
[null,325,3,"Meier","Hunter","Süd",22,12.95,284.89999999999998,2.4475499999999997,53.846099999999993]
[null,326,3,"Müller","Voss","Süd",23,14.95,343.85,4.1112500000000001,94.558750000000003]
[null,323,3,"Rot","Voss","Süd",24,14.95,358.8,2.8255499999999998,67.813199999999995]
[null,323,3,"Rot","Voss","Süd",25,14.7,367.5,4.0425000000000004,101.0625]
[null,442,4,"Bauer","Seiler","Nord",10,14.7,147,2.7782999999999998,27.782999999999998]
[null,442,4,"Müller","Voss","Nord",10,15.1,151,4.1524999999999999,41.524999999999999]
[null,443,4,"Rot","Wefler","Nord",10,16.399999999999999,164,3.0995999999999997,30.995999999999995]
[null,444,4,"Rot","Wefler","Nord",11,15.1,166.1,4.1524999999999999,45.677500000000002]
[null,445,4,"Bauer","Wefler","Nord",12,12.99,155.88,2.4551099999999999,29.461320000000001]
[null,446,4,"Müller","Wefler","Nord",25,15.95,398.75,4.3862500000000004,109.65625]
[null,446,4,"Rot","Wefler","Nord",77,17.95,1382.15,3.39255,261.22635000000002]
[null,555,5,"Rot","Seiler","Nord",33,11.95,394.35,3.2862499999999999,108.44625000000001]
[null,555,5,"Bauer","Seiler","Nord",20,11.95,239,2.2585500000000001,45.170999999999999]
[null,556,5,"Müller","Seiler","Nord",20,11.95,239,3.2862499999999999,65.724999999999994]
[null,558,5,"Rot","Voss","Nord",20,11.95,239,2.2585500000000001,45.170999999999999]
[null,623,6,"Sauer","Schulte","Süd",10,19.399999999999999,194,5.335,53.35]
[null,623,6,"Meier","Schulte","Süd",11,18.100000000000001,199.1,3.4209000000000005,37.629900000000006]
[null,623,6,"Feier","Schulte","Süd",12,15.99,191.88,4.3972500000000005,52.76700000000001]
[null,623,6,"Kader","Hunter","Süd",25,18.95,473.75,3.58155,89.538749999999993]
[null,623,6,"Wager","Hunter","Süd",77,20.95,1613.15,5.7612500000000004,443.61624999999998]
[null,623,6,"Loch","Hunter","Süd",33,14.95,493.35,2.8255499999999998,93.243149999999986]
[null,623,6,"Koch","Hunter","Süd",10,14.95,149.5,4.1112500000000001,41.112499999999997]
[null,623,6,"Block","Hunter","Süd",11,14.95,164.45,2.8255499999999998,31.081049999999998]
[null,625,6,"Bunt","Hunter","Süd",12,14.95,179.4,4.1112500000000001,49.335000000000001]
[null,625,6,"Meier","Hunter","Süd",25,22.4,560,4.2336,105.84]
[null,626,6,"Müller","Voss","Süd",18,21.1,379.8,5.8025000000000002,104.44499999999999]
[null,623,6,"Rot","Voss","Süd",33,18.989999999999998,626.66999999999996,3.5891099999999998,118.44063]
[null,623,6,"Rot","Voss","Süd",10,21.95,219.5,6.0362499999999999,60.362499999999997]
[null,642,6,"Bauer","Seiler","Nord",10,23.95,239.5,4.5265500000000003,45.265500000000003]
[null,642,6,"Müller","Voss","Nord",19,17.95,341.05,4.9362500000000002,93.788749999999993]
[null,643,6,"Rot","Wefler","Nord",10,17.95,179.5,3.39255,33.9255]
[null,644,6,"Rot","Wefler","Nord",11,17.95,197.45,4.9362500000000002,54.298749999999998]
[null,645,6,"Bauer","Wefler","Nord",88,17.95,1579.6,3.39255,298.5444]
[null,646,6,"Müller","Wefler","Nord",25,25.4,635,6.9850000000000003,174.625]
[null,646,6,"Rot","Wefler","Nord",77,24.1,1855.7,4.5548999999999999,350.72730000000001]
[null,723,7,"Sauer","Schulte","Süd",110,21.99,2418.9,6.04725,665.19749999999999]
[null,723,7,"Meier","Schulte","Süd",11,24.95,274.45,4.7155499999999995,51.871049999999997]
[null,723,7,"Feier","Schulte","Süd",12,26.95,323.39999999999998,7.4112499999999999,88.935000000000002]
[null,723,7,"Kader","Hunter","Süd",25,20.95,523.75,3.9595499999999997,98.988749999999996]
[null,723,7,"Wager","Hunter","Süd",77,20.95,1613.15,5.7612500000000004,443.61624999999998]
[null,723,7,"Loch","Hunter","Süd",100,20.95,2095,3.9595499999999997,395.95499999999998]
[null,723,7,"Koch","Hunter","Süd",10,20.95,209.5,5.7612500000000004,57.612499999999997]
[null,723,7,"Block","Hunter","Süd",11,28.4,312.39999999999998,5.3675999999999995,59.043599999999998]
[null,725,7,"Bunt","Hunter","Süd",12,27.1,325.2,7.4524999999999997,89.43]
[null,725,7,"Meier","Hunter","Süd",25,24.99,624.75,4.7231100000000001,118.07775000000001]
[null,726,7,"Müller","Voss","Süd",77,27.95,2152.15,7.6862500000000002,591.84124999999995]
[null,723,7,"Rot","Voss","Süd",50,29.95,1497.5,5.6605499999999997,283.02749999999997]
[null,723,7,"Rot","Voss","Süd",10,23.95,239.5,6.5862499999999997,65.862499999999997]
[null,742,7,"Bauer","Seiler","Nord",10,23.95,239.5,4.5265500000000003,45.265500000000003]
[null,742,7,"Müller","Voss","Nord",10,23.95,239.5,6.5862499999999997,65.862499999999997]
[null,743,7,"Rot","Wefler","Nord",70,23.95,1676.5,4.5265500000000003,316.85850000000005]
[null,744,7,"Rot","Wefler","Nord",11,31.4,345.4,8.6349999999999998,94.984999999999999]
[null,845,8,"Bauer","Wefler","Nord",12,30.1,361.2,5.6889000000000003,68.266800000000003]
[null,846,8,"Müller","Wefler","Nord",25,27.99,699.75,7.6972500000000004,192.43125000000001]
[null,846,8,"Rot","Wefler","Nord",77,30.95,2383.15,5.8495499999999998,450.41534999999999]
[null,823,8,"Sauer","Schulte","Süd",30,32.950000000000003,988.5,9.0612499999999994,271.83749999999998]
[null,823,8,"Meier","Schulte","Süd",11,26.95,296.45,5.0935499999999996,56.029049999999998]
[null,823,8,"Feier","Schulte","Süd",12,26.95,323.39999999999998,7.4112499999999999,88.935000000000002]
[null,823,8,"Kader","Hunter","Süd",25,11.7,292.5,2.2113,55.282499999999999]
[null,823,8,"Wager","Hunter","Süd",77,12.1,931.7,3.3275000000000001,256.21749999999997]
[null,823,8,"Loch","Hunter","Süd",33,13.4,442.2,2.5326,83.575800000000001]
[null,823,8,"Koch","Hunter","Süd",10,12.1,121,3.3275000000000001,33.274999999999999]
[null,823,8,"Block","Hunter","Süd",11,11.95,131.44999999999999,2.2585500000000001,24.844049999999999]
[null,825,8,"Bunt","Hunter","Süd",12,11.95,143.4,3.2862499999999999,39.435000000000002]
[null,825,8,"Meier","Hunter","Süd",25,35.950000000000003,898.75,6.794550000000001,169.86375000000001]
[null,826,8,"Müller","Voss","Süd",77,29.95,2306.15,8.2362500000000001,634.19124999999997]
[null,823,8,"Rot","Voss","Süd",33,29.95,988.35,5.6605499999999997,186.79814999999999]
[null,823,8,"Rot","Voss","Süd",10,14.7,147,4.0425000000000004,40.424999999999997]
[null,842,8,"Bauer","Seiler","Nord",10,15.1,151,2.8538999999999999,28.538999999999998]
[null,842,8,"Müller","Voss","Nord",10,16.399999999999999,164,4.51,45.1]
[null,843,8,"Rot","Wefler","Nord",10,15.1,151,2.8538999999999999,28.538999999999998]
[null,844,8,"Rot","Wefler","Nord",11,14.95,164.45,4.1112500000000001,45.223750000000003]
[null,845,8,"Bauer","Wefler","Nord",12,11.95,143.4,2.2585500000000001,27.102600000000002]
[null,846,8,"Müller","Wefler","Nord",25,11.95,298.75,3.2862499999999999,82.15625]
[null,846,8,"Rot","Wefler","Nord",77,32.950000000000003,2537.15,6.2275500000000008,479.52135000000004]
[null,823,8,"Sauer","Schulte","Süd",10,32.950000000000003,329.5,9.0612499999999994,90.612499999999997]
[null,823,8,"Meier","Schulte","Süd",11,17.7,194.7,3.3452999999999999,36.798299999999998]
[null,823,8,"Feier","Schulte","Süd",12,18.100000000000001,217.2,4.9775,59.73]
[null,823,8,"Kader","Hunter","Süd",25,19.399999999999999,485,3.6665999999999999,91.665000000000006]
[null,823,8,"Wager","Hunter","Süd",77,18.100000000000001,1393.7,4.9775,383.26749999999998]
[null,823,8,"Loch","Hunter","Süd",33,17.95,592.35,3.39255,111.95415]
[null,823,8,"Koch","Hunter","Süd",10,14.95,149.5,4.1112500000000001,41.112499999999997]
[null,823,8,"Block","Hunter","Süd",11,11.95,131.44999999999999,2.2585500000000001,24.844049999999999]
[null,825,8,"Bunt","Hunter","Süd",12,11.95,143.4,3.2862499999999999,39.435000000000002]
[null,825,8,"Meier","Hunter","Süd",25,35.950000000000003,898.75,6.794550000000001,169.86375000000001]
[null,826,8,"Müller","Voss","Süd",77,20.7,1593.9,5.6924999999999999,438.32249999999999]
[null,823,8,"Rot","Voss","Süd",33,21.1,696.3,3.9879000000000002,131.60070000000002]
[null,823,8,"Rot","Voss","Süd",10,22.4,224,6.16,61.6]
[null,942,9,"Bauer","Seiler","Nord",10,21.1,211,3.9879000000000002,39.879000000000005]
[null,942,9,"Müller","Voss","Nord",10,20.95,209.5,5.7612500000000004,57.612499999999997]
[null,943,9,"Rot","Wefler","Nord",10,17.95,179.5,3.39255,33.9255]
[null,944,9,"Rot","Wefler","Nord",11,14.95,164.45,4.1112500000000001,45.223750000000003]
[null,945,9,"Bauer","Wefler","Nord",12,11.95,143.4,2.2585500000000001,27.102600000000002]
[null,946,9,"Müller","Wefler","Nord",25,12.99,324.75,3.5722500000000004,89.306250000000006]
[null,946,9,"Rot","Wefler","Nord",77,13.05,1004.85,2.46645,189.91665]
[null,223,2,"Sauer","Schulte","Süd",20,22.95,494,6.3112500000000002,126.22499999999999]
[null,223,2,"Meier","Schulte","Süd",22,22.95,528,4.3375500000000002,95.426100000000005]
[null,223,2,"Feier","Schulte","Süd",22,22.7,528,6.2424999999999997,137.33500000000001]
[null,223,2,"Kader","Hunter","Süd",25,22.7,504,4.2903000000000002,107.25749999999999]
[null,223,2,"Wager","Hunter","Süd",77,22.2,548.9,6.1050000000000004,470.08499999999998]
[null,223,2,"Loch","Hunter","Süd",33,23.4,504.9,4.4226000000000001,145.94579999999999]
[null,223,2,"Koch","Hunter","Süd",20,22.2,573.75,6.1050000000000004,122.1]
[null,223,2,"Block","Hunter","Süd",22,9.99,2537.15,1.88811,41.538420000000002]
[null,225,2,"Bunt","Hunter","Süd",22,22.95,659,6.3112500000000002,138.8475]
[null,225,2,"Meier","Hunter","Süd",25,24.95,609.4,4.7155499999999995,117.88875]
[null,226,2,"Müller","Voss","Süd",77,24.95,620.4,6.8612500000000001,528.31624999999997]
[null,223,2,"Rot","Voss","Süd",33,22.95,2171.4,4.3375500000000002,143.13915]
[null,223,2,"Rot","Voss","Süd",20,25.95,2171.4,7.1362500000000004,142.72499999999999]
[null,242,2,"Bauer","Seiler","Nord",20,22.95,922.35,4.3375500000000002,86.751000000000005]
[null,242,2,"Müller","Voss","Nord",20,26.95,499,7.4112499999999999,148.22499999999999]
[null,243,2,"Rot","Wefler","Nord",20,23.95,504.9,4.5265500000000003,90.531000000000006]
[null,244,2,"Rot","Wefler","Nord",22,27.95,504.9,7.6862500000000002,169.0975]
[null,245,2,"Bauer","Wefler","Nord",22,24.95,898.75,4.7155499999999995,103.74209999999999]
[null,246,2,"Müller","Wefler","Nord",25,28.95,1593.9,7.9612499999999997,199.03125]
[null,246,2,"Rot","Wefler","Nord",77,25.95,732.6,4.9045499999999995,377.65034999999995]
[null,255,2,"Rot","Seiler","Nord",33,29.95,448,8.2362500000000001,271.79624999999999]
[null,255,2,"Bauer","Seiler","Nord",20,26.95,419,5.0935499999999996,101.871]
[null,255,2,"Müller","Seiler","Nord",20,20.95,419,5.7612500000000004,115.22499999999999]
[null,255,2,"Rot","Voss","Nord",20,27.95,559,5.2825499999999996,105.651]
[null,323,3,"Sauer","Schulte","Süd",20,22.95,548.9,6.3112500000000002,126.22499999999999]
[null,323,3,"Meier","Schulte","Süd",20,22.95,504.9,4.3375500000000002,86.751000000000005]
[null,323,3,"Feier","Schulte","Süd",20,22.95,574.75,6.3112500000000002,126.22499999999999]
[null,323,3,"Kader","Hunter","Süd",20,22.7,1774.85,4.2903000000000002,85.806000000000012]
[null,323,3,"Wager","Hunter","Süd",27,22.7,612.9,6.2424999999999997,168.54750000000001]
[null,323,3,"Loch","Hunter","Süd",28,22.2,621.6,4.1958000000000002,117.48240000000001]
[null,323,3,"Koch","Hunter","Süd",29,23.4,678.6,6.4349999999999996,186.61500000000001]
[null,323,3,"Block","Hunter","Süd",20,22.2,444,4.1958000000000002,83.915999999999997]
[null,325,3,"Bunt","Hunter","Süd",22,9.99,219.78,2.7472500000000002,60.439500000000002]
[null,325,3,"Meier","Hunter","Süd",22,22.95,504.9,4.3375500000000002,95.426100000000005]
[null,326,3,"Müller","Voss","Süd",23,24.95,573.85,6.8612500000000001,157.80875]
[null,323,3,"Rot","Voss","Süd",24,24.95,598.79999999999995,4.7155499999999995,113.17319999999998]
[null,323,3,"Rot","Voss","Süd",25,24.7,617.5,6.7925000000000004,169.8125]
[null,442,4,"Bauer","Seiler","Nord",20,24.7,494,4.6683000000000003,93.366000000000014]
[null,442,4,"Müller","Voss","Nord",20,25.2,504,6.93,138.6]
[null,443,4,"Rot","Wefler","Nord",20,26.4,528,4.9895999999999994,99.791999999999987]
[null,444,4,"Rot","Wefler","Nord",22,25.2,554.4,6.93,152.46]
[null,445,4,"Bauer","Wefler","Nord",22,22.99,505.78,4.34511,95.592420000000004]
[null,446,4,"Müller","Wefler","Nord",25,25.95,648.75,7.1362500000000004,178.40625]
[null,446,4,"Rot","Wefler","Nord",77,27.95,2152.15,5.2825499999999996,406.75635]
[null,555,5,"Rot","Seiler","Nord",33,22.95,757.35,6.3112500000000002,208.27125000000001]
[null,555,5,"Bauer","Seiler","Nord",20,22.95,459,4.3375500000000002,86.751000000000005]
[null,556,5,"Müller","Seiler","Nord",20,22.95,459,6.3112500000000002,126.22499999999999]
[null,558,5,"Rot","Voss","Nord",20,22.95,459,4.3375500000000002,86.751000000000005]
[null,623,6,"Sauer","Schulte","Süd",20,29.4,588,8.0850000000000009,161.69999999999999]
[null,623,6,"Meier","Schulte","Süd",22,28.2,620.4,5.3297999999999996,117.25559999999999]
[null,623,6,"Feier","Schulte","Süd",22,25.99,571.78,7.1472500000000005,157.23950000000002]
[null,623,6,"Kader","Hunter","Süd",25,28.95,723.75,5.4715499999999997,136.78874999999999]
[null,623,6,"Wager","Hunter","Süd",77,20.95,1613.15,5.7612500000000004,443.61624999999998]
[null,623,6,"Loch","Hunter","Süd",33,24.95,823.35,4.7155499999999995,155.61314999999999]
[null,623,6,"Koch","Hunter","Süd",20,24.95,499,6.8612500000000001,137.22499999999999]
[null,623,6,"Block","Hunter","Süd",22,24.95,548.9,4.7155499999999995,103.74209999999999]
[null,625,6,"Bunt","Hunter","Süd",22,24.95,548.9,6.8612500000000001,150.94749999999999]
[null,625,6,"Meier","Hunter","Süd",25,22.4,560,4.2336,105.84]
[null,626,6,"Müller","Voss","Süd",28,22.2,621.6,6.1050000000000004,170.94]
[null,623,6,"Rot","Voss","Süd",33,28.99,956.67,5.4791099999999995,180.81062999999997]
[null,623,6,"Rot","Voss","Süd",20,22.95,459,6.3112500000000002,126.22499999999999]
[null,642,6,"Bauer","Seiler","Nord",20,23.95,479,4.5265500000000003,90.531000000000006]
[null,642,6,"Müller","Voss","Nord",29,27.95,810.55,7.6862500000000002,222.90125]
[null,643,6,"Rot","Wefler","Nord",20,27.95,559,5.2825499999999996,105.651]
[null,644,6,"Rot","Wefler","Nord",22,27.95,614.9,7.6862500000000002,169.0975]
[null,645,6,"Bauer","Wefler","Nord",88,27.95,2459.6,5.2825499999999996,464.86439999999999]
[null,646,6,"Müller","Wefler","Nord",25,25.4,635,6.9850000000000003,174.625]
[null,646,6,"Rot","Wefler","Nord",77,24.2,1863.4,4.5738000000000003,352.18260000000004]
[null,723,7,"Sauer","Schulte","Süd",220,22.99,5057.8,6.3222500000000004,1390.895]
[null,723,7,"Meier","Schulte","Süd",22,24.95,548.9,4.7155499999999995,103.74209999999999]
[null,723,7,"Feier","Schulte","Süd",22,26.95,592.9,7.4112499999999999,163.04750000000001]
[null,723,7,"Kader","Hunter","Süd",25,20.95,523.75,3.9595499999999997,98.988749999999996]
[null,723,7,"Wager","Hunter","Süd",77,20.95,1613.15,5.7612500000000004,443.61624999999998]
[null,723,7,"Loch","Hunter","Süd",200,20.95,4190,3.9595499999999997,791.91]
[null,723,7,"Koch","Hunter","Süd",20,20.95,419,5.7612500000000004,115.22499999999999]
[null,723,7,"Block","Hunter","Süd",22,28.4,624.79999999999995,5.3675999999999995,118.0872]
[null,725,7,"Bunt","Hunter","Süd",22,27.2,598.4,7.48,164.56]
[null,725,7,"Meier","Hunter","Süd",25,24.99,624.75,4.7231100000000001,118.07775000000001]
[null,726,7,"Müller","Voss","Süd",77,27.95,2152.15,7.6862500000000002,591.84124999999995]
[null,723,7,"Rot","Voss","Süd",50,29.95,1497.5,5.6605499999999997,283.02749999999997]
[null,723,7,"Rot","Voss","Süd",20,23.95,479,6.5862499999999997,131.72499999999999]
[null,742,7,"Bauer","Seiler","Nord",20,23.95,479,4.5265500000000003,90.531000000000006]
[null,742,7,"Müller","Voss","Nord",20,23.95,479,6.5862499999999997,131.72499999999999]
[null,743,7,"Rot","Wefler","Nord",70,23.95,1676.5,4.5265500000000003,316.85850000000005]
[null,744,7,"Rot","Wefler","Nord",22,32.4,712.8,8.91,196.02]
[null,845,8,"Bauer","Wefler","Nord",22,30.2,664.4,5.7077999999999998,125.57159999999999]
[null,846,8,"Müller","Wefler","Nord",25,27.99,699.75,7.6972500000000004,192.43125000000001]
[null,846,8,"Rot","Wefler","Nord",77,30.95,2383.15,5.8495499999999998,450.41534999999999]
[null,823,8,"Sauer","Schulte","Süd",30,32.950000000000003,988.5,9.0612499999999994,271.83749999999998]
[null,823,8,"Meier","Schulte","Süd",22,26.95,592.9,5.0935499999999996,112.0581]
[null,823,8,"Feier","Schulte","Süd",22,26.95,592.9,7.4112499999999999,163.04750000000001]
[null,823,8,"Kader","Hunter","Süd",25,22.7,567.5,4.2903000000000002,107.25749999999999]
[null,823,8,"Wager","Hunter","Süd",77,22.2,1709.4,6.1050000000000004,470.08499999999998]
[null,823,8,"Loch","Hunter","Süd",33,23.4,772.2,4.4226000000000001,145.94579999999999]
[null,823,8,"Koch","Hunter","Süd",20,22.2,444,6.1050000000000004,122.1]
[null,823,8,"Block","Hunter","Süd",22,22.95,504.9,4.3375500000000002,95.426100000000005]
[null,825,8,"Bunt","Hunter","Süd",22,22.95,504.9,6.3112500000000002,138.8475]
[null,825,8,"Meier","Hunter","Süd",25,35.950000000000003,898.75,6.794550000000001,169.86375000000001]
[null,826,8,"Müller","Voss","Süd",77,29.95,2306.15,8.2362500000000001,634.19124999999997]
[null,823,8,"Rot","Voss","Süd",33,29.95,988.35,5.6605499999999997,186.79814999999999]
[null,823,8,"Rot","Voss","Süd",20,24.7,494,6.7925000000000004,135.85]
[null,842,8,"Bauer","Seiler","Nord",20,25.2,528,4.7627999999999995,95.255999999999986]
[null,842,8,"Müller","Voss","Nord",20,26.4,528,7.26,145.19999999999999]
[null,843,8,"Rot","Wefler","Nord",20,25.2,504,4.7627999999999995,95.255999999999986]
[null,844,8,"Rot","Wefler","Nord",22,24.95,548.9,6.8612500000000001,150.94749999999999]
[null,845,8,"Bauer","Wefler","Nord",22,22.95,504.9,4.3375500000000002,95.426100000000005]
[null,846,8,"Müller","Wefler","Nord",25,22.95,573.75,6.3112500000000002,157.78125]
[null,846,8,"Rot","Wefler","Nord",77,32.950000000000003,2537.15,6.2275500000000008,479.52135000000004]
[null,823,8,"Sauer","Schulte","Süd",20,32.950000000000003,659,9.0612499999999994,181.22499999999999]
[null,823,8,"Meier","Schulte","Süd",22,27.7,609.4,5.2352999999999996,115.17659999999999]
[null,823,8,"Feier","Schulte","Süd",22,28.2,620.4,7.7549999999999999,170.61]
[null,823,8,"Kader","Hunter","Süd",25,29.4,2171.4,5.5565999999999995,138.91499999999999]
[null,823,8,"Wager","Hunter","Süd",77,28.2,2171.4,7.7549999999999999,597.13499999999999]
[null,823,8,"Loch","Hunter","Süd",33,27.95,922.35,5.2825499999999996,174.32414999999997]
[null,123,1,"Sauer","Schulte","Süd",10,11.95,119.5,3.2862499999999999,32.862499999999997]
[null,123,1,"Meier","Schulte","Süd",11,11.95,131.44999999999999,2.2585500000000001,24.844049999999999]
[null,123,1,"Feier","Schulte","Süd",12,11.7,140.4,3.2174999999999998,38.61]
[null,123,1,"Kader","Hunter","Süd",25,11.7,292.5,2.2113,55.282499999999999]
[null,123,1,"Wager","Hunter","Süd",77,12.1,931.7,3.3275000000000001,256.21749999999997]
[null,123,1,"Loch","Hunter","Süd",33,13.4,442.2,2.5326,83.575800000000001]
[null,123,1,"Koch","Hunter","Süd",10,12.1,121,3.3275000000000001,33.274999999999999]
[null,123,1,"Block","Hunter","Süd",11,9.99,109.89,1.88811,20.769210000000001]
[null,125,1,"Bunt","Hunter","Süd",12,12.95,155.4,3.5612499999999998,42.734999999999999]
[null,125,1,"Meier","Hunter","Süd",25,14.95,373.75,2.8255499999999998,70.638750000000002]
[null,126,1,"Müller","Voss","Süd",77,14.95,1151.1500000000001,4.1112500000000001,316.56625000000003]
[null,123,1,"Rot","Voss","Süd",33,11.95,394.35,2.2585500000000001,74.532150000000001]
[null,123,1,"Rot","Voss","Süd",10,15.95,159.5,4.3862500000000004,43.862499999999997]
[null,142,1,"Bauer","Seiler","Nord",10,12.95,129.5,2.4475499999999997,24.475499999999997]
[null,142,1,"Müller","Voss","Nord",10,16.95,169.5,4.6612499999999999,46.612499999999997]
[null,143,1,"Rot","Wefler","Nord",10,13.95,139.5,2.6365499999999997,26.365499999999997]
[null,144,1,"Rot","Wefler","Nord",11,17.95,197.45,4.9362500000000002,54.298749999999998]
[null,145,1,"Bauer","Wefler","Nord",12,14.95,179.4,2.8255499999999998,33.906599999999997]
[null,146,1,"Müller","Wefler","Nord",25,18.95,473.75,5.2112499999999997,130.28125]
[null,146,1,"Rot","Wefler","Nord",77,15.95,1228.1500000000001,3.0145499999999998,232.12034999999997]
[null,255,2,"Rot","Seiler","Nord",33,19.95,658.35,5.4862500000000001,181.04624999999999]
[null,255,2,"Bauer","Seiler","Nord",20,16.95,339,3.2035499999999999,64.070999999999998]
[null,255,2,"Müller","Seiler","Nord",20,20.95,419,5.7612500000000004,115.22499999999999]
[null,255,2,"Rot","Voss","Nord",20,17.95,359,3.39255,67.850999999999999]
[null,323,3,"Sauer","Schulte","Süd",20,21.95,439,6.0362499999999999,120.72499999999999]
[null,323,3,"Meier","Schulte","Süd",20,11.95,239,2.2585500000000001,45.170999999999999]
[null,323,3,"Feier","Schulte","Süd",20,11.95,239,3.2862499999999999,65.724999999999994]
[null,323,3,"Kader","Hunter","Süd",20,11.7,234,2.2113,44.225999999999999]
[null,323,3,"Wager","Hunter","Süd",17,11.7,198.9,3.2174999999999998,54.697499999999998]
[null,323,3,"Loch","Hunter","Süd",18,12.1,217.8,2.2869000000000002,41.164200000000001]
[null,323,3,"Koch","Hunter","Süd",19,13.4,254.6,3.6850000000000001,70.015000000000001]
[null,323,3,"Block","Hunter","Süd",20,12.1,242,2.2869000000000002,45.738]
[null,325,3,"Bunt","Hunter","Süd",21,9.99,209.79,2.7472500000000002,57.692250000000001]
[null,325,3,"Meier","Hunter","Süd",22,12.95,284.89999999999998,2.4475499999999997,53.846099999999993]
[null,326,3,"Müller","Voss","Süd",23,14.95,343.85,4.1112500000000001,94.558750000000003]
[null,323,3,"Rot","Voss","Süd",24,14.95,358.8,2.8255499999999998,67.813199999999995]
[null,323,3,"Rot","Voss","Süd",25,14.7,367.5,4.0425000000000004,101.0625]
[null,442,4,"Bauer","Seiler","Nord",10,14.7,147,2.7782999999999998,27.782999999999998]
[null,442,4,"Müller","Voss","Nord",10,15.1,151,4.1524999999999999,41.524999999999999]
[null,443,4,"Rot","Wefler","Nord",10,16.399999999999999,164,3.0995999999999997,30.995999999999995]
[null,444,4,"Rot","Wefler","Nord",11,15.1,166.1,4.1524999999999999,45.677500000000002]
[null,445,4,"Bauer","Wefler","Nord",12,12.99,155.88,2.4551099999999999,29.461320000000001]
[null,446,4,"Müller","Wefler","Nord",25,15.95,398.75,4.3862500000000004,109.65625]
[null,446,4,"Rot","Wefler","Nord",77,17.95,1382.15,3.39255,261.22635000000002]
[null,555,5,"Rot","Seiler","Nord",33,11.95,394.35,3.2862499999999999,108.44625000000001]
[null,555,5,"Bauer","Seiler","Nord",20,11.95,239,2.2585500000000001,45.170999999999999]
[null,556,5,"Müller","Seiler","Nord",20,11.95,239,3.2862499999999999,65.724999999999994]
[null,558,5,"Rot","Voss","Nord",20,11.95,239,2.2585500000000001,45.170999999999999]
[null,623,6,"Sauer","Schulte","Süd",10,19.399999999999999,194,5.335,53.35]
[null,623,6,"Meier","Schulte","Süd",11,18.100000000000001,199.1,3.4209000000000005,37.629900000000006]
[null,623,6,"Feier","Schulte","Süd",12,15.99,191.88,4.3972500000000005,52.76700000000001]
[null,623,6,"Kader","Hunter","Süd",25,18.95,473.75,3.58155,89.538749999999993]
[null,623,6,"Wager","Hunter","Süd",77,20.95,1613.15,5.7612500000000004,443.61624999999998]
[null,623,6,"Loch","Hunter","Süd",33,14.95,493.35,2.8255499999999998,93.243149999999986]
[null,623,6,"Koch","Hunter","Süd",10,14.95,149.5,4.1112500000000001,41.112499999999997]
[null,623,6,"Block","Hunter","Süd",11,14.95,164.45,2.8255499999999998,31.081049999999998]
[null,625,6,"Bunt","Hunter","Süd",12,14.95,179.4,4.1112500000000001,49.335000000000001]
[null,625,6,"Meier","Hunter","Süd",25,22.4,560,4.2336,105.84]
[null,626,6,"Müller","Voss","Süd",18,21.1,379.8,5.8025000000000002,104.44499999999999]
[null,623,6,"Rot","Voss","Süd",33,18.989999999999998,626.66999999999996,3.5891099999999998,118.44063]
[null,623,6,"Rot","Voss","Süd",10,21.95,219.5,6.0362499999999999,60.362499999999997]
[null,642,6,"Bauer","Seiler","Nord",10,23.95,239.5,4.5265500000000003,45.265500000000003]
[null,642,6,"Müller","Voss","Nord",19,17.95,341.05,4.9362500000000002,93.788749999999993]
[null,643,6,"Rot","Wefler","Nord",10,17.95,179.5,3.39255,33.9255]
[null,644,6,"Rot","Wefler","Nord",11,17.95,197.45,4.9362500000000002,54.298749999999998]
[null,645,6,"Bauer","Wefler","Nord",88,17.95,1579.6,3.39255,298.5444]
[null,646,6,"Müller","Wefler","Nord",25,25.4,635,6.9850000000000003,174.625]
[null,646,6,"Rot","Wefler","Nord",77,24.1,1855.7,4.5548999999999999,350.72730000000001]
[null,723,7,"Sauer","Schulte","Süd",110,21.99,2418.9,6.04725,665.19749999999999]
[null,723,7,"Meier","Schulte","Süd",11,24.95,274.45,4.7155499999999995,51.871049999999997]
[null,723,7,"Feier","Schulte","Süd",12,26.95,323.39999999999998,7.4112499999999999,88.935000000000002]
[null,723,7,"Kader","Hunter","Süd",25,20.95,523.75,3.9595499999999997,98.988749999999996]
[null,723,7,"Wager","Hunter","Süd",77,20.95,1613.15,5.7612500000000004,443.61624999999998]
[null,723,7,"Loch","Hunter","Süd",100,20.95,2095,3.9595499999999997,395.95499999999998]
[null,723,7,"Koch","Hunter","Süd",10,20.95,209.5,5.7612500000000004,57.612499999999997]
[null,723,7,"Block","Hunter","Süd",11,28.4,312.39999999999998,5.3675999999999995,59.043599999999998]
[null,725,7,"Bunt","Hunter","Süd",12,27.1,325.2,7.4524999999999997,89.43]
[null,725,7,"Meier","Hunter","Süd",25,24.99,624.75,4.7231100000000001,118.07775000000001]
[null,726,7,"Müller","Voss","Süd",77,27.95,2152.15,7.6862500000000002,591.84124999999995]
[null,723,7,"Rot","Voss","Süd",50,29.95,1497.5,5.6605499999999997,283.02749999999997]
[null,723,7,"Rot","Voss","Süd",10,23.95,239.5,6.5862499999999997,65.862499999999997]
[null,742,7,"Bauer","Seiler","Nord",10,23.95,239.5,4.5265500000000003,45.265500000000003]
[null,742,7,"Müller","Voss","Nord",10,23.95,239.5,6.5862499999999997,65.862499999999997]
[null,743,7,"Rot","Wefler","Nord",70,23.95,1676.5,4.5265500000000003,316.85850000000005]
[null,744,7,"Rot","Wefler","Nord",11,31.4,345.4,8.6349999999999998,94.984999999999999]
[null,845,8,"Bauer","Wefler","Nord",12,30.1,361.2,5.6889000000000003,68.266800000000003]
[null,846,8,"Müller","Wefler","Nord",25,27.99,699.75,7.6972500000000004,192.43125000000001]
[null,846,8,"Rot","Wefler","Nord",77,30.95,2383.15,5.8495499999999998,450.41534999999999]
[null,823,8,"Sauer","Schulte","Süd",30,32.950000000000003,988.5,9.0612499999999994,271.83749999999998]
[null,823,8,"Meier","Schulte","Süd",11,26.95,296.45,5.0935499999999996,56.029049999999998]
[null,823,8,"Feier","Schulte","Süd",12,26.95,323.39999999999998,7.4112499999999999,88.935000000000002]
[null,823,8,"Kader","Hunter","Süd",25,11.7,292.5,2.2113,55.282499999999999]
[null,823,8,"Wager","Hunter","Süd",77,12.1,931.7,3.3275000000000001,256.21749999999997]
[null,823,8,"Loch","Hunter","Süd",33,13.4,442.2,2.5326,83.575800000000001]
[null,823,8,"Koch","Hunter","Süd",10,12.1,121,3.3275000000000001,33.274999999999999]
[null,823,8,"Block","Hunter","Süd",11,11.95,131.44999999999999,2.2585500000000001,24.844049999999999]
[null,825,8,"Bunt","Hunter","Süd",12,11.95,143.4,3.2862499999999999,39.435000000000002]
[null,825,8,"Meier","Hunter","Süd",25,35.950000000000003,898.75,6.794550000000001,169.86375000000001]
[null,826,8,"Müller","Voss","Süd",77,29.95,2306.15,8.2362500000000001,634.19124999999997]
[null,823,8,"Rot","Voss","Süd",33,29.95,988.35,5.6605499999999997,186.79814999999999]
[null,823,8,"Rot","Voss","Süd",10,14.7,147,4.0425000000000004,40.424999999999997]
[null,842,8,"Bauer","Seiler","Nord",10,15.1,151,2.8538999999999999,28.538999999999998]
[null,842,8,"Müller","Voss","Nord",10,16.399999999999999,164,4.51,45.1]
[null,843,8,"Rot","Wefler","Nord",10,15.1,151,2.8538999999999999,28.538999999999998]
[null,844,8,"Rot","Wefler","Nord",11,14.95,164.45,4.1112500000000001,45.223750000000003]
[null,845,8,"Bauer","Wefler","Nord",12,11.95,143.4,2.2585500000000001,27.102600000000002]
[null,846,8,"Müller","Wefler","Nord",25,11.95,298.75,3.2862499999999999,82.15625]
[null,846,8,"Rot","Wefler","Nord",77,32.950000000000003,2537.15,6.2275500000000008,479.52135000000004]
[null,823,8,"Sauer","Schulte","Süd",10,32.950000000000003,329.5,9.0612499999999994,90.612499999999997]
[null,823,8,"Meier","Schulte","Süd",11,17.7,194.7,3.3452999999999999,36.798299999999998]
[null,823,8,"Feier","Schulte","Süd",12,18.100000000000001,217.2,4.9775,59.73]
[null,823,8,"Kader","Hunter","Süd",25,19.399999999999999,485,3.6665999999999999,91.665000000000006]
[null,823,8,"Wager","Hunter","Süd",77,18.100000000000001,1393.7,4.9775,383.26749999999998]
[null,823,8,"Loch","Hunter","Süd",33,17.95,592.35,3.39255,111.95415]
[null,823,8,"Koch","Hunter","Süd",10,14.95,149.5,4.1112500000000001,41.112499999999997]
[null,823,8,"Block","Hunter","Süd",11,11.95,131.44999999999999,2.2585500000000001,24.844049999999999]
[null,825,8,"Bunt","Hunter","Süd",12,11.95,143.4,3.2862499999999999,39.435000000000002]
[null,825,8,"Meier","Hunter","Süd",25,35.950000000000003,898.75,6.794550000000001,169.86375000000001]
[null,826,8,"Müller","Voss","Süd",77,20.7,1593.9,5.6924999999999999,438.32249999999999]
[null,823,8,"Rot","Voss","Süd",33,21.1,696.3,3.9879000000000002,131.60070000000002]
[null,823,8,"Rot","Voss","Süd",10,22.4,224,6.16,61.6]
[null,942,9,"Bauer","Seiler","Nord",10,21.1,211,3.9879000000000002,39.879000000000005]
[null,942,9,"Müller","Voss","Nord",10,20.95,209.5,5.7612500000000004,57.612499999999997]
[null,943,9,"Rot","Wefler","Nord",10,17.95,179.5,3.39255,33.9255]
[null,944,9,"Rot","Wefler","Nord",11,14.95,164.45,4.1112500000000001,45.223750000000003]
[null,945,9,"Bauer","Wefler","Nord",12,11.95,143.4,2.2585500000000001,27.102600000000002]
[null,946,9,"Müller","Wefler","Nord",25,12.99,324.75,3.5722500000000004,89.306250000000006]
[null,946,9,"Rot","Wefler","Nord",77,13.05,1004.85,2.46645,189.91665]
[null,223,2,"Sauer","Schulte","Süd",20,22.95,494,6.3112500000000002,126.22499999999999]
[null,223,2,"Meier","Schulte","Süd",22,22.95,528,4.3375500000000002,95.426100000000005]
[null,223,2,"Feier","Schulte","Süd",22,22.7,528,6.2424999999999997,137.33500000000001]
[null,223,2,"Kader","Hunter","Süd",25,22.7,504,4.2903000000000002,107.25749999999999]
[null,223,2,"Wager","Hunter","Süd",77,22.2,548.9,6.1050000000000004,470.08499999999998]
[null,223,2,"Loch","Hunter","Süd",33,23.4,504.9,4.4226000000000001,145.94579999999999]
[null,223,2,"Koch","Hunter","Süd",20,22.2,573.75,6.1050000000000004,122.1]
[null,223,2,"Block","Hunter","Süd",22,9.99,2537.15,1.88811,41.538420000000002]
[null,225,2,"Bunt","Hunter","Süd",22,22.95,659,6.3112500000000002,138.8475]
[null,225,2,"Meier","Hunter","Süd",25,24.95,609.4,4.7155499999999995,117.88875]
[null,226,2,"Müller","Voss","Süd",77,24.95,620.4,6.8612500000000001,528.31624999999997]
[null,223,2,"Rot","Voss","Süd",33,22.95,2171.4,4.3375500000000002,143.13915]
[null,223,2,"Rot","Voss","Süd",20,25.95,2171.4,7.1362500000000004,142.72499999999999]
[null,242,2,"Bauer","Seiler","Nord",20,22.95,922.35,4.3375500000000002,86.751000000000005]
[null,242,2,"Müller","Voss","Nord",20,26.95,499,7.4112499999999999,148.22499999999999]
[null,243,2,"Rot","Wefler","Nord",20,23.95,504.9,4.5265500000000003,90.531000000000006]
[null,244,2,"Rot","Wefler","Nord",22,27.95,504.9,7.6862500000000002,169.0975]
[null,245,2,"Bauer","Wefler","Nord",22,24.95,898.75,4.7155499999999995,103.74209999999999]
[null,246,2,"Müller","Wefler","Nord",25,28.95,1593.9,7.9612499999999997,199.03125]
[null,246,2,"Rot","Wefler","Nord",77,25.95,732.6,4.9045499999999995,377.65034999999995]
[null,255,2,"Rot","Seiler","Nord",33,29.95,448,8.2362500000000001,271.79624999999999]
[null,255,2,"Bauer","Seiler","Nord",20,26.95,419,5.0935499999999996,101.871]
[null,255,2,"Müller","Seiler","Nord",20,20.95,419,5.7612500000000004,115.22499999999999]
[null,255,2,"Rot","Voss","Nord",20,27.95,559,5.2825499999999996,105.651]
[null,323,3,"Sauer","Schulte","Süd",20,22.95,548.9,6.3112500000000002,126.22499999999999]
[null,323,3,"Meier","Schulte","Süd",20,22.95,504.9,4.3375500000000002,86.751000000000005]
[null,323,3,"Feier","Schulte","Süd",20,22.95,574.75,6.3112500000000002,126.22499999999999]
[null,323,3,"Kader","Hunter","Süd",20,22.7,1774.85,4.2903000000000002,85.806000000000012]
[null,323,3,"Wager","Hunter","Süd",27,22.7,612.9,6.2424999999999997,168.54750000000001]
[null,323,3,"Loch","Hunter","Süd",28,22.2,621.6,4.1958000000000002,117.48240000000001]
[null,323,3,"Koch","Hunter","Süd",29,23.4,678.6,6.4349999999999996,186.61500000000001]
[null,323,3,"Block","Hunter","Süd",20,22.2,444,4.1958000000000002,83.915999999999997]
[null,325,3,"Bunt","Hunter","Süd",22,9.99,219.78,2.7472500000000002,60.439500000000002]
[null,325,3,"Meier","Hunter","Süd",22,22.95,504.9,4.3375500000000002,95.426100000000005]
[null,326,3,"Müller","Voss","Süd",23,24.95,573.85,6.8612500000000001,157.80875]
[null,323,3,"Rot","Voss","Süd",24,24.95,598.79999999999995,4.7155499999999995,113.17319999999998]
[null,323,3,"Rot","Voss","Süd",25,24.7,617.5,6.7925000000000004,169.8125]
[null,442,4,"Bauer","Seiler","Nord",20,24.7,494,4.6683000000000003,93.366000000000014]
[null,442,4,"Müller","Voss","Nord",20,25.2,504,6.93,138.6]
[null,443,4,"Rot","Wefler","Nord",20,26.4,528,4.9895999999999994,99.791999999999987]
[null,444,4,"Rot","Wefler","Nord",22,25.2,554.4,6.93,152.46]
[null,445,4,"Bauer","Wefler","Nord",22,22.99,505.78,4.34511,95.592420000000004]
[null,446,4,"Müller","Wefler","Nord",25,25.95,648.75,7.1362500000000004,178.40625]
[null,446,4,"Rot","Wefler","Nord",77,27.95,2152.15,5.2825499999999996,406.75635]
[null,555,5,"Rot","Seiler","Nord",33,22.95,757.35,6.3112500000000002,208.27125000000001]
[null,555,5,"Bauer","Seiler","Nord",20,22.95,459,4.3375500000000002,86.751000000000005]
[null,556,5,"Müller","Seiler","Nord",20,22.95,459,6.3112500000000002,126.22499999999999]
[null,558,5,"Rot","Voss","Nord",20,22.95,459,4.3375500000000002,86.751000000000005]
[null,623,6,"Sauer","Schulte","Süd",20,29.4,588,8.0850000000000009,161.69999999999999]
[null,623,6,"Meier","Schulte","Süd",22,28.2,620.4,5.3297999999999996,117.25559999999999]
[null,623,6,"Feier","Schulte","Süd",22,25.99,571.78,7.1472500000000005,157.23950000000002]
[null,623,6,"Kader","Hunter","Süd",25,28.95,723.75,5.4715499999999997,136.78874999999999]
[null,623,6,"Wager","Hunter","Süd",77,20.95,1613.15,5.7612500000000004,443.61624999999998]
[null,623,6,"Loch","Hunter","Süd",33,24.95,823.35,4.7155499999999995,155.61314999999999]
[null,623,6,"Koch","Hunter","Süd",20,24.95,499,6.8612500000000001,137.22499999999999]
[null,623,6,"Block","Hunter","Süd",22,24.95,548.9,4.7155499999999995,103.74209999999999]
[null,625,6,"Bunt","Hunter","Süd",22,24.95,548.9,6.8612500000000001,150.94749999999999]
[null,625,6,"Meier","Hunter","Süd",25,22.4,560,4.2336,105.84]
[null,626,6,"Müller","Voss","Süd",28,22.2,621.6,6.1050000000000004,170.94]
[null,623,6,"Rot","Voss","Süd",33,28.99,956.67,5.4791099999999995,180.81062999999997]
[null,623,6,"Rot","Voss","Süd",20,22.95,459,6.3112500000000002,126.22499999999999]
[null,642,6,"Bauer","Seiler","Nord",20,23.95,479,4.5265500000000003,90.531000000000006]
[null,642,6,"Müller","Voss","Nord",29,27.95,810.55,7.6862500000000002,222.90125]
[null,643,6,"Rot","Wefler","Nord",20,27.95,559,5.2825499999999996,105.651]
[null,644,6,"Rot","Wefler","Nord",22,27.95,614.9,7.6862500000000002,169.0975]
[null,645,6,"Bauer","Wefler","Nord",88,27.95,2459.6,5.2825499999999996,464.86439999999999]
[null,646,6,"Müller","Wefler","Nord",25,25.4,635,6.9850000000000003,174.625]
[null,646,6,"Rot","Wefler","Nord",77,24.2,1863.4,4.5738000000000003,352.18260000000004]
[null,723,7,"Sauer","Schulte","Süd",220,22.99,5057.8,6.3222500000000004,1390.895]
[null,723,7,"Meier","Schulte","Süd",22,24.95,548.9,4.7155499999999995,103.74209999999999]
[null,723,7,"Feier","Schulte","Süd",22,26.95,592.9,7.4112499999999999,163.04750000000001]
[null,723,7,"Kader","Hunter","Süd",25,20.95,523.75,3.9595499999999997,98.988749999999996]
[null,723,7,"Wager","Hunter","Süd",77,20.95,1613.15,5.7612500000000004,443.61624999999998]
[null,723,7,"Loch","Hunter","Süd",200,20.95,4190,3.9595499999999997,791.91]
[null,723,7,"Koch","Hunter","Süd",20,20.95,419,5.7612500000000004,115.22499999999999]
[null,723,7,"Block","Hunter","Süd",22,28.4,624.79999999999995,5.3675999999999995,118.0872]
[null,725,7,"Bunt","Hunter","Süd",22,27.2,598.4,7.48,164.56]
[null,725,7,"Meier","Hunter","Süd",25,24.99,624.75,4.7231100000000001,118.07775000000001]
[null,726,7,"Müller","Voss","Süd",77,27.95,2152.15,7.6862500000000002,591.84124999999995]
[null,723,7,"Rot","Voss","Süd",50,29.95,1497.5,5.6605499999999997,283.02749999999997]
[null,723,7,"Rot","Voss","Süd",20,23.95,479,6.5862499999999997,131.72499999999999]
[null,742,7,"Bauer","Seiler","Nord",20,23.95,479,4.5265500000000003,90.531000000000006]
[null,742,7,"Müller","Voss","Nord",20,23.95,479,6.5862499999999997,131.72499999999999]
[null,743,7,"Rot","Wefler","Nord",70,23.95,1676.5,4.5265500000000003,316.85850000000005]
[null,744,7,"Rot","Wefler","Nord",22,32.4,712.8,8.91,196.02]
[null,845,8,"Bauer","Wefler","Nord",22,30.2,664.4,5.7077999999999998,125.57159999999999]
[null,846,8,"Müller","Wefler","Nord",25,27.99,699.75,7.6972500000000004,192.43125000000001]
[null,846,8,"Rot","Wefler","Nord",77,30.95,2383.15,5.8495499999999998,450.41534999999999]
[null,823,8,"Sauer","Schulte","Süd",30,32.950000000000003,988.5,9.0612499999999994,271.83749999999998]
[null,823,8,"Meier","Schulte","Süd",22,26.95,592.9,5.0935499999999996,112.0581]
[null,823,8,"Feier","Schulte","Süd",22,26.95,592.9,7.4112499999999999,163.04750000000001]
[null,823,8,"Kader","Hunter","Süd",25,22.7,567.5,4.2903000000000002,107.25749999999999]
[null,823,8,"Wager","Hunter","Süd",77,22.2,1709.4,6.1050000000000004,470.08499999999998]
[null,823,8,"Loch","Hunter","Süd",33,23.4,772.2,4.4226000000000001,145.94579999999999]
[null,823,8,"Koch","Hunter","Süd",20,22.2,444,6.1050000000000004,122.1]
[null,823,8,"Block","Hunter","Süd",22,22.95,504.9,4.3375500000000002,95.426100000000005]
[null,825,8,"Bunt","Hunter","Süd",22,22.95,504.9,6.3112500000000002,138.8475]
[null,825,8,"Meier","Hunter","Süd",25,35.950000000000003,898.75,6.794550000000001,169.86375000000001]
[null,826,8,"Müller","Voss","Süd",77,29.95,2306.15,8.2362500000000001,634.19124999999997]
[null,823,8,"Rot","Voss","Süd",33,29.95,988.35,5.6605499999999997,186.79814999999999]
[null,823,8,"Rot","Voss","Süd",20,24.7,494,6.7925000000000004,135.85]
[null,842,8,"Bauer","Seiler","Nord",20,25.2,528,4.7627999999999995,95.255999999999986]
[null,842,8,"Müller","Voss","Nord",20,26.4,528,7.26,145.19999999999999]
[null,843,8,"Rot","Wefler","Nord",20,25.2,504,4.7627999999999995,95.255999999999986]
[null,844,8,"Rot","Wefler","Nord",22,24.95,548.9,6.8612500000000001,150.94749999999999]
[null,845,8,"Bauer","Wefler","Nord",22,22.95,504.9,4.3375500000000002,95.426100000000005]
[null,846,8,"Müller","Wefler","Nord",25,22.95,573.75,6.3112500000000002,157.78125]
[null,846,8,"Rot","Wefler","Nord",77,32.950000000000003,2537.15,6.2275500000000008,479.52135000000004]
[null,823,8,"Sauer","Schulte","Süd",20,32.950000000000003,659,9.0612499999999994,181.22499999999999]
[null,823,8,"Meier","Schulte","Süd",22,27.7,609.4,5.2352999999999996,115.17659999999999]
[null,823,8,"Feier","Schulte","Süd",22,28.2,620.4,7.7549999999999999,170.61]
[null,823,8,"Kader","Hunter","Süd",25,29.4,2171.4,5.5565999999999995,138.91499999999999]
[null,823,8,"Wager","Hunter","Süd",77,28.2,2171.4,7.7549999999999999,597.13499999999999]
[null,823,8,"Loch","Hunter","Süd",33,27.95,922.35,5.2825499999999996,174.32414999999997]
[null,823,8,"Koch","Hunter","Süd",20,24.95,499,6.8612500000000001,137.22499999999999]
[null,823,8,"Block","Hunter","Süd",22,22.95,504.9,4.3375500000000002,95.426100000000005]
[null,825,8,"Bunt","Hunter","Süd",22,22.95,504.9,6.3112500000000002,138.8475]
[null,825,8,"Meier","Hunter","Süd",25,35.950000000000003,898.75,6.794550000000001,169.86375000000001]
[null,826,8,"Müller","Voss","Süd",77,20.7,1593.9,5.6924999999999999,438.32249999999999]
[null,823,8,"Rot","Voss","Süd",33,22.2,732.6,4.1958000000000002,138.4614]
[null,823,8,"Rot","Voss","Süd",20,22.4,448,6.16,123.2]
[null,942,9,"Bauer","Seiler","Nord",20,22.2,419,4.1958000000000002,83.915999999999997]
[null,942,9,"Müller","Voss","Nord",20,20.95,419,5.7612500000000004,115.22499999999999]
[null,943,9,"Rot","Wefler","Nord",20,27.95,559,5.2825499999999996,105.651]
[null,944,9,"Rot","Wefler","Nord",22,24.95,548.9,6.8612500000000001,150.94749999999999]
[null,945,9,"Bauer","Wefler","Nord",22,22.95,504.9,4.3375500000000002,95.426100000000005]
[null,946,9,"Müller","Wefler","Nord",25,22.99,574.75,6.3222500000000004,158.05625000000001]
[null,946,9,"Rot","Wefler","Nord",77,23.05,1774.85,4.3564500000000006,335.44665000000003]
[null,123,1,"Sauer","Schulte","Süd",10,11.95,119.5,3.2862499999999999,32.862499999999997]
[null,123,1,"Meier","Schulte","Süd",11,11.95,131.44999999999999,2.2585500000000001,24.844049999999999]
[null,123,1,"Feier","Schulte","Süd",12,11.7,140.4,3.2174999999999998,38.61]
[null,123,1,"Kader","Hunter","Süd",25,11.7,292.5,2.2113,55.282499999999999]
[null,123,1,"Wager","Hunter","Süd",77,12.1,931.7,3.3275000000000001,256.21749999999997]
[null,123,1,"Loch","Hunter","Süd",33,13.4,442.2,2.5326,83.575800000000001]
[null,123,1,"Koch","Hunter","Süd",10,12.1,121,3.3275000000000001,33.274999999999999]
[null,123,1,"Block","Hunter","Süd",11,9.99,109.89,1.88811,20.769210000000001]
[null,125,1,"Bunt","Hunter","Süd",12,12.95,155.4,3.5612499999999998,42.734999999999999]
[null,125,1,"Meier","Hunter","Süd",25,14.95,373.75,2.8255499999999998,70.638750000000002]
[null,126,1,"Müller","Voss","Süd",77,14.95,1151.1500000000001,4.1112500000000001,316.56625000000003]
[null,123,1,"Rot","Voss","Süd",33,11.95,394.35,2.2585500000000001,74.532150000000001]
[null,123,1,"Rot","Voss","Süd",10,15.95,159.5,4.3862500000000004,43.862499999999997]
[null,142,1,"Bauer","Seiler","Nord",10,12.95,129.5,2.4475499999999997,24.475499999999997]
[null,142,1,"Müller","Voss","Nord",10,16.95,169.5,4.6612499999999999,46.612499999999997]
[null,143,1,"Rot","Wefler","Nord",10,13.95,139.5,2.6365499999999997,26.365499999999997]
[null,144,1,"Rot","Wefler","Nord",11,17.95,197.45,4.9362500000000002,54.298749999999998]
[null,145,1,"Bauer","Wefler","Nord",12,14.95,179.4,2.8255499999999998,33.906599999999997]
[null,146,1,"Müller","Wefler","Nord",25,18.95,473.75,5.2112499999999997,130.28125]
[null,146,1,"Rot","Wefler","Nord",77,15.95,1228.1500000000001,3.0145499999999998,232.12034999999997]
[null,255,2,"Rot","Seiler","Nord",33,19.95,658.35,5.4862500000000001,181.04624999999999]
[null,255,2,"Bauer","Seiler","Nord",20,16.95,339,3.2035499999999999,64.070999999999998]
[null,255,2,"Müller","Seiler","Nord",20,20.95,419,5.7612500000000004,115.22499999999999]
[null,255,2,"Rot","Voss","Nord",20,17.95,359,3.39255,67.850999999999999]
[null,323,3,"Sauer","Schulte","Süd",20,21.95,439,6.0362499999999999,120.72499999999999]
[null,323,3,"Meier","Schulte","Süd",20,11.95,239,2.2585500000000001,45.170999999999999]
[null,323,3,"Feier","Schulte","Süd",20,11.95,239,3.2862499999999999,65.724999999999994]
[null,323,3,"Kader","Hunter","Süd",20,11.7,234,2.2113,44.225999999999999]
[null,323,3,"Wager","Hunter","Süd",17,11.7,198.9,3.2174999999999998,54.697499999999998]
[null,323,3,"Loch","Hunter","Süd",18,12.1,217.8,2.2869000000000002,41.164200000000001]
[null,323,3,"Koch","Hunter","Süd",19,13.4,254.6,3.6850000000000001,70.015000000000001]
[null,323,3,"Block","Hunter","Süd",20,12.1,242,2.2869000000000002,45.738]
[null,325,3,"Bunt","Hunter","Süd",21,9.99,209.79,2.7472500000000002,57.692250000000001]
[null,325,3,"Meier","Hunter","Süd",22,12.95,284.89999999999998,2.4475499999999997,53.846099999999993]
[null,326,3,"Müller","Voss","Süd",23,14.95,343.85,4.1112500000000001,94.558750000000003]
[null,323,3,"Rot","Voss","Süd",24,14.95,358.8,2.8255499999999998,67.813199999999995]
[null,323,3,"Rot","Voss","Süd",25,14.7,367.5,4.0425000000000004,101.0625]
[null,442,4,"Bauer","Seiler","Nord",10,14.7,147,2.7782999999999998,27.782999999999998]
[null,442,4,"Müller","Voss","Nord",10,15.1,151,4.1524999999999999,41.524999999999999]
[null,443,4,"Rot","Wefler","Nord",10,16.399999999999999,164,3.0995999999999997,30.995999999999995]
[null,444,4,"Rot","Wefler","Nord",11,15.1,166.1,4.1524999999999999,45.677500000000002]
[null,445,4,"Bauer","Wefler","Nord",12,12.99,155.88,2.4551099999999999,29.461320000000001]
[null,446,4,"Müller","Wefler","Nord",25,15.95,398.75,4.3862500000000004,109.65625]
[null,446,4,"Rot","Wefler","Nord",77,17.95,1382.15,3.39255,261.22635000000002]
[null,555,5,"Rot","Seiler","Nord",33,11.95,394.35,3.2862499999999999,108.44625000000001]
[null,555,5,"Bauer","Seiler","Nord",20,11.95,239,2.2585500000000001,45.170999999999999]
[null,556,5,"Müller","Seiler","Nord",20,11.95,239,3.2862499999999999,65.724999999999994]
[null,558,5,"Rot","Voss","Nord",20,11.95,239,2.2585500000000001,45.170999999999999]
[null,623,6,"Sauer","Schulte","Süd",10,19.399999999999999,194,5.335,53.35]
[null,623,6,"Meier","Schulte","Süd",11,18.100000000000001,199.1,3.4209000000000005,37.629900000000006]
[null,623,6,"Feier","Schulte","Süd",12,15.99,191.88,4.3972500000000005,52.76700000000001]
[null,623,6,"Kader","Hunter","Süd",25,18.95,473.75,3.58155,89.538749999999993]
[null,623,6,"Wager","Hunter","Süd",77,20.95,1613.15,5.7612500000000004,443.61624999999998]
[null,623,6,"Loch","Hunter","Süd",33,14.95,493.35,2.8255499999999998,93.243149999999986]
[null,623,6,"Koch","Hunter","Süd",10,14.95,149.5,4.1112500000000001,41.112499999999997]
[null,623,6,"Block","Hunter","Süd",11,14.95,164.45,2.8255499999999998,31.081049999999998]
[null,625,6,"Bunt","Hunter","Süd",12,14.95,179.4,4.1112500000000001,49.335000000000001]
[null,625,6,"Meier","Hunter","Süd",25,22.4,560,4.2336,105.84]
[null,626,6,"Müller","Voss","Süd",18,21.1,379.8,5.8025000000000002,104.44499999999999]
[null,623,6,"Rot","Voss","Süd",33,18.989999999999998,626.66999999999996,3.5891099999999998,118.44063]
[null,623,6,"Rot","Voss","Süd",10,21.95,219.5,6.0362499999999999,60.362499999999997]
[null,642,6,"Bauer","Seiler","Nord",10,23.95,239.5,4.5265500000000003,45.265500000000003]
[null,642,6,"Müller","Voss","Nord",19,17.95,341.05,4.9362500000000002,93.788749999999993]
[null,643,6,"Rot","Wefler","Nord",10,17.95,179.5,3.39255,33.9255]
[null,644,6,"Rot","Wefler","Nord",11,17.95,197.45,4.9362500000000002,54.298749999999998]
[null,645,6,"Bauer","Wefler","Nord",88,17.95,1579.6,3.39255,298.5444]
[null,646,6,"Müller","Wefler","Nord",25,25.4,635,6.9850000000000003,174.625]
[null,646,6,"Rot","Wefler","Nord",77,24.1,1855.7,4.5548999999999999,350.72730000000001]
[null,723,7,"Sauer","Schulte","Süd",110,21.99,2418.9,6.04725,665.19749999999999]
[null,723,7,"Meier","Schulte","Süd",11,24.95,274.45,4.7155499999999995,51.871049999999997]
[null,723,7,"Feier","Schulte","Süd",12,26.95,323.39999999999998,7.4112499999999999,88.935000000000002]
[null,723,7,"Kader","Hunter","Süd",25,20.95,523.75,3.9595499999999997,98.988749999999996]
[null,723,7,"Wager","Hunter","Süd",77,20.95,1613.15,5.7612500000000004,443.61624999999998]
[null,723,7,"Loch","Hunter","Süd",100,20.95,2095,3.9595499999999997,395.95499999999998]
[null,723,7,"Koch","Hunter","Süd",10,20.95,209.5,5.7612500000000004,57.612499999999997]
[null,723,7,"Block","Hunter","Süd",11,28.4,312.39999999999998,5.3675999999999995,59.043599999999998]
[null,725,7,"Bunt","Hunter","Süd",12,27.1,325.2,7.4524999999999997,89.43]
[null,725,7,"Meier","Hunter","Süd",25,24.99,624.75,4.7231100000000001,118.07775000000001]
[null,726,7,"Müller","Voss","Süd",77,27.95,2152.15,7.6862500000000002,591.84124999999995]
[null,723,7,"Rot","Voss","Süd",50,29.95,1497.5,5.6605499999999997,283.02749999999997]
[null,723,7,"Rot","Voss","Süd",10,23.95,239.5,6.5862499999999997,65.862499999999997]
[null,742,7,"Bauer","Seiler","Nord",10,23.95,239.5,4.5265500000000003,45.265500000000003]
[null,742,7,"Müller","Voss","Nord",10,23.95,239.5,6.5862499999999997,65.862499999999997]
[null,743,7,"Rot","Wefler","Nord",70,23.95,1676.5,4.5265500000000003,316.85850000000005]
[null,744,7,"Rot","Wefler","Nord",11,31.4,345.4,8.6349999999999998,94.984999999999999]
[null,845,8,"Bauer","Wefler","Nord",12,30.1,361.2,5.6889000000000003,68.266800000000003]
[null,846,8,"Müller","Wefler","Nord",25,27.99,699.75,7.6972500000000004,192.43125000000001]
[null,846,8,"Rot","Wefler","Nord",77,30.95,2383.15,5.8495499999999998,450.41534999999999]
[null,823,8,"Sauer","Schulte","Süd",30,32.950000000000003,988.5,9.0612499999999994,271.83749999999998]
[null,823,8,"Meier","Schulte","Süd",11,26.95,296.45,5.0935499999999996,56.029049999999998]
[null,823,8,"Feier","Schulte","Süd",12,26.95,323.39999999999998,7.4112499999999999,88.935000000000002]
[null,823,8,"Kader","Hunter","Süd",25,11.7,292.5,2.2113,55.282499999999999]
[null,823,8,"Wager","Hunter","Süd",77,12.1,931.7,3.3275000000000001,256.21749999999997]
[null,823,8,"Loch","Hunter","Süd",33,13.4,442.2,2.5326,83.575800000000001]
[null,823,8,"Koch","Hunter","Süd",10,12.1,121,3.3275000000000001,33.274999999999999]
[null,823,8,"Block","Hunter","Süd",11,11.95,131.44999999999999,2.2585500000000001,24.844049999999999]
[null,825,8,"Bunt","Hunter","Süd",12,11.95,143.4,3.2862499999999999,39.435000000000002]
[null,825,8,"Meier","Hunter","Süd",25,35.950000000000003,898.75,6.794550000000001,169.86375000000001]
[null,826,8,"Müller","Voss","Süd",77,29.95,2306.15,8.2362500000000001,634.19124999999997]
[null,823,8,"Rot","Voss","Süd",33,29.95,988.35,5.6605499999999997,186.79814999999999]
[null,823,8,"Rot","Voss","Süd",10,14.7,147,4.0425000000000004,40.424999999999997]
[null,842,8,"Bauer","Seiler","Nord",10,15.1,151,2.8538999999999999,28.538999999999998]
[null,842,8,"Müller","Voss","Nord",10,16.399999999999999,164,4.51,45.1]
[null,843,8,"Rot","Wefler","Nord",10,15.1,151,2.8538999999999999,28.538999999999998]
[null,844,8,"Rot","Wefler","Nord",11,14.95,164.45,4.1112500000000001,45.223750000000003]
[null,845,8,"Bauer","Wefler","Nord",12,11.95,143.4,2.2585500000000001,27.102600000000002]
[null,846,8,"Müller","Wefler","Nord",25,11.95,298.75,3.2862499999999999,82.15625]
[null,846,8,"Rot","Wefler","Nord",77,32.950000000000003,2537.15,6.2275500000000008,479.52135000000004]
[null,823,8,"Sauer","Schulte","Süd",10,32.950000000000003,329.5,9.0612499999999994,90.612499999999997]
[null,823,8,"Meier","Schulte","Süd",11,17.7,194.7,3.3452999999999999,36.798299999999998]
[null,823,8,"Feier","Schulte","Süd",12,18.100000000000001,217.2,4.9775,59.73]
[null,823,8,"Kader","Hunter","Süd",25,19.399999999999999,485,3.6665999999999999,91.665000000000006]
[null,823,8,"Wager","Hunter","Süd",77,18.100000000000001,1393.7,4.9775,383.26749999999998]
[null,823,8,"Loch","Hunter","Süd",33,17.95,592.35,3.39255,111.95415]
[null,823,8,"Koch","Hunter","Süd",10,14.95,149.5,4.1112500000000001,41.112499999999997]
[null,823,8,"Block","Hunter","Süd",11,11.95,131.44999999999999,2.2585500000000001,24.844049999999999]
[null,825,8,"Bunt","Hunter","Süd",12,11.95,143.4,3.2862499999999999,39.435000000000002]
[null,825,8,"Meier","Hunter","Süd",25,35.950000000000003,898.75,6.794550000000001,169.86375000000001]
[null,826,8,"Müller","Voss","Süd",77,20.7,1593.9,5.6924999999999999,438.32249999999999]
[null,823,8,"Rot","Voss","Süd",33,21.1,696.3,3.9879000000000002,131.60070000000002]
[null,823,8,"Rot","Voss","Süd",10,22.4,224,6.16,61.6]
[null,942,9,"Bauer","Seiler","Nord",10,21.1,211,3.9879000000000002,39.879000000000005]
[null,942,9,"Müller","Voss","Nord",10,20.95,209.5,5.7612500000000004,57.612499999999997]
[null,943,9,"Rot","Wefler","Nord",10,17.95,179.5,3.39255,33.9255]
[null,944,9,"Rot","Wefler","Nord",11,14.95,164.45,4.1112500000000001,45.223750000000003]
[null,945,9,"Bauer","Wefler","Nord",12,11.95,143.4,2.2585500000000001,27.102600000000002]
[null,946,9,"Müller","Wefler","Nord",25,12.99,324.75,3.5722500000000004,89.306250000000006]
[null,946,9,"Rot","Wefler","Nord",77,13.05,1004.85,2.46645,189.91665]
[null,223,2,"Sauer","Schulte","Süd",20,22.95,494,6.3112500000000002,126.22499999999999]
[null,223,2,"Meier","Schulte","Süd",22,22.95,528,4.3375500000000002,95.426100000000005]
[null,223,2,"Feier","Schulte","Süd",22,22.7,528,6.2424999999999997,137.33500000000001]
[null,223,2,"Kader","Hunter","Süd",25,22.7,504,4.2903000000000002,107.25749999999999]
[null,223,2,"Wager","Hunter","Süd",77,22.2,548.9,6.1050000000000004,470.08499999999998]
[null,223,2,"Loch","Hunter","Süd",33,23.4,504.9,4.4226000000000001,145.94579999999999]
[null,223,2,"Koch","Hunter","Süd",20,22.2,573.75,6.1050000000000004,122.1]
[null,223,2,"Block","Hunter","Süd",22,9.99,2537.15,1.88811,41.538420000000002]
[null,225,2,"Bunt","Hunter","Süd",22,22.95,659,6.3112500000000002,138.8475]
[null,225,2,"Meier","Hunter","Süd",25,24.95,609.4,4.7155499999999995,117.88875]
[null,226,2,"Müller","Voss","Süd",77,24.95,620.4,6.8612500000000001,528.31624999999997]
[null,223,2,"Rot","Voss","Süd",33,22.95,2171.4,4.3375500000000002,143.13915]
[null,223,2,"Rot","Voss","Süd",20,25.95,2171.4,7.1362500000000004,142.72499999999999]
[null,242,2,"Bauer","Seiler","Nord",20,22.95,922.35,4.3375500000000002,86.751000000000005]
[null,242,2,"Müller","Voss","Nord",20,26.95,499,7.4112499999999999,148.22499999999999]
[null,243,2,"Rot","Wefler","Nord",20,23.95,504.9,4.5265500000000003,90.531000000000006]
[null,244,2,"Rot","Wefler","Nord",22,27.95,504.9,7.6862500000000002,169.0975]
[null,245,2,"Bauer","Wefler","Nord",22,24.95,898.75,4.7155499999999995,103.74209999999999]
[null,246,2,"Müller","Wefler","Nord",25,28.95,1593.9,7.9612499999999997,199.03125]
[null,246,2,"Rot","Wefler","Nord",77,25.95,732.6,4.9045499999999995,377.65034999999995]
[null,255,2,"Rot","Seiler","Nord",33,29.95,448,8.2362500000000001,271.79624999999999]
[null,255,2,"Bauer","Seiler","Nord",20,26.95,419,5.0935499999999996,101.871]
[null,255,2,"Müller","Seiler","Nord",20,20.95,419,5.7612500000000004,115.22499999999999]
[null,255,2,"Rot","Voss","Nord",20,27.95,559,5.2825499999999996,105.651]
[null,323,3,"Sauer","Schulte","Süd",20,22.95,548.9,6.3112500000000002,126.22499999999999]
[null,323,3,"Meier","Schulte","Süd",20,22.95,504.9,4.3375500000000002,86.751000000000005]
[null,323,3,"Feier","Schulte","Süd",20,22.95,574.75,6.3112500000000002,126.22499999999999]
[null,323,3,"Kader","Hunter","Süd",20,22.7,1774.85,4.2903000000000002,85.806000000000012]
[null,323,3,"Wager","Hunter","Süd",27,22.7,612.9,6.2424999999999997,168.54750000000001]
[null,323,3,"Loch","Hunter","Süd",28,22.2,621.6,4.1958000000000002,117.48240000000001]
[null,323,3,"Koch","Hunter","Süd",29,23.4,678.6,6.4349999999999996,186.61500000000001]
[null,323,3,"Block","Hunter","Süd",20,22.2,444,4.1958000000000002,83.915999999999997]
[null,325,3,"Bunt","Hunter","Süd",22,9.99,219.78,2.7472500000000002,60.439500000000002]
[null,325,3,"Meier","Hunter","Süd",22,22.95,504.9,4.3375500000000002,95.426100000000005]
[null,326,3,"Müller","Voss","Süd",23,24.95,573.85,6.8612500000000001,157.80875]
[null,323,3,"Rot","Voss","Süd",24,24.95,598.79999999999995,4.7155499999999995,113.17319999999998]
[null,323,3,"Rot","Voss","Süd",25,24.7,617.5,6.7925000000000004,169.8125]
[null,442,4,"Bauer","Seiler","Nord",20,24.7,494,4.6683000000000003,93.366000000000014]
[null,442,4,"Müller","Voss","Nord",20,25.2,504,6.93,138.6]
[null,443,4,"Rot","Wefler","Nord",20,26.4,528,4.9895999999999994,99.791999999999987]
[null,444,4,"Rot","Wefler","Nord",22,25.2,554.4,6.93,152.46]
[null,445,4,"Bauer","Wefler","Nord",22,22.99,505.78,4.34511,95.592420000000004]
[null,446,4,"Müller","Wefler","Nord",25,25.95,648.75,7.1362500000000004,178.40625]
[null,446,4,"Rot","Wefler","Nord",77,27.95,2152.15,5.2825499999999996,406.75635]
[null,555,5,"Rot","Seiler","Nord",33,22.95,757.35,6.3112500000000002,208.27125000000001]
[null,555,5,"Bauer","Seiler","Nord",20,22.95,459,4.3375500000000002,86.751000000000005]
[null,556,5,"Müller","Seiler","Nord",20,22.95,459,6.3112500000000002,126.22499999999999]
[null,558,5,"Rot","Voss","Nord",20,22.95,459,4.3375500000000002,86.751000000000005]
[null,623,6,"Sauer","Schulte","Süd",20,29.4,588,8.0850000000000009,161.69999999999999]
[null,623,6,"Meier","Schulte","Süd",22,28.2,620.4,5.3297999999999996,117.25559999999999]
[null,623,6,"Feier","Schulte","Süd",22,25.99,571.78,7.1472500000000005,157.23950000000002]
[null,623,6,"Kader","Hunter","Süd",25,28.95,723.75,5.4715499999999997,136.78874999999999]
[null,623,6,"Wager","Hunter","Süd",77,20.95,1613.15,5.7612500000000004,443.61624999999998]
[null,623,6,"Loch","Hunter","Süd",33,24.95,823.35,4.7155499999999995,155.61314999999999]
[null,623,6,"Koch","Hunter","Süd",20,24.95,499,6.8612500000000001,137.22499999999999]
[null,623,6,"Block","Hunter","Süd",22,24.95,548.9,4.7155499999999995,103.74209999999999]
[null,625,6,"Bunt","Hunter","Süd",22,24.95,548.9,6.8612500000000001,150.94749999999999]
[null,625,6,"Meier","Hunter","Süd",25,22.4,560,4.2336,105.84]
[null,626,6,"Müller","Voss","Süd",28,22.2,621.6,6.1050000000000004,170.94]
[null,623,6,"Rot","Voss","Süd",33,28.99,956.67,5.4791099999999995,180.81062999999997]
[null,623,6,"Rot","Voss","Süd",20,22.95,459,6.3112500000000002,126.22499999999999]
[null,642,6,"Bauer","Seiler","Nord",20,23.95,479,4.5265500000000003,90.531000000000006]
[null,642,6,"Müller","Voss","Nord",29,27.95,810.55,7.6862500000000002,222.90125]
[null,643,6,"Rot","Wefler","Nord",20,27.95,559,5.2825499999999996,105.651]
[null,644,6,"Rot","Wefler","Nord",22,27.95,614.9,7.6862500000000002,169.0975]
[null,645,6,"Bauer","Wefler","Nord",88,27.95,2459.6,5.2825499999999996,464.86439999999999]
[null,646,6,"Müller","Wefler","Nord",25,25.4,635,6.9850000000000003,174.625]
[null,646,6,"Rot","Wefler","Nord",77,24.2,1863.4,4.5738000000000003,352.18260000000004]
[null,723,7,"Sauer","Schulte","Süd",220,22.99,5057.8,6.3222500000000004,1390.895]
[null,723,7,"Meier","Schulte","Süd",22,24.95,548.9,4.7155499999999995,103.74209999999999]
[null,723,7,"Feier","Schulte","Süd",22,26.95,592.9,7.4112499999999999,163.04750000000001]
[null,723,7,"Kader","Hunter","Süd",25,20.95,523.75,3.9595499999999997,98.988749999999996]
[null,723,7,"Wager","Hunter","Süd",77,20.95,1613.15,5.7612500000000004,443.61624999999998]
[null,723,7,"Loch","Hunter","Süd",200,20.95,4190,3.9595499999999997,791.91]
[null,723,7,"Koch","Hunter","Süd",20,20.95,419,5.7612500000000004,115.22499999999999]
[null,723,7,"Block","Hunter","Süd",22,28.4,624.79999999999995,5.3675999999999995,118.0872]
[null,725,7,"Bunt","Hunter","Süd",22,27.2,598.4,7.48,164.56]
[null,725,7,"Meier","Hunter","Süd",25,24.99,624.75,4.7231100000000001,118.07775000000001]
[null,726,7,"Müller","Voss","Süd",77,27.95,2152.15,7.6862500000000002,591.84124999999995]
[null,723,7,"Rot","Voss","Süd",50,29.95,1497.5,5.6605499999999997,283.02749999999997]
[null,723,7,"Rot","Voss","Süd",20,23.95,479,6.5862499999999997,131.72499999999999]
[null,742,7,"Bauer","Seiler","Nord",20,23.95,479,4.5265500000000003,90.531000000000006]
[null,742,7,"Müller","Voss","Nord",20,23.95,479,6.5862499999999997,131.72499999999999]
[null,743,7,"Rot","Wefler","Nord",70,23.95,1676.5,4.5265500000000003,316.85850000000005]
[null,744,7,"Rot","Wefler","Nord",22,32.4,712.8,8.91,196.02]
[null,845,8,"Bauer","Wefler","Nord",22,30.2,664.4,5.7077999999999998,125.57159999999999]
[null,846,8,"Müller","Wefler","Nord",25,27.99,699.75,7.6972500000000004,192.43125000000001]
[null,846,8,"Rot","Wefler","Nord",77,30.95,2383.15,5.8495499999999998,450.41534999999999]
[null,823,8,"Sauer","Schulte","Süd",30,32.950000000000003,988.5,9.0612499999999994,271.83749999999998]
[null,823,8,"Meier","Schulte","Süd",22,26.95,592.9,5.0935499999999996,112.0581]
[null,823,8,"Feier","Schulte","Süd",22,26.95,592.9,7.4112499999999999,163.04750000000001]
[null,823,8,"Kader","Hunter","Süd",25,22.7,567.5,4.2903000000000002,107.25749999999999]
[null,823,8,"Wager","Hunter","Süd",77,22.2,1709.4,6.1050000000000004,470.08499999999998]
[null,823,8,"Loch","Hunter","Süd",33,23.4,772.2,4.4226000000000001,145.94579999999999]
[null,823,8,"Koch","Hunter","Süd",20,22.2,444,6.1050000000000004,122.1]
[null,823,8,"Block","Hunter","Süd",22,22.95,504.9,4.3375500000000002,95.426100000000005]
[null,825,8,"Bunt","Hunter","Süd",22,22.95,504.9,6.3112500000000002,138.8475]
[null,825,8,"Meier","Hunter","Süd",25,35.950000000000003,898.75,6.794550000000001,169.86375000000001]
[null,826,8,"Müller","Voss","Süd",77,29.95,2306.15,8.2362500000000001,634.19124999999997]
[null,823,8,"Rot","Voss","Süd",33,29.95,988.35,5.6605499999999997,186.79814999999999]
[null,823,8,"Rot","Voss","Süd",20,24.7,494,6.7925000000000004,135.85]
[null,842,8,"Bauer","Seiler","Nord",20,25.2,528,4.7627999999999995,95.255999999999986]
[null,842,8,"Müller","Voss","Nord",20,26.4,528,7.26,145.19999999999999]
[null,843,8,"Rot","Wefler","Nord",20,25.2,504,4.7627999999999995,95.255999999999986]
[null,844,8,"Rot","Wefler","Nord",22,24.95,548.9,6.8612500000000001,150.94749999999999]
[null,845,8,"Bauer","Wefler","Nord",22,22.95,504.9,4.3375500000000002,95.426100000000005]
[null,846,8,"Müller","Wefler","Nord",25,22.95,573.75,6.3112500000000002,157.78125]
[null,846,8,"Rot","Wefler","Nord",77,32.950000000000003,2537.15,6.2275500000000008,479.52135000000004]
[null,823,8,"Sauer","Schulte","Süd",20,32.950000000000003,659,9.0612499999999994,181.22499999999999]
[null,823,8,"Meier","Schulte","Süd",22,27.7,609.4,5.2352999999999996,115.17659999999999]
[null,823,8,"Feier","Schulte","Süd",22,28.2,620.4,7.7549999999999999,170.61]
[null,823,8,"Kader","Hunter","Süd",25,29.4,2171.4,5.5565999999999995,138.91499999999999]
[null,823,8,"Wager","Hunter","Süd",77,28.2,2171.4,7.7549999999999999,597.13499999999999]
[null,823,8,"Loch","Hunter","Süd",33,27.95,922.35,5.2825499999999996,174.32414999999997]
[null,123,1,"Sauer","Schulte","Süd",10,11.95,119.5,3.2862499999999999,32.862499999999997]
[null,123,1,"Meier","Schulte","Süd",11,11.95,131.44999999999999,2.2585500000000001,24.844049999999999]
[null,123,1,"Feier","Schulte","Süd",12,11.7,140.4,3.2174999999999998,38.61]
[null,123,1,"Kader","Hunter","Süd",25,11.7,292.5,2.2113,55.282499999999999]
[null,123,1,"Wager","Hunter","Süd",77,12.1,931.7,3.3275000000000001,256.21749999999997]
[null,123,1,"Loch","Hunter","Süd",33,13.4,442.2,2.5326,83.575800000000001]
[null,123,1,"Koch","Hunter","Süd",10,12.1,121,3.3275000000000001,33.274999999999999]
[null,123,1,"Block","Hunter","Süd",11,9.99,109.89,1.88811,20.769210000000001]
[null,125,1,"Bunt","Hunter","Süd",12,12.95,155.4,3.5612499999999998,42.734999999999999]
[null,125,1,"Meier","Hunter","Süd",25,14.95,373.75,2.8255499999999998,70.638750000000002]
[null,126,1,"Müller","Voss","Süd",77,14.95,1151.1500000000001,4.1112500000000001,316.56625000000003]
[null,123,1,"Rot","Voss","Süd",33,11.95,394.35,2.2585500000000001,74.532150000000001]
[null,123,1,"Rot","Voss","Süd",10,15.95,159.5,4.3862500000000004,43.862499999999997]
[null,142,1,"Bauer","Seiler","Nord",10,12.95,129.5,2.4475499999999997,24.475499999999997]
[null,142,1,"Müller","Voss","Nord",10,16.95,169.5,4.6612499999999999,46.612499999999997]
[null,143,1,"Rot","Wefler","Nord",10,13.95,139.5,2.6365499999999997,26.365499999999997]
[null,144,1,"Rot","Wefler","Nord",11,17.95,197.45,4.9362500000000002,54.298749999999998]
[null,145,1,"Bauer","Wefler","Nord",12,14.95,179.4,2.8255499999999998,33.906599999999997]
[null,146,1,"Müller","Wefler","Nord",25,18.95,473.75,5.2112499999999997,130.28125]
[null,146,1,"Rot","Wefler","Nord",77,15.95,1228.1500000000001,3.0145499999999998,232.12034999999997]
[null,255,2,"Rot","Seiler","Nord",33,19.95,658.35,5.4862500000000001,181.04624999999999]
[null,255,2,"Bauer","Seiler","Nord",20,16.95,339,3.2035499999999999,64.070999999999998]
[null,255,2,"Müller","Seiler","Nord",20,20.95,419,5.7612500000000004,115.22499999999999]
[null,255,2,"Rot","Voss","Nord",20,17.95,359,3.39255,67.850999999999999]
[null,323,3,"Sauer","Schulte","Süd",20,21.95,439,6.0362499999999999,120.72499999999999]
[null,323,3,"Meier","Schulte","Süd",20,11.95,239,2.2585500000000001,45.170999999999999]
[null,323,3,"Feier","Schulte","Süd",20,11.95,239,3.2862499999999999,65.724999999999994]
[null,323,3,"Kader","Hunter","Süd",20,11.7,234,2.2113,44.225999999999999]
[null,323,3,"Wager","Hunter","Süd",17,11.7,198.9,3.2174999999999998,54.697499999999998]
[null,323,3,"Loch","Hunter","Süd",18,12.1,217.8,2.2869000000000002,41.164200000000001]
[null,323,3,"Koch","Hunter","Süd",19,13.4,254.6,3.6850000000000001,70.015000000000001]
[null,323,3,"Block","Hunter","Süd",20,12.1,242,2.2869000000000002,45.738]
[null,325,3,"Bunt","Hunter","Süd",21,9.99,209.79,2.7472500000000002,57.692250000000001]
[null,325,3,"Meier","Hunter","Süd",22,12.95,284.89999999999998,2.4475499999999997,53.846099999999993]
[null,326,3,"Müller","Voss","Süd",23,14.95,343.85,4.1112500000000001,94.558750000000003]
[null,323,3,"Rot","Voss","Süd",24,14.95,358.8,2.8255499999999998,67.813199999999995]
[null,323,3,"Rot","Voss","Süd",25,14.7,367.5,4.0425000000000004,101.0625]
[null,442,4,"Bauer","Seiler","Nord",10,14.7,147,2.7782999999999998,27.782999999999998]
[null,442,4,"Müller","Voss","Nord",10,15.1,151,4.1524999999999999,41.524999999999999]
[null,443,4,"Rot","Wefler","Nord",10,16.399999999999999,164,3.0995999999999997,30.995999999999995]
[null,444,4,"Rot","Wefler","Nord",11,15.1,166.1,4.1524999999999999,45.677500000000002]
[null,445,4,"Bauer","Wefler","Nord",12,12.99,155.88,2.4551099999999999,29.461320000000001]
[null,446,4,"Müller","Wefler","Nord",25,15.95,398.75,4.3862500000000004,109.65625]
[null,446,4,"Rot","Wefler","Nord",77,17.95,1382.15,3.39255,261.22635000000002]
[null,555,5,"Rot","Seiler","Nord",33,11.95,394.35,3.2862499999999999,108.44625000000001]
[null,555,5,"Bauer","Seiler","Nord",20,11.95,239,2.2585500000000001,45.170999999999999]
[null,556,5,"Müller","Seiler","Nord",20,11.95,239,3.2862499999999999,65.724999999999994]
[null,558,5,"Rot","Voss","Nord",20,11.95,239,2.2585500000000001,45.170999999999999]
[null,623,6,"Sauer","Schulte","Süd",10,19.399999999999999,194,5.335,53.35]
[null,623,6,"Meier","Schulte","Süd",11,18.100000000000001,199.1,3.4209000000000005,37.629900000000006]
[null,623,6,"Feier","Schulte","Süd",12,15.99,191.88,4.3972500000000005,52.76700000000001]
[null,623,6,"Kader","Hunter","Süd",25,18.95,473.75,3.58155,89.538749999999993]
[null,623,6,"Wager","Hunter","Süd",77,20.95,1613.15,5.7612500000000004,443.61624999999998]
[null,623,6,"Loch","Hunter","Süd",33,14.95,493.35,2.8255499999999998,93.243149999999986]
[null,623,6,"Koch","Hunter","Süd",10,14.95,149.5,4.1112500000000001,41.112499999999997]
[null,623,6,"Block","Hunter","Süd",11,14.95,164.45,2.8255499999999998,31.081049999999998]
[null,625,6,"Bunt","Hunter","Süd",12,14.95,179.4,4.1112500000000001,49.335000000000001]
[null,625,6,"Meier","Hunter","Süd",25,22.4,560,4.2336,105.84]
[null,626,6,"Müller","Voss","Süd",18,21.1,379.8,5.8025000000000002,104.44499999999999]
[null,623,6,"Rot","Voss","Süd",33,18.989999999999998,626.66999999999996,3.5891099999999998,118.44063]
[null,623,6,"Rot","Voss","Süd",10,21.95,219.5,6.0362499999999999,60.362499999999997]
[null,642,6,"Bauer","Seiler","Nord",10,23.95,239.5,4.5265500000000003,45.265500000000003]
[null,642,6,"Müller","Voss","Nord",19,17.95,341.05,4.9362500000000002,93.788749999999993]
[null,643,6,"Rot","Wefler","Nord",10,17.95,179.5,3.39255,33.9255]
[null,644,6,"Rot","Wefler","Nord",11,17.95,197.45,4.9362500000000002,54.298749999999998]
[null,645,6,"Bauer","Wefler","Nord",88,17.95,1579.6,3.39255,298.5444]
[null,646,6,"Müller","Wefler","Nord",25,25.4,635,6.9850000000000003,174.625]
[null,646,6,"Rot","Wefler","Nord",77,24.1,1855.7,4.5548999999999999,350.72730000000001]
[null,723,7,"Sauer","Schulte","Süd",110,21.99,2418.9,6.04725,665.19749999999999]
[null,723,7,"Meier","Schulte","Süd",11,24.95,274.45,4.7155499999999995,51.871049999999997]
[null,723,7,"Feier","Schulte","Süd",12,26.95,323.39999999999998,7.4112499999999999,88.935000000000002]
[null,723,7,"Kader","Hunter","Süd",25,20.95,523.75,3.9595499999999997,98.988749999999996]
[null,723,7,"Wager","Hunter","Süd",77,20.95,1613.15,5.7612500000000004,443.61624999999998]
[null,723,7,"Loch","Hunter","Süd",100,20.95,2095,3.9595499999999997,395.95499999999998]
[null,723,7,"Koch","Hunter","Süd",10,20.95,209.5,5.7612500000000004,57.612499999999997]
[null,723,7,"Block","Hunter","Süd",11,28.4,312.39999999999998,5.3675999999999995,59.043599999999998]
[null,725,7,"Bunt","Hunter","Süd",12,27.1,325.2,7.4524999999999997,89.43]
[null,725,7,"Meier","Hunter","Süd",25,24.99,624.75,4.7231100000000001,118.07775000000001]
[null,726,7,"Müller","Voss","Süd",77,27.95,2152.15,7.6862500000000002,591.84124999999995]
[null,723,7,"Rot","Voss","Süd",50,29.95,1497.5,5.6605499999999997,283.02749999999997]
[null,723,7,"Rot","Voss","Süd",10,23.95,239.5,6.5862499999999997,65.862499999999997]
[null,742,7,"Bauer","Seiler","Nord",10,23.95,239.5,4.5265500000000003,45.265500000000003]
[null,742,7,"Müller","Voss","Nord",10,23.95,239.5,6.5862499999999997,65.862499999999997]
[null,743,7,"Rot","Wefler","Nord",70,23.95,1676.5,4.5265500000000003,316.85850000000005]
[null,744,7,"Rot","Wefler","Nord",11,31.4,345.4,8.6349999999999998,94.984999999999999]
[null,845,8,"Bauer","Wefler","Nord",12,30.1,361.2,5.6889000000000003,68.266800000000003]
[null,846,8,"Müller","Wefler","Nord",25,27.99,699.75,7.6972500000000004,192.43125000000001]
[null,846,8,"Rot","Wefler","Nord",77,30.95,2383.15,5.8495499999999998,450.41534999999999]
[null,823,8,"Sauer","Schulte","Süd",30,32.950000000000003,988.5,9.0612499999999994,271.83749999999998]
[null,823,8,"Meier","Schulte","Süd",11,26.95,296.45,5.0935499999999996,56.029049999999998]
[null,823,8,"Feier","Schulte","Süd",12,26.95,323.39999999999998,7.4112499999999999,88.935000000000002]
[null,823,8,"Kader","Hunter","Süd",25,11.7,292.5,2.2113,55.282499999999999]
[null,823,8,"Wager","Hunter","Süd",77,12.1,931.7,3.3275000000000001,256.21749999999997]
[null,823,8,"Loch","Hunter","Süd",33,13.4,442.2,2.5326,83.575800000000001]
[null,823,8,"Koch","Hunter","Süd",10,12.1,121,3.3275000000000001,33.274999999999999]
[null,823,8,"Block","Hunter","Süd",11,11.95,131.44999999999999,2.2585500000000001,24.844049999999999]
[null,825,8,"Bunt","Hunter","Süd",12,11.95,143.4,3.2862499999999999,39.435000000000002]
[null,825,8,"Meier","Hunter","Süd",25,35.950000000000003,898.75,6.794550000000001,169.86375000000001]
[null,826,8,"Müller","Voss","Süd",77,29.95,2306.15,8.2362500000000001,634.19124999999997]
[null,823,8,"Rot","Voss","Süd",33,29.95,988.35,5.6605499999999997,186.79814999999999]
[null,823,8,"Rot","Voss","Süd",10,14.7,147,4.0425000000000004,40.424999999999997]
[null,842,8,"Bauer","Seiler","Nord",10,15.1,151,2.8538999999999999,28.538999999999998]
[null,842,8,"Müller","Voss","Nord",10,16.399999999999999,164,4.51,45.1]
[null,843,8,"Rot","Wefler","Nord",10,15.1,151,2.8538999999999999,28.538999999999998]
[null,844,8,"Rot","Wefler","Nord",11,14.95,164.45,4.1112500000000001,45.223750000000003]
[null,845,8,"Bauer","Wefler","Nord",12,11.95,143.4,2.2585500000000001,27.102600000000002]
[null,846,8,"Müller","Wefler","Nord",25,11.95,298.75,3.2862499999999999,82.15625]
[null,846,8,"Rot","Wefler","Nord",77,32.950000000000003,2537.15,6.2275500000000008,479.52135000000004]
[null,823,8,"Sauer","Schulte","Süd",10,32.950000000000003,329.5,9.0612499999999994,90.612499999999997]
[null,823,8,"Meier","Schulte","Süd",11,17.7,194.7,3.3452999999999999,36.798299999999998]
[null,823,8,"Feier","Schulte","Süd",12,18.100000000000001,217.2,4.9775,59.73]
[null,823,8,"Kader","Hunter","Süd",25,19.399999999999999,485,3.6665999999999999,91.665000000000006]
[null,823,8,"Wager","Hunter","Süd",77,18.100000000000001,1393.7,4.9775,383.26749999999998]
[null,823,8,"Loch","Hunter","Süd",33,17.95,592.35,3.39255,111.95415]
[null,823,8,"Koch","Hunter","Süd",10,14.95,149.5,4.1112500000000001,41.112499999999997]
[null,823,8,"Block","Hunter","Süd",11,11.95,131.44999999999999,2.2585500000000001,24.844049999999999]
[null,825,8,"Bunt","Hunter","Süd",12,11.95,143.4,3.2862499999999999,39.435000000000002]
[null,825,8,"Meier","Hunter","Süd",25,35.950000000000003,898.75,6.794550000000001,169.86375000000001]
[null,826,8,"Müller","Voss","Süd",77,20.7,1593.9,5.6924999999999999,438.32249999999999]
[null,823,8,"Rot","Voss","Süd",33,21.1,696.3,3.9879000000000002,131.60070000000002]
[null,823,8,"Rot","Voss","Süd",10,22.4,224,6.16,61.6]
[null,942,9,"Bauer","Seiler","Nord",10,21.1,211,3.9879000000000002,39.879000000000005]
[null,942,9,"Müller","Voss","Nord",10,20.95,209.5,5.7612500000000004,57.612499999999997]
[null,943,9,"Rot","Wefler","Nord",10,17.95,179.5,3.39255,33.9255]
[null,944,9,"Rot","Wefler","Nord",11,14.95,164.45,4.1112500000000001,45.223750000000003]
[null,945,9,"Bauer","Wefler","Nord",12,11.95,143.4,2.2585500000000001,27.102600000000002]
[null,946,9,"Müller","Wefler","Nord",25,12.99,324.75,3.5722500000000004,89.306250000000006]
[null,946,9,"Rot","Wefler","Nord",77,13.05,1004.85,2.46645,189.91665]
[null,223,2,"Sauer","Schulte","Süd",20,22.95,494,6.3112500000000002,126.22499999999999]
[null,223,2,"Meier","Schulte","Süd",22,22.95,528,4.3375500000000002,95.426100000000005]
[null,223,2,"Feier","Schulte","Süd",22,22.7,528,6.2424999999999997,137.33500000000001]
[null,223,2,"Kader","Hunter","Süd",25,22.7,504,4.2903000000000002,107.25749999999999]
[null,223,2,"Wager","Hunter","Süd",77,22.2,548.9,6.1050000000000004,470.08499999999998]
[null,223,2,"Loch","Hunter","Süd",33,23.4,504.9,4.4226000000000001,145.94579999999999]
[null,223,2,"Koch","Hunter","Süd",20,22.2,573.75,6.1050000000000004,122.1]
[null,223,2,"Block","Hunter","Süd",22,9.99,2537.15,1.88811,41.538420000000002]
[null,225,2,"Bunt","Hunter","Süd",22,22.95,659,6.3112500000000002,138.8475]
[null,225,2,"Meier","Hunter","Süd",25,24.95,609.4,4.7155499999999995,117.88875]
[null,226,2,"Müller","Voss","Süd",77,24.95,620.4,6.8612500000000001,528.31624999999997]
[null,223,2,"Rot","Voss","Süd",33,22.95,2171.4,4.3375500000000002,143.13915]
[null,223,2,"Rot","Voss","Süd",20,25.95,2171.4,7.1362500000000004,142.72499999999999]
[null,242,2,"Bauer","Seiler","Nord",20,22.95,922.35,4.3375500000000002,86.751000000000005]
[null,242,2,"Müller","Voss","Nord",20,26.95,499,7.4112499999999999,148.22499999999999]
[null,243,2,"Rot","Wefler","Nord",20,23.95,504.9,4.5265500000000003,90.531000000000006]
[null,244,2,"Rot","Wefler","Nord",22,27.95,504.9,7.6862500000000002,169.0975]
[null,245,2,"Bauer","Wefler","Nord",22,24.95,898.75,4.7155499999999995,103.74209999999999]
[null,246,2,"Müller","Wefler","Nord",25,28.95,1593.9,7.9612499999999997,199.03125]
[null,246,2,"Rot","Wefler","Nord",77,25.95,732.6,4.9045499999999995,377.65034999999995]
[null,255,2,"Rot","Seiler","Nord",33,29.95,448,8.2362500000000001,271.79624999999999]
[null,255,2,"Bauer","Seiler","Nord",20,26.95,419,5.0935499999999996,101.871]
[null,255,2,"Müller","Seiler","Nord",20,20.95,419,5.7612500000000004,115.22499999999999]
[null,255,2,"Rot","Voss","Nord",20,27.95,559,5.2825499999999996,105.651]
[null,323,3,"Sauer","Schulte","Süd",20,22.95,548.9,6.3112500000000002,126.22499999999999]
[null,323,3,"Meier","Schulte","Süd",20,22.95,504.9,4.3375500000000002,86.751000000000005]
[null,323,3,"Feier","Schulte","Süd",20,22.95,574.75,6.3112500000000002,126.22499999999999]
[null,323,3,"Kader","Hunter","Süd",20,22.7,1774.85,4.2903000000000002,85.806000000000012]
[null,323,3,"Wager","Hunter","Süd",27,22.7,612.9,6.2424999999999997,168.54750000000001]
[null,323,3,"Loch","Hunter","Süd",28,22.2,621.6,4.1958000000000002,117.48240000000001]
[null,323,3,"Koch","Hunter","Süd",29,23.4,678.6,6.4349999999999996,186.61500000000001]
[null,323,3,"Block","Hunter","Süd",20,22.2,444,4.1958000000000002,83.915999999999997]
[null,325,3,"Bunt","Hunter","Süd",22,9.99,219.78,2.7472500000000002,60.439500000000002]
[null,325,3,"Meier","Hunter","Süd",22,22.95,504.9,4.3375500000000002,95.426100000000005]
[null,326,3,"Müller","Voss","Süd",23,24.95,573.85,6.8612500000000001,157.80875]
[null,323,3,"Rot","Voss","Süd",24,24.95,598.79999999999995,4.7155499999999995,113.17319999999998]
[null,323,3,"Rot","Voss","Süd",25,24.7,617.5,6.7925000000000004,169.8125]
[null,442,4,"Bauer","Seiler","Nord",20,24.7,494,4.6683000000000003,93.366000000000014]
[null,442,4,"Müller","Voss","Nord",20,25.2,504,6.93,138.6]
[null,443,4,"Rot","Wefler","Nord",20,26.4,528,4.9895999999999994,99.791999999999987]
[null,444,4,"Rot","Wefler","Nord",22,25.2,554.4,6.93,152.46]
[null,445,4,"Bauer","Wefler","Nord",22,22.99,505.78,4.34511,95.592420000000004]
[null,446,4,"Müller","Wefler","Nord",25,25.95,648.75,7.1362500000000004,178.40625]
[null,446,4,"Rot","Wefler","Nord",77,27.95,2152.15,5.2825499999999996,406.75635]
[null,555,5,"Rot","Seiler","Nord",33,22.95,757.35,6.3112500000000002,208.27125000000001]
[null,555,5,"Bauer","Seiler","Nord",20,22.95,459,4.3375500000000002,86.751000000000005]
[null,556,5,"Müller","Seiler","Nord",20,22.95,459,6.3112500000000002,126.22499999999999]
[null,558,5,"Rot","Voss","Nord",20,22.95,459,4.3375500000000002,86.751000000000005]
[null,623,6,"Sauer","Schulte","Süd",20,29.4,588,8.0850000000000009,161.69999999999999]
[null,623,6,"Meier","Schulte","Süd",22,28.2,620.4,5.3297999999999996,117.25559999999999]
[null,623,6,"Feier","Schulte","Süd",22,25.99,571.78,7.1472500000000005,157.23950000000002]
[null,623,6,"Kader","Hunter","Süd",25,28.95,723.75,5.4715499999999997,136.78874999999999]
[null,623,6,"Wager","Hunter","Süd",77,20.95,1613.15,5.7612500000000004,443.61624999999998]
[null,623,6,"Loch","Hunter","Süd",33,24.95,823.35,4.7155499999999995,155.61314999999999]
[null,623,6,"Koch","Hunter","Süd",20,24.95,499,6.8612500000000001,137.22499999999999]
[null,623,6,"Block","Hunter","Süd",22,24.95,548.9,4.7155499999999995,103.74209999999999]
[null,625,6,"Bunt","Hunter","Süd",22,24.95,548.9,6.8612500000000001,150.94749999999999]
[null,625,6,"Meier","Hunter","Süd",25,22.4,560,4.2336,105.84]
[null,626,6,"Müller","Voss","Süd",28,22.2,621.6,6.1050000000000004,170.94]
[null,623,6,"Rot","Voss","Süd",33,28.99,956.67,5.4791099999999995,180.81062999999997]
[null,623,6,"Rot","Voss","Süd",20,22.95,459,6.3112500000000002,126.22499999999999]
[null,642,6,"Bauer","Seiler","Nord",20,23.95,479,4.5265500000000003,90.531000000000006]
[null,642,6,"Müller","Voss","Nord",29,27.95,810.55,7.6862500000000002,222.90125]
[null,643,6,"Rot","Wefler","Nord",20,27.95,559,5.2825499999999996,105.651]
[null,644,6,"Rot","Wefler","Nord",22,27.95,614.9,7.6862500000000002,169.0975]
[null,645,6,"Bauer","Wefler","Nord",88,27.95,2459.6,5.2825499999999996,464.86439999999999]
[null,646,6,"Müller","Wefler","Nord",25,25.4,635,6.9850000000000003,174.625]
[null,646,6,"Rot","Wefler","Nord",77,24.2,1863.4,4.5738000000000003,352.18260000000004]
[null,723,7,"Sauer","Schulte","Süd",220,22.99,5057.8,6.3222500000000004,1390.895]
[null,723,7,"Meier","Schulte","Süd",22,24.95,548.9,4.7155499999999995,103.74209999999999]
[null,723,7,"Feier","Schulte","Süd",22,26.95,592.9,7.4112499999999999,163.04750000000001]
[null,723,7,"Kader","Hunter","Süd",25,20.95,523.75,3.9595499999999997,98.988749999999996]
[null,723,7,"Wager","Hunter","Süd",77,20.95,1613.15,5.7612500000000004,443.61624999999998]
[null,723,7,"Loch","Hunter","Süd",200,20.95,4190,3.9595499999999997,791.91]
[null,723,7,"Koch","Hunter","Süd",20,20.95,419,5.7612500000000004,115.22499999999999]
[null,723,7,"Block","Hunter","Süd",22,28.4,624.79999999999995,5.3675999999999995,118.0872]
[null,725,7,"Bunt","Hunter","Süd",22,27.2,598.4,7.48,164.56]
[null,725,7,"Meier","Hunter","Süd",25,24.99,624.75,4.7231100000000001,118.07775000000001]
[null,726,7,"Müller","Voss","Süd",77,27.95,2152.15,7.6862500000000002,591.84124999999995]
[null,723,7,"Rot","Voss","Süd",50,29.95,1497.5,5.6605499999999997,283.02749999999997]
[null,723,7,"Rot","Voss","Süd",20,23.95,479,6.5862499999999997,131.72499999999999]
[null,742,7,"Bauer","Seiler","Nord",20,23.95,479,4.5265500000000003,90.531000000000006]
[null,742,7,"Müller","Voss","Nord",20,23.95,479,6.5862499999999997,131.72499999999999]
[null,743,7,"Rot","Wefler","Nord",70,23.95,1676.5,4.5265500000000003,316.85850000000005]
[null,744,7,"Rot","Wefler","Nord",22,32.4,712.8,8.91,196.02]
[null,845,8,"Bauer","Wefler","Nord",22,30.2,664.4,5.7077999999999998,125.57159999999999]
[null,846,8,"Müller","Wefler","Nord",25,27.99,699.75,7.6972500000000004,192.43125000000001]
[null,846,8,"Rot","Wefler","Nord",77,30.95,2383.15,5.8495499999999998,450.41534999999999]
[null,823,8,"Sauer","Schulte","Süd",30,32.950000000000003,988.5,9.0612499999999994,271.83749999999998]
[null,823,8,"Meier","Schulte","Süd",22,26.95,592.9,5.0935499999999996,112.0581]
[null,823,8,"Feier","Schulte","Süd",22,26.95,592.9,7.4112499999999999,163.04750000000001]
[null,823,8,"Kader","Hunter","Süd",25,22.7,567.5,4.2903000000000002,107.25749999999999]
[null,823,8,"Wager","Hunter","Süd",77,22.2,1709.4,6.1050000000000004,470.08499999999998]
[null,823,8,"Loch","Hunter","Süd",33,23.4,772.2,4.4226000000000001,145.94579999999999]
[null,823,8,"Koch","Hunter","Süd",20,22.2,444,6.1050000000000004,122.1]
[null,823,8,"Block","Hunter","Süd",22,22.95,504.9,4.3375500000000002,95.426100000000005]
[null,825,8,"Bunt","Hunter","Süd",22,22.95,504.9,6.3112500000000002,138.8475]
[null,825,8,"Meier","Hunter","Süd",25,35.950000000000003,898.75,6.794550000000001,169.86375000000001]
[null,826,8,"Müller","Voss","Süd",77,29.95,2306.15,8.2362500000000001,634.19124999999997]
[null,823,8,"Rot","Voss","Süd",33,29.95,988.35,5.6605499999999997,186.79814999999999]
[null,823,8,"Rot","Voss","Süd",20,24.7,494,6.7925000000000004,135.85]
[null,842,8,"Bauer","Seiler","Nord",20,25.2,528,4.7627999999999995,95.255999999999986]
[null,842,8,"Müller","Voss","Nord",20,26.4,528,7.26,145.19999999999999]
[null,843,8,"Rot","Wefler","Nord",20,25.2,504,4.7627999999999995,95.255999999999986]
[null,844,8,"Rot","Wefler","Nord",22,24.95,548.9,6.8612500000000001,150.94749999999999]
[null,845,8,"Bauer","Wefler","Nord",22,22.95,504.9,4.3375500000000002,95.426100000000005]
[null,846,8,"Müller","Wefler","Nord",25,22.95,573.75,6.3112500000000002,157.78125]
[null,846,8,"Rot","Wefler","Nord",77,32.950000000000003,2537.15,6.2275500000000008,479.52135000000004]
[null,823,8,"Sauer","Schulte","Süd",20,32.950000000000003,659,9.0612499999999994,181.22499999999999]
[null,823,8,"Meier","Schulte","Süd",22,27.7,609.4,5.2352999999999996,115.17659999999999]
[null,823,8,"Feier","Schulte","Süd",22,28.2,620.4,7.7549999999999999,170.61]
[null,823,8,"Kader","Hunter","Süd",25,29.4,2171.4,5.5565999999999995,138.91499999999999]
[null,823,8,"Wager","Hunter","Süd",77,28.2,2171.4,7.7549999999999999,597.13499999999999]
[null,823,8,"Loch","Hunter","Süd",33,27.95,922.35,5.2825499999999996,174.32414999999997]
[null,823,8,"Koch","Hunter","Süd",20,22.2,444,6.1050000000000004,122.1]
[null,823,8,"Block","Hunter","Süd",22,22.95,504.9,4.3375500000000002,95.426100000000005]
[null,825,8,"Bunt","Hunter","Süd",22,22.95,504.9,6.3112500000000002,138.8475]
[null,825,8,"Meier","Hunter","Süd",25,35.950000000000003,898.75,6.794550000000001,169.86375000000001]
[null,826,8,"Müller","Voss","Süd",77,29.95,2306.15,8.2362500000000001,634.19124999999997]
[null,823,8,"Rot","Voss","Süd",33,29.95,988.35,5.6605499999999997,186.79814999999999]
[null,823,8,"Rot","Voss","Süd",20,24.7,494,6.7925000000000004,135.85]
[null,842,8,"Bauer","Seiler","Nord",20,25.2,528,4.7627999999999995,95.255999999999986]
[null,842,8,"Müller","Voss","Nord",20,26.4,528,7.26,145.19999999999999]
[null,843,8,"Rot","Wefler","Nord",20,25.2,504,4.7627999999999995,95.255999999999986]
[null,844,8,"Rot","Wefler","Nord",22,24.95,548.9,6.8612500000000001,150.94749999999999]
[null,845,8,"Bauer","Wefler","Nord",22,22.95,504.9,4.3375500000000002,95.426100000000005]
[null,846,8,"Müller","Wefler","Nord",25,22.95,573.75,6.3112500000000002,157.78125]
[null,846,8,"Rot","Wefler","Nord",77,32.950000000000003,2537.15,6.2275500000000008,479.52135000000004]
[null,823,8,"Sauer","Schulte","Süd",20,32.950000000000003,659,9.0612499999999994,181.22499999999999]
[null,823,8,"Meier","Schulte","Süd",22,27.7,609.4,5.2352999999999996,115.17659999999999]
[null,823,8,"Feier","Schulte","Süd",22,28.2,620.4,7.7549999999999999,170.61]
[null,823,8,"Kader","Hunter","Süd",25,29.4,2171.4,5.5565999999999995,138.91499999999999]
[null,823,8,"Wager","Hunter","Süd",77,28.2,2171.4,7.7549999999999999,597.13499999999999]
[null,823,8,"Loch","Hunter","Süd",33,27.95,922.35,5.2825499999999996,174.32414999999997]

{"sheet":"16 Zahlen als Text","index":33,"n_rows":104,"n_cols":36,"rows_kept":104,"cut":false,"hidden":false,"merged":[[37,2,48,8],[14,2,21,7],[1,1,1,4],[2,1,2,4],[4,2,11,7],[24,2,35,8],[22,2,22,9],[12,2,12,10]]}
[null,null,null,null,null,0]
[1,"16 Numbers as text",null,null,null,"Back to Start"]
[2,"16 Zahlen als Text",null,null,null,"Startseite"]
[]
[2,null,"\"In einigen Fällen werden Zahlen auf einem Arbeitsblatt als Text in Zellen formatiert und gespeichert, was zu Problemen bei Berechnungen oder zu einer verwirrenden Sortierreihenfolge führen kann. Dieses Problem tritt manchmal auf, nachdem Sie Daten aus einer Datenbank oder einer anderen externen Datenquelle importiert oder kopiert haben.\n\nAls Text formatierte Zahlen sind links- und nicht rechtsbündig in der Zelle ausgerichtet und häufig mit einem Fehlerindikator markiert.\"\n"]
[2]
[2]
[2]
[2]
[2]
[2]
[2]
[2,null,"https://support.office.com/de-de/article/Korrigieren-als-Text-formatierter-Zahlen-durch-Anwenden-eines-Zahlenformats-6599c03a-954d-4d83-b78a-23af2c8845d0"]
[]
[1,null,"In some cases, numbers in a worksheet are actually formatted and stored in cells as text, which can cause problems with calculations or produce confusing sort orders. This issue sometimes occurs after you import or copy data from a database or other external data source.\n\nNumbers that are formatted as text are left-aligned instead of right-aligned in the cell, and are often marked with an error indicator.\n"]
[1]
[1]
[1]
[1]
[1]
[1]
[1]
[1,null,"https://support.office.com/en-US/article/Fix-text-formatted-numbers-by-applying-a-number-format-6599C03A-954D-4D83-B78A-23AF2C8845D0"]
[]
[2,null,"Die folgende Listenauswertung zeigt ein Beispiel für diesen merkwürdigen Effekt. Es sollte ermittelt werden, wie lange und mit welcher Standardabweichung sich Container eines bestimmten Operators, eines bestimmten Typs und eines bestimmten Alters im Depot aufgehalten haben. Eine entsprechende Liste mit Daten wurde in Excel importiert.\nBeachten Sie die Spalte \"container type\"! Dabei kann es sich um reine Zahlen handeln - aber auch um Mischungen aus Zahlen und Buchstaben. Daher gibt Excel der Spalte nach dem Import den Typ \"Text\" und weist mit dem kleinen grünen Dreieck in der linken oberen Zellecke auf dieses Problem hin. Das sollten Sie nicht ignorieren!\nDie für die Berechnung der Standardabweichung in G54 erforderliche Formel in Spalte Z lautet nämlich: =WENN(UND(J61=$D$52;T61=$D$54);(Y61-$F$54)^2;\"\")\nBeachten Sie, dass die Bedingung T61 = $D$54 nicht \"Wahr\" liefert, obwohl in beiden Zellen \"4210\" steht!! \nSie müssen daher entweder die als Text gespeicherten Zahlen in Spalte T in Zahlen umwandeln (Klick auf das Fehlersymbol mit dem Ausrufezeichen) oder eine andere Formel benutzen:\n=WENN(UND(J61=$D$52;WENNFEHLER(WERT(T61);T61)=$D$54);(Y61-$F$54)^2;\"\")"]
[2]
[2]
[2]
[2]
[2]
[2]
[2]
[2,null,null,null,null,null,null,null,null,{"$f":"T61=$D$54","v":false},{"$f":"_xlfn.FORMULATEXT(J33)","v":"=T61=$D$54"}]
[2]
[2]
[2]
[]
[1,null,"The following list analysis shows an example for this strange effect. The task was to find out how long and with which standard deviation the containers of a certain operator, of a certain type and of a certain age stayed in a depot. A corresponding data list was imported into Excel. Please notice the column \"container type\"! This may be pure numbers or a mixture of numbers and characters. Therefore Excel defines this column as \"Text\" and indicates this problem with a little green triangle in the upper left corner of the cells. You shouldn't ignore this!\nThe formula in column Z, which is needed for the calculation of the standard deviation in G54 is:\n=IF(AND(J61=$D$52;T61=$D$54);(Y61-$F$54)^2;\"\")\nPlease notice, that the condition T61 = $D$54 doesn't give \"True\" - although there is \"4210\" in both cells!!\nTherefore you must either convert the number in column T which was stored as a text into a number (click on the error indicator with the exclamation mark) or use another formula (see column AC):\n=IF(AND(J61=$D$52;IFERROR(VALUE(T61);T61)=$D$54);(Y61-$F$54)^2;\"\")"]
[1]
[1]
[1]
[1]
[1]
[1]
[1,null,null,null,null,null,null,null,null,{"$f":"T61=$D$54","v":false},{"$f":"_xlfn.FORMULATEXT(J45)","v":"=T61=$D$54"}]
[1]
[1]
[1]
[1]
[]
[null,"for the example select:",null,null,"number","mean stay time \n(in days)","standard deviation \n(in days)","variation coefficient"]
[0,"OP7","operator","OP07",{"$f":"COUNTIF(J:J,D52)","v":46},{"$f":"IFERROR(AVERAGEIFS(Y:Y,J:J,D52),\"no data\")","v":7.3478260869565215},{"$f":"IFERROR(SQRT(AVERAGE(AB:AB)),\"no data\")","v":6.4713999268498723},{"$f":"IFERROR(G52/F52,\"no data\")","v":0.88072306696773417}]
[]
[null,4210,"container type",4210,{"$f":"COUNTIFS(J:J,D52,T:T,D54)","v":10},{"$f":"IFERROR(AVERAGEIFS(Y:Y,J:J,D52,T:T,D54),\"no data\")","v":8.8000000000000007},{"$f":"IFERROR(SQRT(AVERAGE(AC:AC)),\"no data\")","v":5.5461698495448193},{"$f":"IFERROR(G54/F54,\"no data\")","v":0.63024657381191118}]
[]
[null,"10 to 12 years","container age","10 to 12 years",{"$f":"COUNTIFS(J:J,D52,T:T,D54,O:O,D56)","v":3},{"$f":"IFERROR(AVERAGEIFS(Y:Y,J:J,D52,T:T,D54,O:O,D56),\"no data\")","v":6.666666666666667},{"$f":"IFERROR(SQRT(AVERAGE(AD:AD)),\"no data\")","v":6.0184900284225957},{"$f":"IFERROR(G56/F56,\"no data\")","v":0.90277350426338931}]
[]
[null,null,null,null,null,null,null,null,null,"operator","container nr","status","date built","age","age class","gate in","delivery","gate out","distribution","container type","yard position","arrival","departure","container status","stay time \n(in days)","doesn't work!","doesn't work!","works!","works!","works!",null,null,"operator","container type","age","interval"]
[null,null,null,null,null,null,null,null,null,"OP07","IMTU3053084","OK","2007-04-01",9,{"$f":"IF(N59=\"not spec.\",N59,IF((N59<=3),\"0 to 3 years\",IF((N59>=4)*(N59<=6),\"4 to 6 years\",IF((N59>=7)*(N59<=9),\"7 to 9 years\",IF((N59>=10)*(N59<=12),\"10 to 12 years\",IF((N59>=13)*(N59<=15),\"13 to 15 years\",IF((N59>=16)*(N59<=18),\"16 to 18 years\",IF((N59>=19)*(N59<=21),\"19 to 21 years\",IF((N59>=13)*(N59<=15),\"22 to 24 years\",IF((N59>=22)*(N59<=24),\"22 to 24 years\",IF((N59>=25)*(N59<=27),\"25 to 27 years\",IF((N59>=28)*(N59<=30),\"28 to 30 years\"))))))))))))","v":"7 to 9 years"},"2016-10-18T20:31:06","transfer area","2016-10-20T18:19:28","empty cont. depot","2210","E02","2016-10-19T09:54:10","2016-10-20T07:31:26","OFF_TERMINAL",{"$f":"ROUNDUP(W59-V59,0)","v":1},{"$f":"IF(AND(J59=$D$52,T59=$D$54),(Y59-$F$54)^2,\"\")","v":""},{"$f":"IF(AND(J59=$D$52,T59=$D$54,O59=$D$56),(Y59-$F$56)^2,\"\")","v":""},{"$f":"IF(J59=$D$52,(Y59-$F$52)^2,\"\")","v":40.294896030245745},{"$f":"IF(AND(J59=$D$52,IFERROR(VALUE(T59),T59)=$D$54),(Y59-$F$54)^2,\"\")","v":""},{"$f":"IF(AND(J59=$D$52,IFERROR(VALUE(T59),T59)=$D$54,O59=$D$56),(Y59-$F$56)^2,\"\")","v":""},null,null,"OP07",2210,"not spec.",{"$f":"AI59","v":"not spec."}]
[null,null,null,null,null,null,null,null,null,"OP07","EISU2147120","OK",null,"not spec.",{"$f":"IF(N60=\"not spec.\",N60,IF((N60<=3),\"0 to 3 years\",IF((N60>=4)*(N60<=6),\"4 to 6 years\",IF((N60>=7)*(N60<=9),\"7 to 9 years\",IF((N60>=10)*(N60<=12),\"10 to 12 years\",IF((N60>=13)*(N60<=15),\"13 to 15 years\",IF((N60>=16)*(N60<=18),\"16 to 18 years\",IF((N60>=19)*(N60<=21),\"19 to 21 years\",IF((N60>=13)*(N60<=15),\"22 to 24 years\",IF((N60>=22)*(N60<=24),\"22 to 24 years\",IF((N60>=25)*(N60<=27),\"25 to 27 years\",IF((N60>=28)*(N60<=30),\"28 to 30 years\"))))))))))))","v":"not spec."},"2016-10-25T11:13:21","transfer area","2016-10-27T18:38:35","empty cont. depot","2210","E01","2016-10-25T15:23:35","2016-10-26T18:24:31","OFF_TERMINAL",2,"","",28.599243856332702,"","",null,null,"OP08","22G1",3,{"$f":"\"0\"&\" to \"&AI60&\" years\"","v":"0 to 3 years"}]
[null,null,null,null,null,null,null,null,null,"OP07","EMCU1321321","OK","2006-07-01",10,"10 to 12 years","2016-09-26T07:16:25","transfer area","2016-10-07T11:04:01","empty cont. depot","4210","E14","2016-09-26T14:07:03","2016-09-29T16:35:00","OFF_TERMINAL",4,"","",11.207939508506614,23.040000000000006,7.1111111111111125,null,null,"OP09","22P3",6,{"$f":"AI60+1&\" to \"&AI61&\" years\"","v":"4 to 6 years"}]
[null,null,null,null,null,null,null,null,null,"OP07","BMOU3021565","DAMAGED",null,"not spec.","not spec.","2016-10-07T12:38:55","transfer area","2016-10-25T09:24:29","empty cont. depot","4210","E08","2016-10-10T20:42:30","2016-10-18T17:00:16","OFF_TERMINAL",8,"","",0.42533081285444263,0.64000000000000112,"",null,null,"OP10","22U1",9,{"$f":"AI61+1&\" to \"&AI62&\" years\"","v":"7 to 9 years"}]
[null,null,null,null,null,null,null,null,null,"OP07","EMCU1443166","OK","2008-10-01",8,"7 to 9 years","2016-10-10T20:54:35","transfer area","2016-10-21T06:46:37","empty cont. depot","4210","E16","2016-10-11T13:27:23","2016-10-14T19:43:18","OFF_TERMINAL",4,"","",11.207939508506614,23.040000000000006,"",null,null,"OP11",4210,12,"10 to 12 years"]
[null,null,null,null,null,null,null,null,null,"OP07","TCLU4393990","OK",null,"not spec.","not spec.","2016-12-01T09:44:19","transfer area","2016-12-08T14:55:22","empty cont. depot","4210","D02","2016-12-01T18:26:09","2016-12-07T13:38:50","OFF_TERMINAL",6,"","",1.8166351606805287,7.8400000000000043,"",null,null,null,4310,15,"13 to 15 years"]
[null,null,null,null,null,null,null,null,null,"OP07","IMTU1089236","OK",null,"not spec.","not spec.","2016-12-13T13:53:40","truck","2017-01-03T14:58:33","empty cont. depot","4210","E08","2016-12-14T11:50:18","2017-01-02T15:10:16","OFF_TERMINAL",20,"","",160.07750472589794,125.43999999999998,"",null,null,null,4510,18,"16 to 18 years"]
[null,null,null,null,null,null,null,null,null,"OP07","IMTU1101856","OK",null,"not spec.","not spec.","2016-12-14T15:48:35","transfer area","2016-12-20T13:56:37","empty cont. depot","4210","E06","2016-12-14T18:30:33","2016-12-19T20:40:06","OFF_TERMINAL",6,"","",1.8166351606805287,7.8400000000000043,"",null,null,null,null,21,"19 to 21 years"]
[null,null,null,null,null,null,null,null,null,"OP07","XINU4019807","OK","2006-09-01",10,"10 to 12 years","2017-02-06T14:44:28","truck","2017-02-28T18:15:39","empty cont. depot","4210","E12","2017-02-07T10:56:56","2017-02-21T21:22:52","OFF_TERMINAL",15,"","",58.555765595463143,38.439999999999991,69.444444444444429,null,null,null,null,24,"22 to 24 years"]
[null,null,null,null,null,null,null,null,null,"OP07","EMCU1277300","DAMAGED","2006-03-01",11,"10 to 12 years","2017-02-13T09:59:41","transfer area","2017-02-14T21:19:57","transfer area","4210","E18","2017-02-13T20:11:05","2017-02-14T17:05:09","OFF_TERMINAL",1,"","",40.294896030245745,60.840000000000011,32.111111111111114,null,null,null,null,27,"25 to 27 years"]
[null,null,null,null,null,null,null,null,null,"OP07","SEGU4003769","DAMAGED","2012-04-01",4,"4 to 6 years","2017-03-10T07:40:34","transfer area","2017-03-22T07:31:21","transfer area","4210","E14","2017-03-10T10:44:19","2017-03-22T07:18:19","OFF_TERMINAL",12,"","",21.642722117202272,10.239999999999995,"",null,null,null,null,30,"28 to 30 years"]
[null,null,null,null,null,null,null,null,null,"OP07","TCLU4352857","DAMAGED",null,"not spec.","not spec.","2017-03-10T07:41:53","transfer area","2017-03-22T07:48:43","transfer area","4210","E14","2017-03-10T10:39:35","2017-03-22T07:31:04","OFF_TERMINAL",12,"","",21.642722117202272,10.239999999999995,""]
[null,null,null,null,null,null,null,null,null,"OP07","EGHU1003500","OK","2008-05-01",8,"7 to 9 years","2016-10-24T08:11:19","transfer area","2016-10-25T14:56:15","transfer area","4310","E04","2016-10-24T18:19:53","2016-10-25T14:48:41","OFF_TERMINAL",1,"","",40.294896030245745,"",""]
[null,null,null,null,null,null,null,null,null,"OP07","IMTU1038162","DAMAGED","2006-11-01",10,"10 to 12 years","2017-03-01T10:42:41","transfer area",null,"empty cont. depot","4310","D08","2017-03-01T16:39:47","2017-03-22T17:46:06","ON_TERMINAL",22,"","",214.68620037807185,"",""]
[null,null,null,null,null,null,null,null,null,"OP07","EMCU1257217","DAMAGED",null,"not spec.","not spec.","2017-03-13T07:56:55","transfer area",null,"empty cont. depot","4310","D02","2017-03-13T09:45:23","2017-03-22T17:45:27","ON_TERMINAL",10,"","",7.034026465028357,"",""]
[null,null,null,null,null,null,null,null,null,"OP07","EISU1828073","OK",null,"not spec.","not spec.","2017-03-16T10:06:09","transfer area","2017-03-24T12:50:05","empty cont. depot","4310","E14","2017-03-16T13:47:39","2017-03-21T21:03:06","OFF_TERMINAL",6,"","",1.8166351606805287,"",""]
[null,null,null,null,null,null,null,null,null,"OP07","EGSU9030044","OK",null,"not spec.","not spec.","2017-03-07T11:54:06","truck","2017-03-13T14:56:47","empty cont. depot","4510","E14","2017-03-08T13:24:12","2017-03-10T15:44:17","OFF_TERMINAL",3,"","",18.903591682419659,"",""]
[null,null,null,null,null,null,null,null,null,"OP07","EMCU9828800","DAMAGED",null,"not spec.","not spec.","2017-03-10T07:06:58","truck",null,"empty cont. depot","4510","D02","2017-03-13T09:53:32","2017-03-22T17:41:48","ON_TERMINAL",10,"","",7.034026465028357,"",""]
[null,null,null,null,null,null,null,null,null,"OP07","GESU6352071","OK","2010-09-01",6,"4 to 6 years","2017-03-10T13:34:22","truck","2017-03-24T18:24:17","empty cont. depot","4510","D02","2017-03-17T08:18:30","2017-03-22T11:57:47","OFF_TERMINAL",6,"","",1.8166351606805287,"",""]
[null,null,null,null,null,null,null,null,null,"OP07","HMCU9222246","DAMAGED","2013-05-01",3,"0 to 3 years","2017-03-16T10:17:43","transfer area",null,"empty cont. depot","4510","D02","2017-03-17T08:41:31","2017-03-22T11:48:34","ON_TERMINAL",6,"","",1.8166351606805287,"",""]
[null,null,null,null,null,null,null,null,null,"OP07","IMTU9073703","DAMAGED",null,"not spec.","not spec.","2017-03-17T07:50:47","transfer area","2017-03-22T11:27:09","transfer area","4510","D02","2017-03-17T10:57:09","2017-03-22T11:14:24","OFF_TERMINAL",6,"","",1.8166351606805287,"",""]
[null,null,null,null,null,null,null,null,null,"OP07","EISU9262260","DAMAGED","2013-03-01",4,"4 to 6 years","2017-03-17T07:55:55","transfer area",null,"empty cont. depot","4510","D02","2017-03-17T10:42:29","2017-03-22T11:17:03","ON_TERMINAL",6,"","",1.8166351606805287,"",""]
[null,null,null,null,null,null,null,null,null,"OP07","EISU3803536","DAMAGED",null,"not spec.","not spec.","2016-09-13T08:08:59","transfer area","2016-11-24T12:47:54","empty cont. depot","22G1","E02","2016-10-24T10:13:53","2016-11-24T12:47:54","OFF_TERMINAL",32,"","",607.72967863894132,"",""]
[null,null,null,null,null,null,null,null,null,"OP07","EMCU3913649","DAMAGED","2010-05-01",6,"4 to 6 years","2016-09-23T11:00:12","transfer area","2016-09-28T16:17:21","transfer area","22G1","E01","2016-09-26T21:11:42","2016-09-28T14:58:02","OFF_TERMINAL",2,"","",28.599243856332702,"",""]
[null,null,null,null,null,null,null,null,null,"OP07","DRYU2774966","OK","2013-02-01",4,"4 to 6 years","2016-09-23T15:04:34","truck","2016-10-13T09:56:30","empty cont. depot","22G1","E02","2016-09-26T08:27:13","2016-09-27T16:52:07","OFF_TERMINAL",2,"","",28.599243856332702,"",""]
[null,null,null,null,null,null,null,null,null,"OP07","IMTU3073692","OK","2007-08-01",9,"7 to 9 years","2016-09-23T15:34:45","truck","2016-10-05T07:32:08","empty cont. depot","22G1","E02","2016-09-26T09:15:30","2016-09-27T16:16:20","OFF_TERMINAL",2,"","",28.599243856332702,"",""]
[null,null,null,null,null,null,null,null,null,"OP07","TGHU0712722","OK","2007-06-01",9,"7 to 9 years","2016-09-26T15:39:01","truck","2016-10-11T12:31:07","empty cont. depot","22G1","E02","2016-09-27T12:46:24","2016-09-27T15:54:41","OFF_TERMINAL",1,"","",40.294896030245745,"",""]
[null,null,null,null,null,null,null,null,null,"OP07","EGSU3119237","OK",null,"not spec.","not spec.","2016-09-26T17:40:53","transfer area","2016-09-30T19:56:20","empty cont. depot","22G1","E01","2016-09-26T20:26:11","2016-09-27T15:36:00","OFF_TERMINAL",1,"","",40.294896030245745,"",""]
[null,null,null,null,null,null,null,null,null,"OP07","EISU7500076","OK","2004-06-01",12,"10 to 12 years","2016-09-28T06:38:55","transfer area","2016-10-19T18:41:17","transfer area","22P3","LA01","2016-10-04T08:31:33","2016-10-05T21:01:07","OFF_TERMINAL",2,"","",28.599243856332702,"",""]
[null,null,null,null,null,null,null,null,null,"OP07","EISU7501895","OK","2004-06-01",12,"10 to 12 years","2016-10-11T07:53:20","transfer area","2016-10-19T18:47:35","transfer area","22P3","LA01","2016-10-12T13:29:40","2016-10-18T21:02:24","OFF_TERMINAL",7,"","",0.12098298676748566,"",""]
[null,null,null,null,null,null,null,null,null,"OP07","TCLU6800652","OK",null,"not spec.","not spec.","2016-10-18T09:08:55","truck","2016-11-04T10:57:57","transfer area","22P3","LA01","2016-10-18T16:17:37","2016-10-25T19:55:51","OFF_TERMINAL",8,"","",0.42533081285444263,"",""]
[null,null,null,null,null,null,null,null,null,"OP07","EISU7501447","OK",null,"not spec.","not spec.","2016-10-20T10:14:49","unknown","2016-10-31T06:53:59","transfer area","22P3","LA01","2016-10-20T20:45:58","2016-10-25T20:41:11","OFF_TERMINAL",5,"","",5.5122873345935721,"",""]
[null,null,null,null,null,null,null,null,null,"OP07","EISU7500369","OK","2004-05-01",12,"10 to 12 years","2016-11-04T14:56:32","truck","2016-11-17T06:43:24","transfer area","22P3","LA01","2016-11-08T10:43:51","2016-11-11T20:54:18","OFF_TERMINAL",4,"","",11.207939508506614,"",""]
[null,null,null,null,null,null,null,null,null,"OP07","EISU7501236","OK","2004-08-01",12,"10 to 12 years","2016-11-22T06:42:03","transfer area","2016-12-13T15:49:30","transfer area","22P3","LA01","2016-11-22T12:49:21","2016-12-01T19:58:06","OFF_TERMINAL",10,"","",7.034026465028357,"",""]
[null,null,null,null,null,null,null,null,null,"OP07","EISU7502886","OK","2006-03-01",11,"10 to 12 years","2016-11-23T10:35:00","transfer area","2016-12-13T15:49:58","transfer area","22P3","LA01","2016-11-23T13:43:58","2016-12-01T18:42:42","OFF_TERMINAL",9,"","",2.7296786389413996,"",""]
[null,null,null,null,null,null,null,null,null,"OP07","EMCU7605639","OK",null,"not spec.","not spec.","2016-11-24T12:30:44","transfer area","2016-12-13T15:49:42","transfer area","22P3","LA01","2016-11-28T16:50:33","2016-12-01T18:28:20","OFF_TERMINAL",4,"","",11.207939508506614,"",""]
[null,null,null,null,null,null,null,null,null,"OP07","EISU4602449","OK","2005-01-01",12,"10 to 12 years","2016-09-29T20:24:30","transfer area","2016-10-11T15:37:34","empty cont. depot","22U1","E03","2016-09-30T15:54:40","2016-10-07T06:46:01","OFF_TERMINAL",7,"","",0.12098298676748566,"",""]
[null,null,null,null,null,null,null,null,null,"OP07","EISU4600180","OK","2005-01-01",12,"10 to 12 years","2016-10-05T13:46:30","transfer area","2016-11-01T08:20:33","empty cont. depot","22U1","E03","2016-10-06T07:52:59","2016-10-07T06:32:32","OFF_TERMINAL",1,"","",40.294896030245745,"",""]
[null,null,null,null,null,null,null,null,null,"OP07","EISU4600657","OK","2005-04-01",11,"10 to 12 years","2016-10-06T09:43:03","truck","2016-11-22T08:38:30","empty cont. depot","22U1","E02","2016-10-24T08:16:09","2016-10-27T17:17:42","OFF_TERMINAL",4,"","",11.207939508506614,"",""]
[null,null,null,null,null,null,null,null,null,"OP07","EMCU4606333","OK","2014-02-01",3,"0 to 3 years","2016-10-12T20:45:26","transfer area","2016-10-17T09:16:06","empty cont. depot","22U1","E01","2016-10-13T08:03:53","2016-10-13T18:57:35","OFF_TERMINAL",1,"","",40.294896030245745,"",""]
[null,null,null,null,null,null,null,null,null,"OP07","EISU4602984","OK","2005-01-01",12,"10 to 12 years","2016-10-14T17:28:29","truck","2016-11-10T18:32:13","empty cont. depot","22U1","E02","2016-10-25T09:55:48","2016-11-09T16:00:10","OFF_TERMINAL",16,"","",74.860113421550096,"",""]
[null,null,null,null,null,null,null,null,null,"OP07","EMCU4606518","OK","2014-02-01",3,"0 to 3 years","2016-10-17T13:58:28","truck","2016-11-01T08:04:15","empty cont. depot","22U1","E01","2016-10-25T10:05:33","2016-10-31T13:14:49","OFF_TERMINAL",7,"","",0.12098298676748566,"",""]
[null,null,null,null,null,null,null,null,null,"OP07","EMCU4606626","OK",null,"not spec.","not spec.","2016-10-17T13:58:28","truck","2016-11-01T09:44:25","empty cont. depot","22U1","E02","2016-10-25T07:08:32","2016-10-31T11:18:31","OFF_TERMINAL",7,"","",0.12098298676748566,"",""]
[null,null,null,null,null,null,null,null,null,"OP07","EISU4600765","OK","2005-01-01",12,"10 to 12 years","2016-10-25T13:58:41","truck","2016-10-31T15:25:32","empty cont. depot","22U1","E01","2016-10-26T13:22:07","2016-10-31T11:23:56","OFF_TERMINAL",5,"","",5.5122873345935721,"",""]
[null,null,null,null,null,null,null,null,null,"OP07","EMCU4606930","OK","2014-02-01",3,"0 to 3 years","2016-11-01T17:26:33","truck","2016-11-23T08:18:18","empty cont. depot","22U1","E01","2016-11-09T08:27:28","2016-11-21T16:37:39","OFF_TERMINAL",13,"","",31.947069943289229,"",""]
[null,null,null,null,null,null,null,null,null,"OP07","EMCU4603761","OK",null,"not spec.","not spec.","2016-11-02T07:32:59","truck","2016-12-01T09:33:50","empty cont. depot","22U1","E02","2016-11-08T13:39:06","2016-11-28T20:54:37","OFF_TERMINAL",21,"","",186.38185255198488,"",""]

{"sheet":"17 BEREICH.VERSCHIEBEN()","index":34,"n_rows":344,"n_cols":16,"rows_kept":344,"cut":false,"hidden":false,"merged":[[1,1,1,4],[2,1,2,4],[4,2,17,8],[19,2,25,8],[123,2,131,8],[100,2,111,8],[113,2,113,8],[27,2,38,8],[40,2,45,8],[72,2,82,8],[90,2,98,8],[47,2,47,8],[70,2,70,7],[67,2,68,8],[57,2,65,8],[8,10,8,11],[12,10,12,11],[16,10,16,11],[218,2,218,16],[208,2,208,10],[136,2,136,7],[138,2,148,8],[156,2,164,8],[166,2,176,8],[189,2,198,10],[36,10,36,11],[30,10,30,11],[33,10,33,11],[133,2,134,8],[300,2,310,13],[220,2,222,10],[189,14,189,18],[210,2,216,10],[280,2,280,16],[282,2,284,10],[251,14,251,17],[251,2,260,10],[262,2,268,10],[270,2,270,10],[272,2,278,10],[239,2,249,16],[200,2,206,10],[224,2,237,8],[286,2,298,8]]}
[null,null,null,null,null,null,null,null,null,null,null,null,null,null,null,0]
[1,"17 OFFSET()",null,null,null,"Back to Start"]
[2,"17 BEREICH.VERSCHIEBEN()",null,null,null,"Startseite"]
[]
[2,"Das Problem","Es gibt viele Excel-Funktionen, die als Argument einen Zellbereich benötigen:\n\nWenn Sie eine Pivot-Tabelle erstellen, kommen die Daten dafür aus einem bestimmen Zellbereich, der eine Liste mit Daten enthält. Dieser Zellbereich kann nachträglich über Pivottable-Tools / Analysieren / \"Datenquelle ändern\" geändert werden.\n\nWenn Sie ein Diagramm erstellen, kommen die Daten dafür aus einem bestimmten Zellbereich, der eine Liste mit Daten enthält. Dieser Zellbereich kann nachträglich mit Rechtsklick / \"Daten auswählen\" geändert werden.\n\nMit\" Daten\" / \"Datentools\" / \"Datenüberprüfung\" können Sie festlegen, dass in eine bestimmte Zelle nur bestimmte Daten eingegeben werden dürfen. Die erlaubten Daten können dabei auch aus einem Zellbereich mit einer Liste kommen.\n"]
[2]
[2]
[2,null,null,null,null,null,null,null,null,null,"siehe"]
[2,null,null,null,null,null,null,null,null,null,{"$f":"'18 Liste fortschreiben (1)'!B3","v":"18 Liste fortschreiben (1)"}]
[2]
[2]
[2,null,null,null,null,null,null,null,null,null,"siehe"]
[2,null,null,null,null,null,null,null,null,null,{"$f":"'19 Liste fortschreiben (2)'!B3","v":"19 Liste fortschreiben (2)"}]
[2]
[2]
[2,null,null,null,null,null,null,null,null,null,"siehe"]
[2,null,null,null,null,null,null,null,null,null,{"$f":"'20 Liste fortschreiben (3)'!B3","v":"20 Liste fortschreiben (3)"}]
[2]
[2]
[2,null,"In allen Fällen muss der Zellbereich in der Excel-üblichen Art \"Linke obere Ecke - Doppelpunkt - rechte untere Ecke\" angegeben werden (z.B. \"C5:G32\"). Wenn Sie zu den vorhandenen Daten neue Daten (Zeilen oder Spalten) hinzufügen möchten oder einige Daten löschen möchten, müssen Sie die Bereichsangaben entsprechend ändern.\n\nWäre es nicht wunderbar, wenn das automatisch geschehen würde?\nUnd tatsächlich gibt es eine \"Zauberformel\" dafür: BEREICH.VERSCHIEBEN()"]
[2]
[2]
[2]
[2]
[2]
[2]
[]
[1,"The Problem","There are many Excel functions, which require a range of cells as an argument:\n\nIf you create a PivotTable, the data for it come from a range of cells containing a list of data. This range can be changed by \"Pivottable-Tools / Analyze / \"Change Data Source\".\n\nIf you create a diagram, the data for it come from a range of cells containing a list of data. This range can be changed by a right click an \"Select Data\".\n\nUsing \"Data\" / \"Data Tools\" / \"Data Validation\" you can define, that only certain data may be entered in a certain cell. These data may come from a range of cells with a list."]
[1]
[1,null,null,null,null,null,null,null,null,null,"see"]
[1,null,null,null,null,null,null,null,null,null,{"$f":"'18 Liste fortschreiben (1)'!B2","v":"18 Extend a list (1)"}]
[1]
[1,null,null,null,null,null,null,null,null,null,"see"]
[1,null,null,null,null,null,null,null,null,null,{"$f":"'19 Liste fortschreiben (2)'!B2","v":"19 Extend a list (2)"}]
[1]
[1,null,null,null,null,null,null,null,null,null,"see"]
[1,null,null,null,null,null,null,null,null,null,{"$f":"'20 Liste fortschreiben (3)'!B2","v":"20 Extend a list (3)"}]
[1]
[1]
[1]
[1,null,"In all cases the range of cells must be defined as usual in Excel: \"Left upper corner - double colon - right lower corner\" (e.g. \"C5:G32\"). If you want to add new data (rows or columns) or to delete some data the range of cells must be changed correspondingly.\n\nWouldn't it be wonderful, if this was done automatically?\nAnd indeed there is a \"magic formula\" for that: OFFSET()"]
[1]
[1]
[1]
[1]
[1]
[]
[2,"Die Lösung","BEREICH.VERSCHIEBEN(B2:3;2;5;3)"]
[2,null,null,"Start in B2"]
[2]
[2,null,null,"3 runter"]
[2,null,null,null,"2 rüber",null,"Breite: 3"]
[2]
[2,null,null,null,null,"Höhe: 5"]
[2]
[2]
[2]
[2,null,"Die Funktion BEREICH.VERSCHIEBEN liefert als Ergebnis einen Bereich (oben gelb markiert). Dieser Bereich beginnt 3 Zeilen unter der Startzelle in B2 und 2 Spalten rechts davon. Er ist 5 Zeilen hoch und 3 Spalten breit.\n\nACHTUNG: \nEs macht keinen Sinn, in eine Zelle zu schreiben =BEREICH.VERSCHIEBEN(…).\nDie Funktion BEREICH.VERSCHIEBEN kann nur als Argument einer anderen Funktion benutzt werden - z.B. =SUMME(BEREICH.VERSCHIEBEN(...))"]
[2]
[2]
[2]
[2]
[2]
[2]
[2]
[2]
[2]
[2,null,"Die Formel BEREICH.VERSCHIEBEN wird nun z.B. in folgender Form benutzt, um einen Bereich flexibel zu definieren:"]
[2]
[2]
[2,null,"BEREICH.VERSCHIEBEN(B2;0;0;ANZAHL2(B:B);ANZAHL2(2:2))"]
[2]
[2,null,"Im obigen Beispiel ist B2 die Startzelle. Der erste Trick besteht dann darin, das zweite und dritte Argument Null zu setzen, d.h. man geht nicht von der Startzelle aus runter und rüber, sondern bleibt in der Startzelle. Der zu definierende Bereich beginnt also in der Startzelle!\n\nDer zweite und entscheidende Trick besteht dann darin, dass man für die Höhe und Breite des Bereiches keine festen Zahlen angibt. Stattdessen lässt man Excel mit Hilfe der Funktion ANZAHL2() selber zählen, wie viele Werte es in der Spalte der Startzelle (im Beispiel B) und in der Zeile der Startzelle (im Beispiel 2) gibt. Werden jetzt Zeilen oder Spalten hinzugefügt, passen sich die Höhe und Breite des Bereiches automatisch an.\n\nIst das nicht phantastisch?"]
[2]
[2]
[2]
[2]
[2]
[2]
[2]
[2]
[2]
[2]
[2]
[2,null,null,"Start in B2","Breite: ANZAHL2(2:2)"]
[2]
[2,null,null,"Höhe: ANZAHL2(B:B)"]
[2]
[2]
[2]
[2,"Achtung","Zwei Bedingungen müssen erfüllt sein, damit die \"Zauberformel\" funktioniert:\n\n(1) Die erste Spalte und die erste Zeile des Bereiches dürfen keine leeren Zellen enthalten, sonst zählt ANZAHL2() falsch!\n\n(2) Die erste Spalte und die erste Zeile des Bereiches dürfen außer den Listendaten keine weiteren Daten enthälten - z.B. noch irgendwo weiter unten oder weiter rechts. Dann würde ANZAHL2() wieder falsch zählen! \n"]
[2]
[2]
[2]
[2]
[2]
[2]
[2]
[2]
[2]
[2,"Beispiel","Die einfachste Anwendung der Formel BEREICH.VERSCHIEBEN() ist die Formel SUMME(), die als Argument einen Bereich erwartet. Im Beispiel rechts wird dieser Bereich flexibel definiert. Bitte sehen Sie sich das aufmerksam an!\n\nBeachten Sie, dass die gelb markierten Zeilen und Spalten außer den Listenwerten keine weiteren Daten enthalten dürfen, damit ANZAHL2() richtig zählt!\n\nWenn Sie jetzt unterhalb der letzten Datenzeile oder rechts von der letzten Datenspalte weitere Daten hinzufügen, wird die Summe automatisch neu berechnet - WENN Sie obige Bedingung (1) beachtet haben: Die erste Spalte und die erste Zeile des Bereiches dürfen keine Leerzellen enthalten!"]
[2]
[2]
[2]
[2]
[2]
[2]
[2]
[2]
[2]
[2]
[2]
[]
[1,"The Solution","OFFSET(B2:3;2;5;3)"]
[1,null,null,"Start in B2"]
[1]
[1,null,null,"3 down"]
[1,null,null,null,"2 right",null,"width: 3"]
[1]
[1,null,null,null,null,"height: 5"]
[1]
[1]
[1]
[1,null,"The result of the function OFFSET() is a range (marked in yellow above). This range starts 3 rows below the start cell B2 and 2 columns right to it. It is 5 rows high and has a width of 3 columns.\n\nATTENTION: \nIt doesn't make sense to write =OFFSET() in a cell.\nThe function OFFSET() can only be used as an argument of another function - e.g. =SUM(OFFSET(...))"]
[1]
[1]
[1]
[1]
[1]
[1]
[1]
[1]
[1]
[1,null,"The formula OFFSET() is used in the following way make a flexible definition of a range of cells:"]
[1]
[1]
[1,null,"OFFSET(B2;0;0;COUNTA(B:B);COUNTA(2:2))"]
[1]
[1,null,"In the above example B2 is the start cell. The first trick is to set the second and the third argument to zero. That means, we don't move down and right but stay in the start cell. Consequently, the range starts in the start cell! \n\nThe second and decisive trick is, that we don't enter fixed numbers for the hight and the width of the range. Instead of, we  use the function COUNTA() to let Excel count itself , how many values are there in the column of the start cell (e.g. B) and in the row of the start cell (e.g. 2). If we now add rows or columns the hight and the width of the range is adjusted automatically.\n\nIsn't that fantastic?"]
[1]
[1]
[1]
[1]
[1]
[1]
[1]
[1]
[1]
[1]
[1]
[1,null,null,"Start in B2","width: COUNTA(2:2)"]
[1]
[1,null,null,"hight: COUNTA(B:B)"]
[1]
[1]
[1]
[1,"Attention","Two requirements must be fulfilled to make the \"magic formula\" work:\n\n(1) The first row and the first column of the range must not contain empty cells - otherwise COUNTA() wouldn't count correctly!\n\n(2) The first row and the first column of the range must not contain any other data except the list data - e.g. somewhere down or right to the list range; otherwise COUNTA() wouldn't count correctly!"]
[1]
[1]
[1]
[1]
[1]
[1]
[1]
[1]
[1]
[1,"Example","The simplest application of OFFSET() is the formula SUM(), which expects a range of data as an argument. In the example (see to the right) this range is defined flexibly. Please have an attentive look at it!\n\nPlease consider, that the orange row as well as the orange column must not contain any other data except the list data  - otherwise COUNTA() wouldn't count correctly!\n\nIf you now add new data below the last row or right to the last column the sum is recalculated automatically - IF you have considered the requirement (1) from above: The first row and the first column of the list must not contain empty cells!"]
[1]
[1]
[1]
[1]
[1]
[1]
[1]
[1]
[1]
[1]
[null,null,null,null,null,null,null,null,null,null,null,2,1]
[null,null,null,null,null,null,null,null,null,null,null,3,2]
[null,null,null,null,null,null,null,null,null,null,null,1,3]
[null,null,null,null,null,null,null,null,null,null,null,1,1]
[]
[]
[]
[2,null,null,null,null,null,null,null,null,null,null,null,null,null,"Summe=",{"$f":"SUM(OFFSET(L178,0,0,COUNTA(L:L),COUNTA(178:178)))","v":14}]
[2,null,null,null,null,null,null,null,null,null,null,null,null,null,"Formel:",{"$f":"_xlfn.FORMULATEXT(P185)","v":"=SUM(OFFSET(L178,0,0,COUNTA(L:L),COUNTA(178:178)))"}]
[1,null,null,null,null,null,null,null,null,null,null,null,null,null,"Sum=",{"$f":"SUM(OFFSET(L178,0,0,COUNTA(L:L),COUNTA(178:178)))","v":14}]
[1,null,null,null,null,null,null,null,null,null,null,null,null,null,"Formula:",{"$f":"_xlfn.FORMULATEXT(P187)","v":"=SUM(OFFSET(L178,0,0,COUNTA(L:L),COUNTA(178:178)))"}]
[]
[2,"Die totale","Wir haben jetzt den Bereich, auf den eine Formel - im Beispiel SUMME() - angewendet werden soll, flexibel definiert. Der Nutzer kann am Ende der Liste Zeilen oder Spalten hinzufügen bzw. Zeilen oder Spalten löschen.\nABER: In der Formel BEREICH.VERSCHIEBEN werden einige feste Werte benutzt:\n\n- die Adresse der linken oberen Ecke der Liste = L178 = erstes Argument von BEREICH.VERSCHIEBEN()\n- der Spaltenbuchstabe und die Zeilennummer der linken oberen Ecke der Liste = L:L und 178:178 = Argumente von ANZAHL2()\n\nDas hat einen großen Nachteil: Wenn sich die linke obere Ecke der Liste verschiebt - z.B. wenn darüber oder links davon Zeilen oder Spalten eingefügt oder gelöscht werdden - stimmt die Bereichsdefinition nicht mehr.",null,null,null,null,null,null,null,null,null,null,null,"mit dem Namen der linken oberen Ecke der Liste:"]
[2,"Flexibilität"]
[2,null,null,null,null,null,null,null,null,null,null,null,null,null,"Summe=",{"$f":"SUM(OFFSET(SumStartCell,0,0,COUNTA(OFFSET(SumStartCell,0,0,1000000,1)),COUNTA(OFFSET(SumStartCell,0,0,1,16000))))","v":14}]
[2,null,null,null,null,null,null,null,null,null,null,null,null,null,"Formel:",{"$f":"_xlfn.FORMULATEXT(P192)","v":"=SUM(OFFSET(SumStartCell,0,0,COUNTA(OFFSET(SumStartCell,0,0,1000000,1)),COUNTA(OFFSET(SumStartCell,0,0,1,16000))))"}]
[2]
[2]
[2,null,null,null,null,null,null,null,null,null,null,null,null,null,"mit dem Namen der Bereichsdefinition:"]
[2]
[2,null,null,null,null,null,null,null,null,null,null,null,null,null,"Summe=",{"$f":"SUM(SumDataSource)","v":14}]
[2,null,null,null,null,null,null,null,null,null,null,null,null,null,"Formel:",{"$f":"_xlfn.FORMULATEXT(P198)","v":"=SUM(SumDataSource)"}]
[2]
[2,null,"Wir müssen daher die Lage der linken oberen Ecke der Liste unabhängig vom konkreten Spaltebuchstaben und der konkreten Zeilenummer definieren. Das geht in Excel ganz einfach, indem man der Zelle einen Namen gibt und sie anschließend nicht mehr über Zeile und Spalte adressiert:\n\nFORMELN / \"Namens-Manager\" / \"Neu\"\n\nAnschließend sieht die Bereichsdefinition z.B. so aus:"]
[2]
[2]
[2]
[2]
[2]
[2]
[2]
[2,null,"=BEREICH.VERSCHIEBEN(SumStartCell;0;0;ANZAHL2(L:L);ANZAHL2(178:178))"]
[2]
[2,null,"Dabei ist \"SumStartCell\" der Name der Zelle in der linken oberen Ecke der Liste.\n\nJetzt müssen noch die Argumente von ANZAHL2() geändert werden, so dass sie keinen Bezug mehr auf eine konkrete Spalte oder Zeile enthalten. Wir brauchen also eine Möglichkeit, um aus dem Namen der linken oberen Ecke der Liste (\"SumStartCell\") \"L:L\" bzw. \"178:178\" zu machen. Das geht zwar - ist aber leider enorm umständlich. Wir benutzen daher einfach wieder BEREICH.VERSCHIEBEN()! Da Excel maximal etwas über eine Million Zeilen und etwas über 16.000 Spalten verwalten kann, sieht die Bereichsdefinition letztendlich so aus:"]
[2]
[2]
[2]
[2]
[2]
[2]
[2]
[2,null,"=BEREICH.VERSCHIEBEN(SumStartCell;0;0;ANZAHL2(BEREICH.VERSCHIEBEN(SumStartCell;0;0;1000000;1));ANZAHL2(BEREICH.VERSCHIEBEN(SumStartCell;0;0;1;16000)))"]
[2]
[2,null,"Das heißt, wir lassen ANZAHL2() ausgehend von der linken oberen Ecke so weit herunter bzw. nach rechts zählen, wie es maximal geht!"]
[2]
[2]
[2]
[2,"Bereichsname","… und jetzt eine weitere Vereinfachung:\nDie Formel BEREICH.VERSCHIEBEN() ist ja nun ziemlich kompliziert geworden. Wenn man den damit definierten flexiblen Bereich nur ein einziges mal in einer anderen Formel benötigt, ist das ok. Braucht man den Bereich aber mehrfach an verschiedenen Stellen, so müsste man die komplizierte Formel mehrfach schreiben. Dafür gibt es eine Vereinfachung: Definieren Sie mit\n\nFORMELN / \"Namens-Manager\" / \"Neu\"\n\neinen Namen (z.B. \"SumDataSource\") und geben Sie dann unter \"Bezieht sich auf\" die obige  BEREICH.VERSCHIEBEN()-Formel ein!\n\nAnschließend können Sie in Formeln statt der komplizierten BEREICH.VERSCHIEBEN()-Formel einfach den Bereichsnamen benutzen. (siehe Beispiel rechts!)"]
[2]
[2]
[2]
[2]
[2]
[2]
[2]
[2]
[2]
[2]
[2]
[2]
[2]
[2]
[2,"Vorgehensweise","Nach dieser langen, langen Erklärung können Sie also nun für eine flexible Bereichsdefinition ganz einfach so vorgehen:\n\n(1) Geben Sie der Zelle in der linken oberen Ecke der Liste mit Daten einen Namen (z.B. \"XxxStartCell\")\n(2) Definieren Sie dann ebenfalls mit Hilfe des Namens-Managers folgenden Bereich (z.B. \"XxxDataSource\"):\n\n=BEREICH.VERSCHIEBEN(XxxStartCell;0;0;ANZAHL2(BEREICH.VERSCHIEBEN(XxxStartCell;0;0;1000000;1));ANZAHL2(BEREICH.VERSCHIEBEN(XxxStartCell;0;0;1;16000)))\n\n(3) Geben Sie \"XxxDataSource\" als Datenquelle (z.B. einer Pivot-Tabelle oder eines Diagramms) an.\n\nFertig! (Beispiele finden Sie auf den nächsten Arbeitsblättern)"]
[2]
[2]
[2]
[2]
[2]
[2]
[2]
[2]
[2]
[2]
[]
[1,"The total","Now have defined the range which shall be used in a formula - e.g. SUM() - flexibly. The user can add rows and columns to the list or delete rows and columns from the list.\nBUT: Some fixed values are used in the OFFSET() formula:\n\n- the address of the upper left corner of the list = L178 = first argument of OFFSET()\n- the column letter and the row number of the upper left corner of the list = L:L and 178:178 = arguments of COUNTA()\n\nThen there is a big disadvantage: If the upper left corner is moved  - e.g. if rows or columns are added or removed above or left to the list - the range definition is no longer true!",null,null,null,null,null,null,null,null,null,null,null,"with the name of the upper left corner of the list:"]
[1,"flexibility:"]
[1,null,null,null,null,null,null,null,null,null,null,null,null,null,"Sum=",{"$f":"SUM(OFFSET(SumStartCell,0,0,COUNTA(OFFSET(SumStartCell,0,0,1000000,1)),COUNTA(OFFSET(SumStartCell,0,0,1,16000))))","v":14}]
[1,null,null,null,null,null,null,null,null,null,null,null,null,null,"Formula:",{"$f":"_xlfn.FORMULATEXT(P254)","v":"=SUM(OFFSET(SumStartCell,0,0,COUNTA(OFFSET(SumStartCell,0,0,1000000,1)),COUNTA(OFFSET(SumStartCell,0,0,1,16000))))"}]
[1]
[1]
[1,null,null,null,null,null,null,null,null,null,null,null,null,null,"with the name of the range definition:"]
[1]
[1,null,null,null,null,null,null,null,null,null,null,null,null,null,"Sum=",{"$f":"SUM(SumDataSource)","v":14}]
[1,null,null,null,null,null,null,null,null,null,null,null,null,null,"Formula:",{"$f":"_xlfn.FORMULATEXT(P260)","v":"=SUM(SumDataSource)"}]
[1]
[1,null,"Therefore we have to define the upper left corner of the list independently from concrete column letter and row number. That is very simple with Excel by giving the cell a name. Then the cell can be addressed by its name and no longer with its column and row:\n\nFORMULAS / \"Name Manager\" / \"New ...\"\n\nAfterwards the range definition looks like this:"]
[1]
[1]
[1]
[1]
[1]
[1]
[1]
[1,null,"=OFFSET(SumStartCell;0;0;COUNTA(L:L);COUNTA(178:178))"]
[1]
[1,null,"... where \"SumStartCell\" is the name of the cell in the upper left corner of the list.\n\nNow still the arguments of COUNTA() must be changed, so that they don't contain a reference to a concrete column letter or row number. That means, we need a possibility to make \"L:L\" and \"178:178\" from the name \"SumStartCell\" of the upper left corner of the list. Indeed that's possible - but very complicated. Therefore we will use again the OFFSET() function! Excel can manage a maximum of about 1.000.000 rows and about 16.000 columns. Therefore we write the range definition as follows:"]
[1]
[1]
[1]
[1]
[1]
[1]
[1]
[1,null,"=OFFSET(SumStartCell;0;0;COUNTA(OFFSET(SumStartCell;0;0;1000000;1));COUNTA(OFFSET(SumStartCell;0;0;1;16000)))"]
[1]
[1,null,"That means, we start at the upper left corner of the list and let COUNTA() count as many columns and rows as possible!"]
[1]
[1]
[1]
[1,"Range name","… and now an additional simplification:\nThe formula OFFSET() has become rather complicated. If you need the flexible range, defined with OFFSET(), only once, this is ok. But if you need the flexible range in several different formulas, you have to write the complicated OFFSET() formula several times. Instead of, there is a simplification: Use\n\nFORMULAS / \"Name Manager\" / \"New ...\"\n\nto define a name (e.g. \"SumDataSource\") and enter in \"Refers to\" the above OFFSET() formula.\n\nAfterwards you can use the range name instead of the complicated OFFSET() formula in other formulas. (see example to the right!)"]
[1]
[1]
[1]
[1]
[1]
[1]
[1]
[1]
[1]
[1]
[1]
[1]
[1]
[1,"Approach","After this long, long explanantion you can easily do the following to define a flexible range of cells:\n\n(1) Give a name to the cell in the upper left corner of a data list  (e.g. \"XxxStartCell\")\n(2) Use the name manager to define the following range of cells (e.g. \"XxxDataSource\"):\n\n=OFFSET(XxxStartCell;0;0;COUNTA(OFFSET(XxxStartCell;0;0;1000000;1));COUNTA(OFFSET(XxxStartCell;0;0;1;16000)))\n\n(3) Enter \"XxxDataSource\" as a data source (e.g. of a PivotTable or a diagram).\n\nThat's it! (Examples can be found on the next worksheets)"]
[1]
[1]
[1]
[1]
[1]
[1]
[1]
[1]
[1]
[1]
[]
[]
[]
[]
[]
[]
[]
[]
[]
[]
[]
[]
[]
[]
[]
[]
[]
[]
[]
[]
[]
[]
[]
[]
[]
[]
[]
[]
[]
[]
[]
[]
[0]

{"sheet":"18 Liste fortschreiben (1)","index":35,"n_rows":78,"n_cols":12,"rows_kept":78,"cut":false,"hidden":false,"merged":[[1,1,1,4],[2,1,2,4],[1,7,1,9],[2,7,2,9],[4,3,5,7],[7,3,8,7],[54,3,56,6],[57,3,59,6],[9,3,10,7],[12,3,13,7]]}
[]
[1,"18 Extend a list (1)",null,null,null,"Back to Start"]
[2,"18 Liste fortschreiben (1)",null,null,null,"Startseite"]
[]
[2,null,null,"Hier wird die Funktion BEREICH.VERSCHIEBEN benutzt, um die Datenquelle einer Pivot-Tabelle flexibel zu definieren."]
[2]
[2]
[2,"Achtung",null,"Spalte C und Zeile 16 (gelb markiert) dürfen außer den Listendaten keine weiteren Daten enthalten, sonst zählt die Funktion ANZAHL2() nicht richtig!"]
[2]
[1,null,null,"The function OFFSET() is used here to make a flexible definition of the data source of a PivotTable."]
[1]
[1]
[1,"Attention",null,"Column C and row 16 (marked in yellow)  must not contain any data except the list data - otherwise the function COUNTA doesn't count correctly!"]
[1]
[]
[null,null,"branch","customer","quarter","sales","orders"]
[null,null,"Bremen","Shell",4,66745,138]
[null,null,"Bremen","Shell",3,72436,127]
[null,null,"Bremen","Shell",2,78647,120]
[null,null,"Bremen","Shell",1,80425,111]
[null,null,"Bremen","Esso",1,112536,92]
[null,null,"Bremen","Esso",3,111525,89]
[null,null,"Bremen","Esso",4,124978,96]
[null,null,"Bremen","Esso",2,131845,90]
[null,null,"Hamburg","Shell",1,78176,66]
[null,null,"Hamburg","Shell",3,88111,68]
[null,null,"Hamburg","Shell",2,82789,63]
[null,null,"Hamburg","Shell",4,94512,59]
[null,null,"Hamburg","Esso",3,213999,119]
[null,null,"Hamburg","Esso",2,224924,122]
[null,null,"Hamburg","Aral",3,35712,19]
[null,null,"Hamburg","Esso",1,243890,123]
[null,null,"Hamburg","Aral",1,38523,19]
[null,null,"Hamburg","Aral",4,32677,15]
[null,null,"Hamburg","Aral",2,39467,17]
[null,null,"Oldenburg","Shell",2,112967,92]
[null,null,"Oldenburg","Shell",3,121210,98]
[null,null,"Oldenburg","Aral",1,31243,25]
[null,null,"Oldenburg","Shell",4,119891,94]
[null,null,"Oldenburg","Shell",1,123124,88]
[null,null,"Oldenburg","Aral",2,33756,24]
[null,null,"Oldenburg","Aral",3,38299,21]
[null,null,"Oldenburg","Aral",4,35900,19]
[]
[]
[]
[]
[]
[]
[]
[]
[]
[]
[]
[2,"Neue Daten",null,"Kopieren Sie die vier Zeilen mit den neuen Daten an das untere Ende der obigen Datenliste, klicken Sie mit der Rechten Maustaste in die Pivot-Tabelle und wählen Sie \"Aktualisieren\"!"]
[2]
[2]
[1,"New data",null,"Copy the four rows with new data below the end of the above data list, right click into the PivotTable and select \"Refresh\"!"]
[1]
[1]
[]
[null,null,null,null,null,null,null,"new branche","new customer",1,102312,99]
[null,null,null,null,null,null,null,"new branche","new customer",2,93344,102]
[null,null,null,null,null,null,null,"new branche","new customer",3,89324,89]
[null,null,null,null,null,null,null,"new branche","new customer",4,101234,105]
[2,"Pivot-Tabelle"]
[1,"PivotTable"]
[null,null,null,"quarter","(All)"]
[]
[null,null,null,"total sales","customer"]
[null,null,null,"branch","Aral","Esso","Shell","Grand Total"]
[null,null,null,"Bremen",null,480884,298253,779137]
[null,null,null,"Hamburg",146379,682813,343588,1172780]
[null,null,null,"Oldenburg",139198,null,477192,616390]
[null,null,null,"Grand Total",285577,1163697,1119033,2568307]
[]
[]
[0]

{"sheet":"19 Liste fortschreiben (2)","index":36,"n_rows":79,"n_cols":17,"rows_kept":79,"cut":false,"hidden":false,"merged":[[1,1,1,4],[2,1,2,4],[1,8,1,11],[2,8,2,11],[70,4,72,10],[66,4,69,10],[10,4,18,11],[4,4,8,11],[19,4,23,11],[25,4,33,11]]}
[null,null,null,null,null,null,null,null,null,null,null,null,null,null,null,null,0]
[1,"19 Extend a list (2)",null,null,null,"Back to Start"]
[2,"19 Liste fortschreiben (2)",null,null,null,"Startseite"]
[]
[2,null,null,null,"Hier wird die Funktion BEREICH.VERSCHIEBEN benutzt, um die Datenquelle eines Diagramms flexibel zu definieren.\n\nWieder gilt: Die Spalten C und D und die Zeile 46 (gelb markiert) dürfen außer den Listendaten keine weiteren Daten enthalten, sonst zählt die Funktion ANZAHL2() nicht richtig - ABER:"]
[2]
[2]
[2]
[2]
[2]
[2,"Achtung",null,null,"In diesem speziellen Fall sind einige weitere Besonderheiten zu beachten:\n\nHier müssen für die x-Werte und die y-Werte des Diagramms zwei Bereiche definiert werden.\n\nBei der Definition der Datenquelle für das Diagramm (Rechtsklick / \"Daten auswählen\") muss zusätzlich zum Bereichsnamen der Dateiname angegeben werden!!\n\nDas letzte Argument von BEREICH.VERSCHIEBEN() ist eine 1, weil es sich in diesem speziellen Fall um einspaltige Bereiche handelt!!"]
[2]
[2]
[2]
[2]
[2]
[2]
[2]
[2]
[1,null,null,null,"The function OFFSET() is used here to make a flexible definition of the data source of a Diagram.\n\nConsider again: Column C and row 46 (marked in yellow) must not contain any data except the list data - otherwise the function COUNTA() doesn't count correctly!"]
[1]
[1]
[1]
[1]
[1]
[1,"Attention",null,null,"In this special case some more peculiarities must be considered:\n\nHere you must define two ranges of cells for the x and y values of the diagram, respectively!\n\nFor the definition of the data source of the diagram (right click / \"Select Data\") the file name must be entered in addition to the range name!!\n\nThe last argument of OFFSETT() is a 1, because in this sepcial case the ranges have only one column!!"]
[1]
[1]
[1]
[1]
[1]
[1]
[1]
[1]
[]
[]
[]
[]
[]
[]
[]
[]
[]
[]
[null,null,"customer","turnover"]
[null,null,"A",3969]
[null,null,"B",3439]
[null,null,"C",4485]
[null,null,"D",3534]
[null,null,"E",4787]
[]
[null,null,null,null,null,null,null,null,null,null,null,"F",2536]
[null,null,null,null,null,null,null,null,null,null,null,"G",4264]
[null,null,null,null,null,null,null,null,null,null,null,"H",3118]
[]
[]
[]
[]
[]
[]
[]
[]
[]
[]
[]
[]
[2,"Neue Daten",null,null,"Wenn Sie die drei Zeilen mit den neuen Daten an das untere Ende der obigen Datenliste kopieren, wird das Diagramm automatisch aktualisiert!"]
[2]
[2]
[2]
[1,"New Data",null,null,"If you copy the three rows with new data below the end of the above data list, the chart is updated automatically!"]
[1]
[1]
[]
[]
[]
[]
[]
[0]

{"sheet":"20 Liste fortschreiben (3)","index":37,"n_rows":133,"n_cols":11,"rows_kept":133,"cut":false,"hidden":false,"merged":[[1,8,1,10],[2,8,2,10],[1,1,1,4],[2,1,2,4],[124,3,124,7],[98,3,98,4],[99,3,99,4],[100,3,100,4],[101,3,101,4],[122,3,122,7],[123,3,123,7],[4,2,9,6],[73,5,73,12],[70,5,70,12],[91,5,91,17],[11,3,21,8],[32,3,43,8],[45,3,45,4],[23,5,23,6],[26,5,26,6],[45,5,45,6],[24,3,24,4],[26,3,26,4],[27,3,27,4],[24,5,24,16],[27,5,27,16],[23,3,23,4],[29,3,30,8],[46,3,46,4],[48,3,48,4],[49,3,49,4],[46,5,46,21],[49,5,49,21],[48,5,48,6],[51,2,56,6],[58,3,67,8],[69,3,69,4],[69,5,69,6],[70,3,70,4],[72,3,72,4],[72,5,72,6],[73,3,73,4],[78,3,88,8],[75,3,76,8],[94,3,94,4],[90,3,90,4],[90,5,90,6],[91,3,91,4],[93,3,93,4],[93,5,93,6],[94,5,94,17]]}
[null,null,null,null,null,null,null,null,null,null,0]
[1,"20 Extend a list (3)",null,null,null,"Back to Start"]
[2,"20 Liste fortschreiben (3)",null,null,null,"Startseite"]
[]
[2,null,"Hier wird die Funktion BEREICH.VERSCHIEBEN benutzt, um \n\n(1) die Datenquelle einer Datenüberprüfung und\n(2) den Suchbereich eines SVERWEISes \n\nflexibel zu definieren. Bitte sehen Sie sich das an, indem Sie …"]
[2]
[2]
[2]
[2]
[2]
[2]
[2,null,"(1)","... eine der orange gefärbten Zellen anklicken und dann\n\n\"Daten\" / \"Datentools\" /  \"Datenüberprüfung\" / \"Datenüberprüfung\"\n\nwählen. Dort finden Sie unter \"Einstellungen\" / \"Quelle\" den Namen des jeweiligen Datenbereiches (\"Companies_names\" bzw. \"Goods_names\"). Klicken Sie anschließend auf\n\n\"Formeln\" / \"Definierte Namen\" / \"Namens-Manager\"\n\num sich anzusehen, wie diese Bereiche definiert sind:"]
[2]
[2]
[2]
[2]
[2]
[2]
[2]
[2]
[2]
[2]
[2]
[2,null,null,"CompaniesStartCell:",null,"=Firmen!$C$7"]
[2,null,null,"Companies_names:",null,"=BEREICH.VERSCHIEBEN(CompaniesStartCell;0;0;ANZAHL2(BEREICH.VERSCHIEBEN(CompaniesStartCell;0;0;1000000;1));1)"]
[2]
[2,null,null,"GoodsStartCell:",null,"=Waren!$C$7"]
[2,null,null,"Goods_names:",null,"=BEREICH.VERSCHIEBEN(GoodsStartCell;0;0;ANZAHL2(BEREICH.VERSCHIEBEN(GoodsStartCell;0;0;1000000;1));1)"]
[2]
[2,"Achtung",null,"Das letzte Argument von BEREICH.VERSCHIEBEN() ist eine 1, weil es sich in diesem speziellen Fall um einen einspaltigen Bereich handelt!!"]
[2]
[2]
[2,null,"(2)","... eine der gelb gefärbten Zellen anklicken und sich die darin enthaltene SVERWEIS-Formel ansehen:\n\n(1) z.B. =SVERWEIS(D46;Companies;4;FALSCH)\n\n(2) z.B. =WENN(E53<>\"\";SVERWEIS(E53;Goods;2;FALSCH);\"\")\n\nKlicken Sie anschließend auf\n\nFORMELN / \"Definierte Namen\" / \"Namens-Manager\"\n\num sich anzusehen, wie diese Bereiche definiert sind"]
[2]
[2]
[2]
[2]
[2]
[2]
[2]
[2]
[2]
[2]
[2]
[2]
[2,null,null,"CompaniesStartCell:",null,"=Firmen!$C$7"]
[2,null,null,"Companies:",null,"=BEREICH.VERSCHIEBEN(CompaniesStartCell;0;0;ANZAHL2(BEREICH.VERSCHIEBEN(CompaniesStartCell;0;0;1000000;1));ANZAHL2(BEREICH.VERSCHIEBEN(CompaniesStartCell;0;0;1;16000)))"]
[2]
[2,null,null,"GoodsStartCell:",null,"=Waren!$C$7"]
[2,null,null,"Goods:",null,"=BEREICH.VERSCHIEBEN(GoodsStartCell;0;0;ANZAHL2(BEREICH.VERSCHIEBEN(GoodsStartCell;0;0;1000000;1));ANZAHL2(BEREICH.VERSCHIEBEN(GoodsStartCell;0;0;1;16000)))"]
[]
[1,null,"Here the function OFFSET() is used to make a flexible definition of  \n\n(1) the data source for a data validation and\n(2) the search range of a VLOOKUP() \n\nPlease have a look at this by …"]
[1]
[1]
[1]
[1]
[1]
[1]
[1,null,"(1)","... clicking into one of the orange cells and selecting\n\n\"Data\" / \"Data Tools\" /  \"Data Validation\" / \"Data Validation\"\n\nThere you will find the name of the data range (\"Companies_names\" / \"Goods_names\") under \"Settings\" / \"Source\". Then click to\n\n\"Formulas\" / \"Defined Names\" / \"Name Manager\"\n\nto see, how these ranges are defined:"]
[1]
[1]
[1]
[1]
[1]
[1]
[1]
[1]
[1]
[1]
[1,null,null,"CompaniesStartCell:",null,"=Companies!$C$7"]
[1,null,null,"Companies_names:",null,"=OFFSET(CompaniesStartCell;0;0;COUNTA(OFFSET(CompaniesStartCell;0;0;1000000;1));1)"]
[1]
[1,null,null,"GoodsStartCell:",null,"=Goods!$C$7"]
[1,null,null,"Goods_names:",null,"=OFFSET(GoodsStartCell;0;0;COUNTA(OFFSET(GoodsStartCell;0;0;1000000;1));1)"]
[1]
[1,"Attention",null,"The last argument of OFFSET() is a 1, because in this special case the range has only one column!"]
[1]
[1]
[1,null,"(2)","... clicking into one of the yellow cells and looking at the VLOOKUP formula therein:\n\n(1) e.g. =VLOOKUP(D93;Companies;4;FALSE)\n\n(2) e.g. =IF(E53<>\"\";VLOOKUP(E53;Goods;2;FALSE);\"\")\n\nThen click at\n\nFORMULAS / \"Defined Names\" / \"Name Manager\"\n\nto see, how these ranges are defined:"]
[1]
[1]
[1]
[1]
[1]
[1]
[1]
[1]
[1]
[1]
[1]
[1,null,null,"CompaniesStartCell:",null,"=Companies!$C$7"]
[1,null,null,"Companies:",null,"=OFFSET(CompaniesStartCell;0;0;COUNTA(OFFSET(CompaniesStartCell;0;0;1000000;1));COUNTA(OFFSET(CompaniesStartCell;0;0;1;16000)))"]
[1]
[1,null,null,"GoodsStartCell:",null,"=Goods!$C$7"]
[1,null,null,"Goods:",null,"=OFFSET(GoodsStartCell;0;0;COUNTA(OFFSET(GoodsStartCell;0;0;1000000;1));COUNTA(OFFSET(GoodsStartCell;0;0;1;16000)))"]
[]
[]
[]
[null,null,null,"Save-a-lot Markets"]
[null,null,null,{"$f":"VLOOKUP(D99,Companies,2,FALSE)&\" \"&VLOOKUP(D99,Companies,3,FALSE)","v":"Ms Isabella Hanson"}]
[null,null,null,{"$f":"VLOOKUP(D99,Companies,4,FALSE)","v":"East Av. 666"}]
[null,null,null,{"$f":"VLOOKUP(D99,Companies,5,FALSE)&\" \"&VLOOKUP(D99,Companies,6,FALSE)","v":"LA9 PX8 Hedge End"}]
[]
[]
[null,null,null,"Good nr.","Good name","Net price","per","Amount","Total net"]
[null,null,null,{"$f":"IF(E106<>\"\",VLOOKUP(E106,Goods,2,FALSE),\"\")","v":"111-001"},"Planks",{"$f":"IF(E106<>\"\",VLOOKUP(E106,Goods,3,FALSE),\"\")","v":1.99},{"$f":"IF(E106<>\"\",VLOOKUP(E106,Goods,4,FALSE),\"\")","v":"meter"},2,{"$f":"IF(H106<>\"\",F106*H106,\"\")","v":3.98}]
[null,null,null,"444-001","Nails, 40 mm",2.99,"kg",15,44.85]
[null,null,null,"222-001","Green color",4.99,"liter",8,39.92]
[null,null,null,"222-002","Red color",4.99,"liter",6,29.94]
[null,null,null,"333-001","Pushcart",24.99,"item",1,24.99]
[null,null,null,"444-002","Nails, 60 mm",3.49,"kg",4.5,15.705000000000002]
[null,null,null,"111-001","Planks",1.99,"meter",5,9.9499999999999993]
[null,null,null,"",null,"","",null,""]
[null,null,null,"",null,"","",null,""]
[null,null,null,"",null,"","",null,""]
[null,null,null,"",null,"","",null,""]
[null,null,null,"",null,"","",null,""]
[null,null,null,"",null,"","",null,""]
[null,null,null,"",null,"","",null,""]
[null,null,null,"",null,"","",null,""]
[null,null,null,"",null,"","",null,""]
[null,null,null,"",null,"","",null,""]
[null,null,null,"Total price net",null,null,null,null,{"$f":"SUM(I106:I122)","v":169.33500000000001}]
[null,null,null,"VAT",null,null,null,null,{"$f":"I123*F128","v":32.173650000000002}]
[null,null,null,"Total price gross",null,null,null,null,{"$f":"I124+I123","v":201.50865000000002}]
[]
[]
[null,null,null,null,"VAT:",0.19]
[]
[]
[]
[]
[0]

{"sheet":"21 Liste fortschreiben (4)","index":38,"n_rows":69,"n_cols":14,"rows_kept":69,"cut":false,"hidden":false,"merged":[[55,2,59,7],[60,2,65,7],[23,2,28,7],[29,2,35,7],[1,1,1,4],[2,1,2,4],[8,2,11,7],[4,2,7,7]]}
[null,null,null,null,null,0]
[1,"21 Extend a list (4)",null,null,null,"Back to Start"]
[2,"21 Liste fortschreiben (4)",null,null,null,"Startseite"]
[]
[1,null,"Here the OFFSET() function is used for a flexible definition of the data source of two lists, which depend from each other. For example, the first list shall contain the continents and the second list the correspnding countries:"]
[1]
[1]
[1]
[2,null,"Hier wird die Funktion BEREICH.VERSCHIEBEN benutzt, um die Datenquellen zweier abhängiger Listen flexibel zu definieren. In der ersten Liste sollen z.B. die Kontinente erscheinen, in der zweiten Liste die jeweils dazugehörigen Länder:"]
[2]
[2]
[2]
[]
[1,null,"continent:",null,"country:"]
[2,null,"Kontinent:",null,"Land:"]
[null,null,"America",null,"USA",null,null,null,null,"Europe","Asia","Africa","America","Australia"]
[null,null,null,null,null,null,null,null,null,"Germany","Russia","Maroc","Canada","Australia"]
[null,null,null,null,null,null,null,null,null,"Great Britain","China","Algeria","USA","New Zeeland"]
[null,null,null,null,null,null,null,null,null,"France","India","Tunesia","Mexiko"]
[null,null,null,null,null,null,null,null,null,"Spain","Japan","Egypt"]
[null,null,null,null,null,null,null,null,null,"Italy","Nepal"]
[null,null,null,null,null,null,null,null,null,"Danmark"]
[]
[1,null,"The drop down fields are generated with\n\"Data\" / \"Data Tools\" /  \"Data Validation\" / \"Data Validation\"\nwhere \"Allow = List\" is selected. The list of continents is fixed. But the list of countries depends on the selection made in the list of continents. Therefore the following function is used:\n=CHOOSE(MATCH(C16;$J$16:$N$16;);Europe;Asia;Africa;America;Australia)"]
[1]
[1]
[1]
[1]
[1]
[2,null,"Die Drop-Down-Felder werden mittels \n\"Daten\" / \"Datentools\" /  \"Datenüberprüfung\" / \"Datenüberprüfung\"\nerstellt, indem dort \"Zulassen = Liste\" ausgewählt wird. Die Liste der Kontinente ist fest definiert. Die Liste der Länder dagegen hängt davon ab, welcher Kontinent in der ersten Liste ausgewählt wurde. Daher wird folgende Funktion benutzt:\n=WAHL(VERGLEICH(C16;$J$16:$N$16;);Europe;Asia;Africa;America;Australia)"]
[2]
[2]
[2]
[2]
[2]
[2]
[]
[]
[]
[]
[]
[]
[]
[]
[]
[]
[]
[]
[]
[]
[]
[]
[]
[]
[]
[1,null,"MATCH() looks for a value in a range and gives the sequential number in the range - for example \"4\" for \"America\". CHOOSE() selects the value with this sequential number from a list of values - for example \"America\" for \"4\".\nThe value selected by CHOOSE() (e.g. \"America\") is the name of a range, which was flexibly defined using OFFSET():"]
[1]
[1]
[1]
[1]
[2,null,"VERGLEICH() sucht einen Wert in einem Bereich und liefert als Ergebnis die laufende Nummer im Bereich - also z.B. \"4\" für \"America\". WAHL() wählt dann den Wert mit dieser laufenden Nummer aus einer Werteliste aus - für \"4\" also \"America\".\nDer von WAHL() ausgewählte Wert (z.B. \"America\") ist der Name eines Bereiches, der mit BEREICH.VERSCHIEBEN() flexibel definiert wurde:"]
[2]
[2]
[2]
[2]
[2]
[]
[]
[0]

{"sheet":"22 Liste fortschreiben (5)","index":39,"n_rows":79,"n_cols":8,"rows_kept":79,"cut":false,"hidden":false,"merged":[[1,1,1,4],[2,1,2,4],[35,2,35,3],[36,2,36,3]]}
[null,null,null,null,null,0]
[1,"22 Extend a list (5)",null,null,null,"Back to Start"]
[2,"22 Liste fortschreiben (5)",null,null,null,"Startseite"]
[]
[null,null,"branch","customer","quarter","sales"]
[null,null,"Bremen","Shell",4,66745]
[null,null,"Bremen","Shell",3,72436]
[null,null,"Bremen","Shell",2,78647]
[null,null,"Bremen","Shell",1,80425]
[null,null,"Bremen","Esso",1,112536]
[null,null,"Bremen","Esso",3,111525]
[null,null,"Bremen","Esso",4,124978]
[null,null,"Bremen","Esso",2,131845]
[null,null,"Hamburg","Shell",1,78176]
[null,null,"Hamburg","Shell",3,88111]
[null,null,"Hamburg","Shell",2,82789]
[null,null,"Hamburg","Shell",4,94512]
[null,null,"Hamburg","Esso",3,213999]
[null,null,"Hamburg","Esso",2,224924]
[null,null,"Hamburg","Aral",3,35712]
[null,null,"Hamburg","Esso",1,243890]
[null,null,"Hamburg","Aral",1,38523]
[null,null,"Hamburg","Aral",4,32677]
[null,null,"Hamburg","Aral",2,39467]
[]
[2,"Definition"]
[1,"Definition"]
[]
[2,"Name"]
[1,"Name"]
[]
[2,"Zellbezug"]
[1,"Cell "]
[1,"reference"]
[]
[2,null,"Gesamtumsatz:",null,{"$f":"SUM(tabSales[sales])","v":1951917},{"$f":"_xlfn.FORMULATEXT(E36)","v":"=SUM(tabSales[sales])"}]
[1,null,"Total sales:",null,{"$f":"SUM(tabSales[sales])","v":1951917},{"$f":"_xlfn.FORMULATEXT(E37)","v":"=SUM(tabSales[sales])"}]
[]
[null,null,"branch","customer","quarter","sales",null,"orders"]
[null,null,"Bremen","Shell",4,66745,null,138]
[null,null,"Bremen","Shell",3,72436,null,127]
[null,null,"Bremen","Shell",2,78647,null,120]
[null,null,"Bremen","Shell",1,80425,null,111]
[null,null,"Bremen","Esso",1,112536,null,92]
[null,null,"Bremen","Esso",3,111525,null,89]
[null,null,"Bremen","Esso",4,124978,null,96]
[null,null,"Bremen","Esso",2,131845,null,90]
[null,null,"Hamburg","Shell",1,78176,null,66]
[null,null,"Hamburg","Shell",3,88111,null,68]
[null,null,"Hamburg","Shell",2,82789,null,63]
[null,null,"Hamburg","Shell",4,94512,null,59]
[null,null,"Hamburg","Esso",3,213999,null,119]
[null,null,"Hamburg","Esso",2,224924,null,122]
[null,null,"Hamburg","Aral",3,35712,null,19]
[null,null,"Hamburg","Esso",1,243890,null,123]
[null,null,"Hamburg","Aral",1,38523,null,19]
[null,null,"Hamburg","Aral",4,32677,null,15]
[null,null,"Hamburg","Aral",2,39467,null,17]
[]
[null,null,"Oldenburg","Shell",2,112967,null,92]
[null,null,"Oldenburg","Shell",3,121210,null,98]
[null,null,"Oldenburg","Aral",1,31243,null,25]
[null,null,"Oldenburg","Shell",4,119891,null,94]
[null,null,"Oldenburg","Shell",1,123124,null,88]
[null,null,"Oldenburg","Aral",2,33756,null,24]
[null,null,"Oldenburg","Aral",3,38299,null,21]
[null,null,"Oldenburg","Aral",4,35900,null,19]
[]
[]
[2,"Erweitern"]
[1,"Extend"]
[]
[2,"ACHTUNG"]
[1,"ATTENTION"]
[]
[]
[]
[]
[0]

{"sheet":"22 Liste fortschreiben (5)_","index":40,"n_rows":10,"n_cols":8,"rows_kept":10,"cut":false,"hidden":true,"merged":[]}
[null,2,2,2,1,1,1,0]
[1,"22 Extend a list (5)_",null,null,null,{"$f":"B2","v":"22 Extend a list (5)_"}]
[2,"22 Liste fortschreiben (5)_"]
[0]
[null,1,"Für das Fortschreiben einer Liste gibt es neben der leider ziemlich komplizierten Variante mit BEREICH.VERSCHIEBEN (siehe \"Liste fortschreiben (1) bis (4)\"!) noch eine sehr einfache und komfortable Variante.\n\nDazu gehen wir von folgender Tabelle aus:",null,1,"For updating a list there is a very simple and comfortable variant besides the unfortunately quite complicated variant with OFFSET (see \"Extend a list (1) to (4)\"!).\n\nWe start from the following table:"]
[null,{"$f":"IF(C6<>\"\",B5+1,\"\")","v":2},"DEFINITION:\n\nKlicken Sie an einer beliebigen Stelle in die Tabelle und wählen Sie dann \"Als Tabelle formatieren\" im Menü \"Start\". Das klingt ziemlich kurios - \"eine Tabelle als Tabelle formatieren\". Hat sich Microsoft aber so ausgedacht ...\n\nWählen Sie ein Format, bei dem die Zeilen abwechselnd hell und dunkel gefärbt sind (s.u.). Dann sieht man auf Anhieb, welche Tabelle eine \"Tabelle\" ist.\nDie \"Tabelle\" bekommt automatisch einen Standard-Namen (z.B. \"Tabelle3\"). Da es immer gut ist, Objekten konventionsgerechte, aussagekräftige Namen zu geben, sollten Sie das sofort tun.",null,{"$f":"IF(F6<>\"\",E5+1,\"\")","v":2},"DEFINITION:\n\nClick anywhere in the table, then select \"Format as Table\" from the \"Home\" menu. This sounds rather strange - \"Format a table as a table\". But that's how Microsoft came up with it ...\n\nChoose a format in which the rows are alternately colored light and dark (see below). Then you can immediately see which table is a \"table\".\nThe \"table\" automatically gets a default name (e.g. \"Table3\"). Since it is always good to give objects conventionally appropriate, meaningful names, you should do this immediately."]
[null,{"$f":"IF(C7<>\"\",B6+1,\"\")","v":3},"NAME:\n\nDazu klicken Sie auf \"Formeln / Namens-Manager\". In der Liste wählen Sie den Eintrag mit der gerade definierten \"Tabelle\" aus und klicken dann auf \"Bearbeiten...\". Dort können Sie dann den Namen der \"Tabelle\" ändern - z.B. in \"tabSales\".\n\nACHTUNG: Sie können für eine Tabellendefinition weder den Gültigkeitsbereich noch den Zellbezug ändern. Wenn Sie diese beiden Eigenschaften ändern wollen, müssen Sie die \"Tabelle\" löschen und eine neue \"Tabelle\" anlegen.",null,{"$f":"IF(F7<>\"\",E6+1,\"\")","v":3},"NAME:\n\nTo do this, click on \"Formulas / Name Manager\". In the list, select the entry with the currently defined \"table\" and then click on \"Edit...\". There you can change the name of the \"table\" - e.g. in \"tabSales\".\n\nATTENTION: You can neither change the validity area nor the cell reference for a table definition. If you want to change these two properties, you must delete the \"table\" and create a new \"table\"."]
[null,{"$f":"IF(C8<>\"\",B7+1,\"\")","v":4},"ZELLBEZUG:\n\nUnd jetzt kommt das spannende an einer \"Tabelle\": Wir wollen die Daten aus der \"Tabelle\" für Berechnungen benutzen - zunächst für die einfachste aller Rechnungen - die Summe.\nGeben Sie in einer beliebigen Zelle ein:  =SUMME(\n\nDann markieren Sie mit der Maus die Werte einer Spalte - z.B. \"sales\" im Beispiel unten. Sie werden sehen, dass Excel zunächst einen normalen Zellbezug generiert: linke obere Ecke - Doppelpunkt - rechte untere Ecke. Wenn Sie aber mit der Maus das Ende der \"Tabelle\" erreichen, ändert sich das plötzlich zu\n=SUMME(tabSales[sales])\n\nDie Summe wird also nicht mehr berechnet \"von Zelle bis Zelle\", sondern \"über die Spalte [sales] der Tabelle tabSales\"!\nSie können auch mehrere Spalten markieren: =SUMME(tabSales[[quarter]:[sales]])\nDas ist in diesem Fall natürlich mathematisch sinnlos und soll nur zeigen, wie das dann in der Formel umgesetzt wird.",null,{"$f":"IF(F8<>\"\",E7+1,\"\")","v":4},"CELL REFERENCE:\n\nAnd now comes the exciting thing about a \"table\": We want to use the data from the \"table\" for calculations - first for the simplest of all calculations - the sum.\nEnter in any cell: =SUM(\n\nThen mark the values of a column with the mouse - e.g. \"sales\" in the example below. You will see that Excel first generates a normal cell reference: upper left corner - colon - lower right corner. But if you reach the end of the \"table\" with the mouse, this suddenly changes to\n=SUM(tabSales[sales])\n\nThe sum is no longer calculated \"from cell to cell\", but \"over the column [sales] of the table tabSales\"!\nYou can also select several columns: =SUM(tabSales[[quarter]:[sales]])\nThis is of course mathematically meaningless in this case and should only show how this is then implemented in the formula."]
[null,5,"ERWEITERN:\n\nUnd jetzt kommt der ganz große Vorteil einer \"Tabelle\": Ihre Erweiterbarkeit!\nSie können nämlich an eine vorhandene \"Tabelle\" sowohl Zeilen als auch Spalten anfügen.\nDazu markieren Sie mal im obigen Beispiel die Daten für Oldenburg (ACHTUNG: Nur bis Spalte F!) und ziehen Sie diese eine Zeile hoch. Dann passiert zweierlei:\n\n(1) Die neu angefügten Zeilen werden abwechselnd gefärbt. Daran erkennen Sie, dass sie jetzt zur \"Tabelle\" dazu gehören. Sie können das auch mit \"Formeln / Namens-Manager\" überprüfen.\n\n(2) Die Summe über die Spalte \"sales\" wird neu berechnet. Es kommen jetzt die Oldenburger Daten hinzu. \n\nIn derselben Weise können Sie eine zusätzliche Spalte (z.B. \"orders\") hinzufügen.",null,5,"EXPAND:\n\nAnd now comes the very big advantage of a \"table\": Its expandability!\nYou can add both rows and columns to an existing \"table\".\nIn the example above, select the data for Oldenburg (ATTENTION: Only up to column F!) and drag this one row up. Then two things happen:\n\n(1) The newly added lines are colored alternately. This indicates that they now belong to the \"table\". You can also check this with \"Formulas / Name Manager\".\n\n(2) The sum for the column \"sales\" is recalculated. The Oldenburg data are added now. \n\nIn the same way you can add an additional column (e.g. \"orders\")."]
[null,null,"ACHTUNG - ACHTUNG:\n\n(1) Sie können die hinzugefügten Daten nicht einfach wieder zurückziehen.Wenn Sie das Hinzufügen rückgängig machen wollen, müssen Sie entweder auf \"Rückgängig\" klicken oder die hinzugefügten Zeilen bzw. Spalten löschen (Achtung: Die ganzen ZEILEN bzw. SPALTEN - nicht nur die ZELLEN!!)\n\n(2) Beim Hinzufügen von ZEILEN dürfen Sie nicht MEHR SPALTEN hinzufügen, als es schon gibt. Dann wird die Tabellendefinition nicht erweitert. Markieren Sie dazu einfach mal die Oldenburger Daten inklusive der Leerzellen rechts daneben und ziehen Sie sie nach oben.\nEntsprechendes gilt für die Spalten. Auch das können Sie im obigen Beispiel ausprobieren.\n\n(3) Beim Hinzufügen von ZEILEN dürfen Sie aber WENIGER SPALTEN hinzufügen als es schon gibt. Dann werden die übrigen Spalten mit Leerzellen aufgefüllt.\nEntsprechendes gilt für die Spalten. Auch das können Sie im obigen Beispiel ausprobieren.",null,null,"ATTENTION - ATTENTION:\n\n(1) If you want to undo the addition, you must either click on \"Undo\" or delete the added rows or columns (Attention: The whole ROWS or COLUMNS - not only the CELLS!!).\n\n(2) When adding ROWS, do not add MORE COLUMNS than there already are. Then the table definition is not expanded. Simply mark the Oldenburg data including the empty cells to the right and drag them upwards.\nThe same applies to the columns. You can also try this in the example above.\n\n(3) When adding ROWS, however, you may add FEWER COLUMNS than there already are. Then the remaining columns are filled with blank cells.\nThe same applies to the columns. You can also try this in the example above."]

{"sheet":"Firmen","index":41,"n_rows":33,"n_cols":14,"rows_kept":33,"cut":false,"hidden":false,"merged":[[1,1,1,4],[2,1,2,4],[20,8,23,13],[24,8,27,13]]}
[null,null,null,null,null,null,null,null,0]
[1,"Companies",null,null,null,"Back to Start"]
[2,"Firmen",null,null,null,"Startseite"]
[]
[]
[null,null,"Company","Salutation","Contact person","Address","ZIP code","City"]
[null,null,"Island Trading","Mr","Oliver Young","East Street 111","EC2 5NT","London"]
[null,null,"Around the Horn","Ms","Olivia Brewster","West Av. 222","T2F 8M4","Tsawassen"]
[null,null,"Seven Seas Imports","Ms","Jessica Miller","Middle Boulevard 333",87110,"Albuquerque"]
[null,null,"Eastern Connection","Mr","Charlie Nolan","South Place 444",97201,"Portland"]
[null,null,"Consolidated Holdings","Mr","Thomas Sawyer","North Way 555","H1J 1C3","Montréal"]
[null,null,"Save-a-lot Markets","Ms","Isabella Hanson","East Av. 666","LA9 PX8","Hedge End"]
[null,null,"Old World Delicatessen","Mr","Jack Rodriguez","West Str. 777",83720,"Boise"]
[null,null,"The Big Cheese","Mr","Jacob Wayne","South Place 888",98128,"Seattle"]
[]
[]
[]
[]
[]
[]
[2,null,null,null,null,null,null,null,"Kopieren Sie die drei zusätzlichen Firmen unten ans Ende der Liste. Wechseln Sie dann auf das Arbeitsblatt \"Liste fortschreiben (3)\" und klappen Sie dort im Adressfeld der Beispielrechnung das Kombinationsfeld mit den Firmennamen auf. Sie werden sehen, dass die drei zusätzliche Firmen dann dort erscheinen. Ebenso verschwinden sie dort wieder, wenn Sie sie hier wieder vom Ende der Liste entfernen."]
[2]
[2]
[2]
[1,null,null,null,null,null,null,null,"Copy the three additional companies to the end of the list. Then switch to the worksheet \"Update a list (3)\" and open the combo box with the company names in the example invoice. You will see, that the additional companies appear there. They will disappear, if you delete them here!"]
[1]
[1]
[1]
[]
[null,null,null,null,null,null,null,null,"Split Rail Beer & Ale","Mr","William West","South Avenue 123",97403,"Eugene"]
[null,null,null,null,null,null,null,null,"White Clover Markets","Ms","Sophie Ward","North Street 456",94117,"San Francisco"]
[null,null,null,null,null,null,null,null,"Hungry Coyote Import Store","Mr","James Brown","East Av. 789",5022,"San Cristóbal"]
[0]

{"sheet":"Waren","index":42,"n_rows":43,"n_cols":11,"rows_kept":43,"cut":false,"hidden":false,"merged":[[1,1,1,4],[2,1,2,4],[19,7,23,13],[24,7,28,13]]}
[null,null,null,null,null,null,null,null,0]
[1,"Goods",null,null,null,"Back to Start"]
[2,"Waren",null,null,null,"Startseite"]
[]
[]
[null,null,"Good name","Good nr.","Net price","per"]
[null,null,"Planks","111-001",1.99,"meter",null,"meter"]
[null,null,"Cement","111-002",2.99,"kg",null,"kg"]
[null,null,"Green color","222-001",4.99,"liter",null,"liter"]
[null,null,"Red color","222-002",4.99,"liter",null,"item"]
[null,null,"Pushcart","333-001",24.99,"item"]
[null,null,"Nails, 40 mm","444-001",2.99,"kg"]
[null,null,"Nails, 60 mm","444-002",3.49,"kg"]
[null,null,"Nails, 80 mm","444-003",3.89,"kg"]
[]
[]
[]
[]
[]
[2,null,null,null,null,null,null,"Kopieren Sie die drei zusätzlichen Waren unten ans Ende der Liste. Wechseln Sie dann auf das Arbeitsblatt \"Liste fortschreiben (3)\" und klappen Sie dort in der Warenliste der Beispielrechnung das Kombinationsfeld mit den Warennamen auf. Sie werden sehen, dass die drei zusätzliche Waren dann dort erscheinen. Ebenso verschwinden sie dort wieder, wenn Sie sie hier wieder vom Ende der Liste entfernen."]
[2]
[2]
[2]
[2]
[1,null,null,null,null,null,null,"Copy the three additional goods to the end of the list. Then switch to the worksheet \"Update a list (3)\" and open the combo box with the goods names in the example invoice. You will see, that the additional goods appear there. They will disappear, if you delete them here!"]
[1]
[1]
[1]
[1]
[]
[null,null,null,null,null,null,null,"tube, 50mm","555-001",7.99,"meter"]
[null,null,null,null,null,null,null,"tube, 80mm","555-002",12.99,"meter"]
[null,null,null,null,null,null,null,"tube, 120mm","555-003",15.99,"meter"]
[]
[]
[]
[]
[]
[]
[]
[]
[]
[0]